{"text_format":"1","workbook":"xlsx","n_sheets":8,"sheets":["Building Search","Benchmarks","All Buildings","Commercial Buildings","Healthcare Facility","Educational Institution","Civic, Community & Cultural Ins","Sports & Recreation Centre"],"not_rendered":{"charts":1,"images":0,"macros":0,"external_links":0,"defined_names":11,"comments":0,"pivot_tables":0},"unopened":[],"bounds":{"document_bytes":16777216,"sheet_cells":100000,"rows_first":2000,"rows_last":500,"rows_between":2000,"halvings":0,"cell_chars":16384,"cell_head_chars":4096},"cells_cut":0,"cells_raw":0,"read":"whole","date_system":"1900"}

{"sheet":"Building Search","index":0,"n_rows":1160,"n_cols":8,"rows_kept":1160,"cut":false,"hidden":false,"merged":[[1,6,1,7]]}
[]
["Building Name","Building Name",null,null,"Select Building Name",null,"Summary of Building Energy Performance"]
["ERA APAC CENTRE",{"$f":"_xlfn._xlws.FILTER(A3:A1158,ISNUMBER(SEARCH(E3,A3:A1158,1)),\"not found\")","v":"ERA APAC CENTRE"},null,null,null,null,"Building Name",{"$f":"VLOOKUP($E$3,'All Buildings'!$A:$X,MATCH('Building Search'!G3,'All Buildings'!$A$1:$X$1,0),FALSE)","v":{"$error":"#N/A"}}]
["NEXUS @ONE-NORTH","NEXUS @ONE-NORTH",null,null,null,null,"Address",{"$f":"VLOOKUP($E$3,'All Buildings'!$A:$X,MATCH('Building Search'!G4,'All Buildings'!$A$1:$X$1,0),FALSE)","v":{"$error":"#N/A"}}]
["21 JURONG EAST STREET 31","21 JURONG EAST STREET 31",null,null,null,null,"Main Function",{"$f":"VLOOKUP($E$3,'All Buildings'!$A:$X,MATCH('Building Search'!G5,'All Buildings'!$A$1:$X$1,0),FALSE)","v":{"$error":"#N/A"}}]
["BISHAN SPORTS HALL","BISHAN SPORTS HALL",null,null,null,null,"Building Size",{"$f":"VLOOKUP($E$3,'All Buildings'!$A:$X,MATCH('Building Search'!G6,'All Buildings'!$A$1:$X$1,0),FALSE)","v":{"$error":"#N/A"}}]
["TUV SUD PSB BUILDING","TUV SUD PSB BUILDING",null,null,null,null,"2020 EUI",{"$f":"VLOOKUP($E$3,'All Buildings'!$A:$X,MATCH('Building Search'!G7,'All Buildings'!$A$1:$X$1,0),FALSE)","v":{"$error":"#N/A"}}]
["HDB CENTRE OF BUILDING RESEARCH","HDB CENTRE OF BUILDING RESEARCH",null,null,null,null,"2020 EUI Quartile/ Energy Ranking",{"$f":"VLOOKUP($E$3,'All Buildings'!$A:$X,MATCH('Building Search'!G8,'All Buildings'!$A$1:$X$1,0),FALSE)","v":{"$error":"#N/A"}}]
{"$rows_left_out":1153}
{"sheet":"Benchmarks","index":1,"n_rows":19,"n_cols":22,"rows_kept":19,"cut":false,"hidden":true,"merged":[[7,0,8,0],[1,0,2,0],[1,1,2,1],[1,3,1,6],[4,0,5,0]]}
[]
["Building Type","Size*",null,"EUI Ranges (kWh/m².yr)",null,null,null,null,null,null,null,""]
[null,null,null,"Top Quartile","2nd Quartile","3rd Quartile","Bottom Quartile"]
[null,null,null,"(1% - 25%)","(26% - 50%)","(51% - 75%)","(76% - 100%)"]
["Office Buildings","Large",null,"≤122","122 - 160","160 - 206",">206"]
[null,"Small",null,"≤109","109 - 155","155 - 215",">215"]
["Hotels","All",null,"≤199","199 - 232","232 - 284",">284"]
["Retail Buildings","Large",null,"≤189","189 - 367","367 - 472",">472"]
{"$rows_left_out":12}
{"sheet":"All Buildings","index":2,"n_rows":1129,"n_cols":24,"rows_kept":1129,"cut":false,"hidden":true,"merged":[]}
["Building Name","Address","Building Type","Main Function","Building Size","TOP/CSC Year","Award (Green/Non-Green)","Year of GM Award","Green Mark Version","GFA","AC Area","AC Area Percentage","No. Of Hotel Room","AC Type","Age  of Chiller","Air-con system efficiency (kW/RT)","Date of Last Audit/Health Check","2020 EUI","2020 EUI Quartile/ Energy Ranking","2021 EUI","2021 EUI Quartile/ Energy Ranking","2022 EUI","2022 EUI Quartile/ Energy Ranking","Reason for High EUI (if any)"]
["EQUINIX SG3 DATA CENTRE","26A AYER RAJAH CRESCENT, SINGAPORE 139963","Commercial Building","Office","Large",2015,"Platinum",2022,"Existing Data Centres",35218,28536,0.81026747685842471,0,"Water Cooled Chilled Water Plant",7,0.74399999999999999,"2023-05-03",3724.675904367085,{"$f":"IFERROR(IF(R2<=VLOOKUP($D2&$E2,Benchmarks!$S$14:$V$19,2,FALSE),\"Top Quartile\",IF(R2<=VLOOKUP($D2&$E2,Benchmarks!$S$14:$V$19,3,FALSE),\"2nd Quartile\",IF(R2<=VLOOKUP($D2&$E2,Benchmarks!$S$14:$V$19,4,FALSE),\"3rd Quartile\",IF(R2>VLOOKUP($D2&$E2,Benchmarks!$S$14:$V$19,4,FALSE),\"Bottom Quartile\",\"\")))),\"\")","v":"Bottom Quartile"},4453.2057754557327,{"$f":"IFERROR(IF(T2<=VLOOKUP($D2&$E2,Benchmarks!$K$14:$N$19,2,FALSE),\"Top Quartile\",IF(T2<=VLOOKUP($D2&$E2,Benchmarks!$K$14:$N$19,3,FALSE),\"2nd Quartile\",IF(T2<=VLOOKUP($D2&$E2,Benchmarks!$K$14:$N$19,4,FALSE),\"3rd Quartile\",IF(T2>VLOOKUP($D2&$E2,Benchmarks!$K$14:$N$19,4,FALSE),\"Bottom Quartile\",\"\")))),\"\")","v":"Bottom Quartile"},4579.5895280822306,{"$f":"IFERROR(IF(V2<=VLOOKUP($D2&$E2,Benchmarks!$C$14:$F$19,2,FALSE),\"Top Quartile\",IF(V2<=VLOOKUP($D2&$E2,Benchmarks!$C$14:$F$19,3,FALSE),\"2nd Quartile\",IF(V2<=VLOOKUP($D2&$E2,Benchmarks!$C$14:$F$19,4,FALSE),\"3rd Quartile\",IF(V2>VLOOKUP($D2&$E2,Benchmarks!$C$14:$F$19,4,FALSE),\"Bottom Quartile\",\"\")))),\"\")","v":"Bottom Quartile"},"Office Building with Non-Typical Activity (e.g. Industrial Function)"]
["BLK 20 ARC","BLK 20 AYER RAJAH CRESCENT, SINGAPORE 139964","Commercial Building","Office","Large",1999,null,null,null,38349,20000,0.52152598503220426,0,"Water Cooled Chilled Water Plant",20,"","",2043.5498938694616,"Bottom Quartile",2213.9957524316151,"Bottom Quartile",2305.2968651073043,"Bottom Quartile","Office Building with Non-Typical Activity (e.g. Industrial Function)"]
["SYNTHESIS","6 FUSIONOPOLIS WAY, SINGAPORE 138636","Commercial Building","Office","Large",2014,"Platinum",2020,"New Building for Non-Residential buildings (version 3)",19173,19173,1,0,"Water Cooled Chilled Water Plant",5,0.57799999999999996,"2023-02-20",1157.4027538726334,"Bottom Quartile",1182.1218119230168,"Bottom Quartile",1150.5562900954467,"Bottom Quartile","Office Building with Non-Typical Activity (e.g. Industrial Function)"]
["DSO NATIONAL LABORATORIES","20 SCIENCE PARK DRIVE, SINGAPORE 118230","Commercial Building","Office","Large",1986,null,null,null,15819.43,12724,0.80432733669923628,0,"Water Cooled Chilled Water Plant","","","",553.08993434023853,"Bottom Quartile",660.88190282456446,"Bottom Quartile",805.35280032213552,"Bottom Quartile"]
["UOB ALEXANDRA BUILDING","396 ALEXANDRA ROAD, SINGAPORE 119954","Commercial Building","Office","Large",1995,"GoldPlus",2022,"Existing Building for Non-Residential buildings (version 3)",30469,22476,0.73766779349502776,0,"Water Cooled Chilled Water Plant",8,0.58199999999999996,"2021-10-01",712.94639633726081,"Bottom Quartile",712.22323935803604,"Bottom Quartile",723.91930322622989,"Bottom Quartile","Office Building with Non-Typical Activity (e.g. Industrial Function)"]
["TELEPARK","5 TAMPINES CENTRAL 6, SINGAPORE 529482","Commercial Building","Office","Large",1995,null,null,null,31179,21500,0.68956669553224925,0,"Water Cooled Chilled Water Plant",27,"","",790.92122903236157,"Bottom Quartile",753.6836332146637,"Bottom Quartile",695.23615253856758,"Bottom Quartile","Office Building with Non-Typical Activity (e.g. Industrial Function)"]
["HELIOS","11 BIOPOLIS WAY, SINGAPORE 138667","Commercial Building","Office","Large",2008,"GoldPlus",2016,"Existing Building for Non-Residential buildings (version 3)",36007,25895,0.71916571777709892,0,"District Cooling System (DCS)","",0.05,"2010-08-01",641.82718985578492,null,649.48149154843838,null,658.71549696820716]
{"$rows_left_out":1122}
{"sheet":"Commercial Buildings","index":3,"n_rows":760,"n_cols":24,"rows_kept":760,"cut":false,"hidden":false,"merged":[]}
["Building Name","Address","Building Type","Main Function","Building Size","2020 EUI","2020 EUI Quartile/ Energy Ranking","2021 EUI","2021 EUI Quartile/ Energy Ranking","2022 EUI","2022 EUI Quartile/ Energy Ranking","TOP/CSC Year","Award (Green/Non-Green)","Year of GM Award","Green Mark Version","GFA","AC Area","AC Area Percentage","No. Of Hotel Room","AC Type","Age  of Chiller","Air-con system efficiency (kW/RT)","Date of Last Audit/Health Check","Reason for High EUI (if any)"]
["EQUINIX SG3 DATA CENTRE","26A AYER RAJAH CRESCENT, SINGAPORE 139963","Commercial Building","Office","Large",3724.675904367085,{"$f":"IFERROR(IF(F2<=VLOOKUP($D2&$E2,Benchmarks!$S$14:$V$19,2,FALSE),\"Top Quartile\",IF(F2<=VLOOKUP($D2&$E2,Benchmarks!$S$14:$V$19,3,FALSE),\"2nd Quartile\",IF(F2<=VLOOKUP($D2&$E2,Benchmarks!$S$14:$V$19,4,FALSE),\"3rd Quartile\",IF(F2>VLOOKUP($D2&$E2,Benchmarks!$S$14:$V$19,4,FALSE),\"Bottom Quartile\",\"\")))),\"\")","v":"Bottom Quartile"},4453.2057754557327,{"$f":"IFERROR(IF(H2<=VLOOKUP($D2&$E2,Benchmarks!$K$14:$N$19,2,FALSE),\"Top Quartile\",IF(H2<=VLOOKUP($D2&$E2,Benchmarks!$K$14:$N$19,3,FALSE),\"2nd Quartile\",IF(H2<=VLOOKUP($D2&$E2,Benchmarks!$K$14:$N$19,4,FALSE),\"3rd Quartile\",IF(H2>VLOOKUP($D2&$E2,Benchmarks!$K$14:$N$19,4,FALSE),\"Bottom Quartile\",\"\")))),\"\")","v":"Bottom Quartile"},4579.5895280822306,{"$f":"IFERROR(IF(J2<=VLOOKUP($D2&$E2,Benchmarks!$C$14:$F$19,2,FALSE),\"Top Quartile\",IF(J2<=VLOOKUP($D2&$E2,Benchmarks!$C$14:$F$19,3,FALSE),\"2nd Quartile\",IF(J2<=VLOOKUP($D2&$E2,Benchmarks!$C$14:$F$19,4,FALSE),\"3rd Quartile\",IF(J2>VLOOKUP($D2&$E2,Benchmarks!$C$14:$F$19,4,FALSE),\"Bottom Quartile\",\"\")))),\"\")","v":"Bottom Quartile"},2015,"Platinum",2022,"Existing Data Centres",35218,28536,0.81026747685842471,0,"Water Cooled Chilled Water Plant",7,0.74399999999999999,"2023-05-03","Office Building with Non-Typical Activity (e.g. Industrial Function)"]
["BLK 20 ARC","BLK 20 AYER RAJAH CRESCENT, SINGAPORE 139964","Commercial Building","Office","Large",2043.5498938694616,"Bottom Quartile",2213.9957524316151,"Bottom Quartile",2305.2968651073043,"Bottom Quartile",1999,null,null,null,38349,20000,0.52152598503220426,0,"Water Cooled Chilled Water Plant",20,"","","Office Building with Non-Typical Activity (e.g. Industrial Function)"]
["SYNTHESIS","6 FUSIONOPOLIS WAY, SINGAPORE 138636","Commercial Building","Office","Large",1157.4027538726334,"Bottom Quartile",1182.1218119230168,"Bottom Quartile",1150.5562900954467,"Bottom Quartile",2014,"Platinum",2020,"New Building for Non-Residential buildings (version 3)",19173,19173,1,0,"Water Cooled Chilled Water Plant",5,0.57799999999999996,"2023-02-20","Office Building with Non-Typical Activity (e.g. Industrial Function)"]
["DSO NATIONAL LABORATORIES","20 SCIENCE PARK DRIVE, SINGAPORE 118230","Commercial Building","Office","Large",553.08993434023853,"Bottom Quartile",660.88190282456446,"Bottom Quartile",805.35280032213552,"Bottom Quartile",1986,null,null,null,15819.43,12724,0.80432733669923628,0,"Water Cooled Chilled Water Plant","","",""]
["UOB ALEXANDRA BUILDING","396 ALEXANDRA ROAD, SINGAPORE 119954","Commercial Building","Office","Large",712.94639633726081,"Bottom Quartile",712.22323935803604,"Bottom Quartile",723.91930322622989,"Bottom Quartile",1995,"GoldPlus",2022,"Existing Building for Non-Residential buildings (version 3)",30469,22476,0.73766779349502776,0,"Water Cooled Chilled Water Plant",8,0.58199999999999996,"2021-10-01","Office Building with Non-Typical Activity (e.g. Industrial Function)"]
["TELEPARK","5 TAMPINES CENTRAL 6, SINGAPORE 529482","Commercial Building","Office","Large",790.92122903236157,"Bottom Quartile",753.6836332146637,"Bottom Quartile",695.23615253856758,"Bottom Quartile",1995,null,null,null,31179,21500,0.68956669553224925,0,"Water Cooled Chilled Water Plant",27,"","","Office Building with Non-Typical Activity (e.g. Industrial Function)"]
["HELIOS","11 BIOPOLIS WAY, SINGAPORE 138667","Commercial Building","Office","Large",641.82718985578492,null,649.48149154843838,null,658.71549696820716,null,2008,"GoldPlus",2016,"Existing Building for Non-Residential buildings (version 3)",36007,25895,0.71916571777709892,0,"District Cooling System (DCS)","",0.05,"2010-08-01"]
{"$rows_left_out":753}
{"sheet":"Healthcare Facility","index":4,"n_rows":86,"n_cols":24,"rows_kept":86,"cut":false,"hidden":false,"merged":[]}
["Building Name","Address","Building Type","Main Function","Building Size","2020 EUI","2020 EUI Quartile/ Energy Ranking","2021 EUI","2021 EUI Quartile/ Energy Ranking","2022 EUI","2022 EUI Quartile/ Energy Ranking","TOP/CSC Year","Award (Green/Non-Green)","Year of GM Award","Green Mark Version","GFA","AC Area","AC Area Percentage","No. Of Hotel Room","AC Type","Age  of Chiller","Air-con system efficiency (kW/RT)","Date of Last Audit/Health Check","Reason for High EUI (if any)"]
["SINGAPORE GENERAL HOSPITAL","10 HOSPITAL BOULEVARD #19-01 SINGAPORE 168582, SINGAPORE 169608","Healthcare Facility","Hospital",null,639.8813059043573,17,618.64994986000477,17,594.8096055663359,17,1981,null,null,null,172666.55,164580,0.95316666719755516,0,"Water Cooled Chilled Water Plant",23,1.48,"2022-08-24"]
["GLENEAGLES HOSPITAL","6A NAPIER ROAD, SINGAPORE 258500, SINGAPORE 258500","Healthcare Facility","Hospital",null,392.12378382217173,16,416.20137064128966,16,406.84988045356624,16,1993,null,null,null,42243,42243,1,0,"Water Cooled Chilled Water Plant",11,"",""]
["PARKWAY EAST HOSPITAL","321 JOO CHIAT PLACE, SINGAPORE 427990","Healthcare Facility","Hospital",null,386.47030653083499,15,402.94108149899944,15,396.12744042204838,15,1979,null,null,null,10994,10763,0.97898853920320172,0,"Water Cooled Chilled Water Plant",10,"",""]
["KK WOMEN'S AND CHILDREN'S HOSPITAL","100 BUKIT TIMAH ROAD, SINGAPORE 229899","Healthcare Facility","Hospital",null,331.64862935694464,11,355.33990985355211,12,365.48181030749242,14,1997,null,null,null,124686,81768,0.65579134786583904,0,"Water Cooled Chilled Water Plant",12,0.99,"2014-01-31"]
["TAN TOCK SENG HOSPITAL","11 JALAN TAN TOCK SENG, SINGAPORE 308433","Healthcare Facility","Hospital",null,329.71364880190612,10,357.94541670568407,14,361.78129709398507,13,1999,"Platinum",2006,"Existing Building (version 1)",179917,148371,0.82466359487986129,1200,"Water Cooled Chilled Water Plant",24,0.8,"2021-04-27"]
["MOUNT ELIZABETH NOVENA HOSPITAL","38 IRRAWADDY ROAD, SINGAPORE 329563","Healthcare Facility","Hospital",null,361.12973152321177,14,357.8181353167252,13,348.80325987778912,12,2012,"Platinum",2019,"New Building for Non-Residential buildings (version 3)",72334,70000,0.96773301628556418,333,"Water Cooled Chilled Water Plant",10,"",""]
["MOUNT ELIZABETH HOSPITAL","3 MOUNT ELIZABETH, SINGAPORE 228510","Healthcare Facility","Hospital",null,350.1219667132512,12,346.93264606058403,10,344.02119897635077,11,1979,null,null,null,55097,54958,0.99747717661578672,284,"Water Cooled Chilled Water Plant",4,"",""]
{"$rows_left_out":79}
{"sheet":"Educational Institution","index":5,"n_rows":148,"n_cols":24,"rows_kept":148,"cut":false,"hidden":false,"merged":[]}
["Building Name","Address","Building Type","Main Function","Building Size","2020 EUI","2020 EUI Quartile/ Energy Ranking","2021 EUI","2021 EUI Quartile/ Energy Ranking","2022 EUI","2022 EUI Quartile/ Energy Ranking","TOP/CSC Year","Award (Green/Non-Green)","Year of GM Award","Green Mark Version","GFA","AC Area","AC Area Percentage","No. Of Hotel Room","AC Type","Age  of Chiller","Air-con system efficiency (kW/RT)","Date of Last Audit/Health Check","Reason for High EUI (if any)"]
["LEE KONG CHIAN SCHOOL OF MEDICINE (CLINICAL SCIENCES BUILDING)","11 MANDALAY ROAD, SINGAPORE 308232","Educational Institution","Univerisity",null,303.63874150564675,11,304.18859036057171,11,293.66086430799737,11,2018,"Platinum",2019,"Existing Building for Non-Residential buildings (version 3)",41351,32462,0.78503542840560081,0,"Water Cooled Chilled Water Plant",2017,0.61399999999999999,"2018-05-04"]
["YONG PUNG HOW SCHOOL OF LAW","55 ARMENIAN STREET, SINGAPORE 179943","Educational Institution","Univerisity",null,123.45335005144032,7,130.13077117626887,7,184.68191915294923,10,2016,null,null,null,23328,1441453,61.790680727023322,0,"Water Cooled Chilled Water Plant",6,0.60699999999999998,"2020-05-20"]
["SINGAPORE INSTITUTE OF TECHNOLOGY (SIT@DOVER)","10 DOVER DRIVE, SINGAPORE 138683","Educational Institution","Univerisity",null,159.37647770534551,9,164.01719217731423,9,182.94126101694917,9,2014,null,null,null,19175,16699,0.87087353324641459,0,"Water Cooled Chilled Water Plant",20,"",""]
["SINGAPORE UNIVERSITY OF TECHNOLOGY & DESIGN (SUTD)","8 SOMAPAH ROAD, SINGAPORE 487372","Educational Institution","Univerisity",null,166.81403425612791,10,174.41539429186076,10,180.09409952325825,8,2014,"GoldPlus",2022,"GM:2021 In Operation",100637,54191,0.53847988314437034,0,"Water Cooled Chilled Water Plant",7,0.65,"2023-06-01"]
["SINGAPORE INSTITUTE OF MANAGEMENT","461 CLEMENTI ROAD, SINGAPORE 599491","Educational Institution","Univerisity",null,146.74902154513003,8,144.10236486486485,8,161.41688551759307,7,1999,null,null,null,78440,74944,0.95543090260071395,0,"Water Cooled Chilled Water Plant",7,0.63200000000000001,"2022-04-28"]
["SINGAPORE INSTITUTE OF MANAGEMENT NAMLY CAMPUS","41 NAMLY AVENUE, SINGAPORE 267616","Educational Institution","Univerisity",null,107.13225678227168,6,125.34228957567325,6,131.91843386664016,6,1988,null,null,null,10063,1503,0.14935903806022061,0,"Water-Cooled Package Units","","",""]
["SINGAPORE MANAGEMENT UNIVERSITY","50 STAMFORD ROAD, SINGAPORE 178899","Educational Institution","Univerisity",null,105.54457049425085,5,110.03095391858247,5,123.57458819239032,5,2005,"Platinum",2018,"Existing Building for Non-Residential buildings (version 3)",102750,69060,0.67211678832116784,0,"Water Cooled Chilled Water Plant",7,0.53,"2021-06-03"]
{"$rows_left_out":141}
{"sheet":"Civic, Community & Cultural Ins","index":6,"n_rows":78,"n_cols":24,"rows_kept":78,"cut":false,"hidden":false,"merged":[]}
["Building Name","Address","Building Type","Main Function","Building Size","2020 EUI","2020 EUI Quartile/ Energy Ranking","2021 EUI","2021 EUI Quartile/ Energy Ranking","2022 EUI","2022 EUI Quartile/ Energy Ranking","TOP/CSC Year","Award (Green/Non-Green)","Year of GM Award","Green Mark Version","GFA","AC Area","AC Area Percentage","No. Of Hotel Room","AC Type","Age  of Chiller","Air-con system efficiency (kW/RT)","Date of Last Audit/Health Check","Reason for High EUI (if any)"]
["POLICE LOGISTICS BASE","1 HEMMANT ROAD, SINGAPORE 438675","Civic, Community & Cultural Institution","Civic Institution",null,122.12228346456693,7,806.92083727034128,14,789.48724146981635,16,1981,null,null,null,7620,1524,0.2,0,"Others","","",""]
["SPEAR BASE","978 UPPER CHANGI ROAD NORTH, SINGAPORE 506977","Civic, Community & Cultural Institution","Civic Institution",null,228.03637383953469,14,258.9016893229238,13,255.93654497805389,15,2005,"Gold",2022,"Existing Non-Residental Buildings ENRB: 2017",6148,3000,0.48796356538711777,0,"Others","","",""]
["CLEMENTI POLICE DIVISION HEADQUARTERS","20 CLEMENTI AVENUE 5, SINGAPORE 129858","Civic, Community & Cultural Institution","Civic Institution",null,224.75166412213741,13,216.50946183206108,11,219.10574809160303,14,1989,null,null,null,7860,6360,0.80916030534351147,0,"Others","","",""]
["TANGLIN POLICE DIVISIONAL HEADQUARTERS","21 KAMPONG JAVA ROAD, SINGAPORE 228892","Civic, Community & Cultural Institution","Civic Institution",null,246.6981858087459,15,226.02643496138245,12,203.14485747624605,13,2000,"Gold",2022,"Existing Non-Residental Buildings ENRB: 2017",17997,15000,0.83347224537422904,0,"Others","","",""]
["AIRPORT POLICE STATION","35 AIRPORT BOULEVARD, SINGAPORE 819645","Civic, Community & Cultural Institution","Civic Institution",null,0,"",0,"",196.02646384663473,12,1999,"Gold",2022,"Existing Non-Residental Buildings ENRB: 2017",9598,5730,0.59699937486976451,0,"Air Cooled Chilled Water Plant","","",""]
["ANG MO KIO POLICE DIVISION HEADQUARTERS","51 ANG MO KIO AVENUE 9, SINGAPORE 569784","Civic, Community & Cultural Institution","Civic Institution",null,210.51629054680259,12,196.67252780352177,10,190.95231464318812,11,1986,"Gold",2020,"Existing Non-Residental Buildings ENRB: 2017",8632,8632,1,0,"Others","","",""]
["POLICE COAST GUARD HQ & POLCOM BUILDING","11 BRANI WAY, SINGAPORE 098658","Civic, Community & Cultural Institution","Civic Institution",null,192.52478615376918,11,181.90150567755489,9,177.98808213696162,10,2006,"Platinum",2019,"Existing Building for Non-Residential buildings (version 3)",39982,13673,0.34197889050072533,0,"Water Cooled Chilled Water Plant",2,0.62,"2019-08-31"]
{"$rows_left_out":71}
{"sheet":"Sports & Recreation Centre","index":7,"n_rows":69,"n_cols":24,"rows_kept":69,"cut":false,"hidden":false,"merged":[]}
["Building Name","Address","Building Type","Main Function","Building Size","2020 EUI","2020 EUI Quartile/ Energy Ranking","2021 EUI","2021 EUI Quartile/ Energy Ranking","2022 EUI","2022 EUI Quartile/ Energy Ranking","TOP/CSC Year","Award (Green/Non-Green)","Year of GM Award","Green Mark Version","GFA","AC Area","AC Area Percentage","No. Of Hotel Room","AC Type","Age  of Chiller","Air-con system efficiency (kW/RT)","Date of Last Audit/Health Check","Reason for High EUI (if any)"]
["CHINESE SWIMMING CLUB","21 AMBER ROAD, SINGAPORE 439870","Sports & Recreation Centre","Sports Complex",null,411.33167759115116,12,461.57699201147074,12,477.76715997541987,12,2010,null,null,null,9764,6205,0.63549774682507165,0,"Others","","",""]
["SENGKANG SPORTS CENTRE","57 ANCHORVALE ROAD, SINGAPORE 544964","Sports & Recreation Centre","Sports Complex",null,198.24990139507705,8,227.1958658973048,11,232.28271857424588,11,2008,"Gold",2022,"Existing Non-Residental Buildings ENRB: 2017",13691,1962,0.14330582134248776,0,"Others","","",""]
["ACTIVESG PASIR RIS SPORTS CENTRE","120 PASIR RIS CENTRAL, SINGAPORE 519640","Sports & Recreation Centre","Sports Complex",null,212.15495338983052,11,205.72212711864407,10,218.04701694915252,10,2011,"GoldPlus",2016,"New Building for Non-Residential buildings (version 3)",11800,1400,0.11864406779661017,0,"Others","","",""]
["QUEENSTOWN SPORT CENTRE","473 STIRLING ROAD S(148948), SINGAPORE 148948","Sports & Recreation Centre","Sports Complex",null,174.49271061093245,7,186.88688102893889,9,182.28805466237941,9,1970,null,null,null,3110,211,6.7845659163987132E-2,0,"Water-Cooled Package Units",null,"",""]
["SINGAPORE SPORTSHUB","3 STADIUM DRIVE, SINGAPORE 397630","Sports & Recreation Centre","Sports Complex",null,200.84158625452861,9,171.93960040695461,8,170.22311973729921,8,2014,"GoldPlus",2012,"New Building for Non-Residential buildings (version 3)",241796,100810,0.41692170259226785,0,"Water Cooled Chilled Water Plant",9,0.73,"2021-05-09"]
["TOA PAYOH SPORT CENTRE","301 LORONG 6 TOA PAYOH, SINGAPORE 319389","Sports & Recreation Centre","Sports Complex",null,204.93061459088358,10,150.52485310260218,7,167.05762161267469,7,1973,null,null,null,13744.7125,2000,0.14551050085623835,0,"District Cooling System (DCS)","","",""]
["SINGAPORE INDOOR STADIUM","2 STADIUM WALK SINGAPORE, 397691","Sports & Recreation Centre","Sports Complex",null,76.737095430563699,4,87.72618863965937,5,123.09149671407856,6,1989,null,null,null,32411,20000,0.61707445003239636,0,"Water Cooled Chilled Water Plant",19,0.91,"2013-02-08"]
{"$rows_left_out":61}