{"text_format":"1","workbook":"xlsx","n_sheets":8,"sheets":["Building Search","Benchmarks","All Buildings","Commercial Buildings","Healthcare Facility","Educational Institution","Civic, Community & Cultural Ins","Sports & Recreation Centre"],"not_rendered":{"charts":1,"images":0,"macros":0,"external_links":0,"defined_names":11,"comments":0,"pivot_tables":0},"unopened":[],"bounds":{"document_bytes":16777216,"sheet_cells":100000,"rows_first":2000,"rows_last":500,"rows_between":2000,"halvings":0,"cell_chars":16384,"cell_head_chars":4096},"cells_cut":0,"cells_raw":0,"read":"whole","date_system":"1900"}

{"sheet":"Building Search","index":0,"n_rows":1160,"n_cols":8,"rows_kept":1160,"cut":false,"hidden":false,"merged":[[1,6,1,7]]}
[]
["Building Name","Building Name",null,null,"Select Building Name",null,"Summary of Building Energy Performance"]
["ERA APAC CENTRE",{"$f":"_xlfn._xlws.FILTER(A3:A1158,ISNUMBER(SEARCH(E3,A3:A1158,1)),\"not found\")","v":"ERA APAC CENTRE"},null,null,null,null,"Building Name",{"$f":"VLOOKUP($E$3,'All Buildings'!$A:$X,MATCH('Building Search'!G3,'All Buildings'!$A$1:$X$1,0),FALSE)","v":{"$error":"#N/A"}}]
["NEXUS @ONE-NORTH","NEXUS @ONE-NORTH",null,null,null,null,"Address",{"$f":"VLOOKUP($E$3,'All Buildings'!$A:$X,MATCH('Building Search'!G4,'All Buildings'!$A$1:$X$1,0),FALSE)","v":{"$error":"#N/A"}}]
["21 JURONG EAST STREET 31","21 JURONG EAST STREET 31",null,null,null,null,"Main Function",{"$f":"VLOOKUP($E$3,'All Buildings'!$A:$X,MATCH('Building Search'!G5,'All Buildings'!$A$1:$X$1,0),FALSE)","v":{"$error":"#N/A"}}]
["BISHAN SPORTS HALL","BISHAN SPORTS HALL",null,null,null,null,"Building Size",{"$f":"VLOOKUP($E$3,'All Buildings'!$A:$X,MATCH('Building Search'!G6,'All Buildings'!$A$1:$X$1,0),FALSE)","v":{"$error":"#N/A"}}]
["TUV SUD PSB BUILDING","TUV SUD PSB BUILDING",null,null,null,null,"2020 EUI",{"$f":"VLOOKUP($E$3,'All Buildings'!$A:$X,MATCH('Building Search'!G7,'All Buildings'!$A$1:$X$1,0),FALSE)","v":{"$error":"#N/A"}}]
["HDB CENTRE OF BUILDING RESEARCH","HDB CENTRE OF BUILDING RESEARCH",null,null,null,null,"2020 EUI Quartile/ Energy Ranking",{"$f":"VLOOKUP($E$3,'All Buildings'!$A:$X,MATCH('Building Search'!G8,'All Buildings'!$A$1:$X$1,0),FALSE)","v":{"$error":"#N/A"}}]
["BCA BRADDELL CAMPUS","BCA BRADDELL CAMPUS",null,null,null,null,"2021 EUI",{"$f":"VLOOKUP($E$3,'All Buildings'!$A:$X,MATCH('Building Search'!G9,'All Buildings'!$A$1:$X$1,0),FALSE)","v":{"$error":"#N/A"}}]
["MAJLIS UGAMA ISLAM SINGAPURA","MAJLIS UGAMA ISLAM SINGAPURA",null,null,null,null,"2021 EUI Quartile/ Energy Ranking",{"$f":"VLOOKUP($E$3,'All Buildings'!$A:$X,MATCH('Building Search'!G10,'All Buildings'!$A$1:$X$1,0),FALSE)","v":{"$error":"#N/A"}}]
["HSBC BUILDING","HSBC BUILDING",null,null,null,null,"2022 EUI",{"$f":"VLOOKUP($E$3,'All Buildings'!$A:$X,MATCH('Building Search'!G11,'All Buildings'!$A$1:$X$1,0),FALSE)","v":{"$error":"#N/A"}}]
["51 GRANGE ROAD","51 GRANGE ROAD",null,null,null,null,"2022 EUI Quartile/ Energy Ranking",{"$f":"VLOOKUP($E$3,'All Buildings'!$A:$X,MATCH('Building Search'!G12,'All Buildings'!$A$1:$X$1,0),FALSE)","v":{"$error":"#N/A"}}]
["FUJI XEROX TOWERS","FUJI XEROX TOWERS",null,null,null,null,"Reason for High EUI (if any)",{"$f":"IF(VLOOKUP($E$3,'All Buildings'!$A:$X,MATCH('Building Search'!G13,'All Buildings'!$A$1:$X$1,0),FALSE)=\"\",\"\",VLOOKUP($E$3,'All Buildings'!$A:$X,MATCH('Building Search'!G13,'All Buildings'!$A$1:$X$1,0),FALSE))","v":{"$error":"#N/A"}}]
["CONNECTION ONE","CONNECTION ONE"]
["JURONG TOWN HALL","JURONG TOWN HALL"]
["298 JALAN BUKIT HO SWEE","298 JALAN BUKIT HO SWEE"]
["ACER BUILDING","ACER BUILDING"]
["MITSUBISHI ELECTRIC BUILDING","MITSUBISHI ELECTRIC BUILDING"]
["501 OLD CHOA CHU KANG ROAD","501 OLD CHOA CHU KANG ROAD"]
["1 KAY SIANG ROAD","1 KAY SIANG ROAD"]
["1 DEFU AVENUE 1","1 DEFU AVENUE 1"]
["18 NAPIER ROAD","18 NAPIER ROAD"]
["3 BULIM DRIVE","3 BULIM DRIVE"]
["PLUS","PLUS"]
["ICON@IBP","ICON@IBP"]
["SCDF JALAN BAHAR CAMP","SCDF JALAN BAHAR CAMP"]
["MAXWELL HOUSE","MAXWELL HOUSE"]
["MANULIFE CENTRE","MANULIFE CENTRE"]
["CIVIL DEFENCE ACADEMY","CIVIL DEFENCE ACADEMY"]
["NORDIC EUROPEAN CENTRE","NORDIC EUROPEAN CENTRE"]
["TONG ENG BUILDING","TONG ENG BUILDING"]
["GOODMAN ARTS CENTRE","GOODMAN ARTS CENTRE"]
["HIGH STREET CENTRE","HIGH STREET CENTRE"]
["CITY HOUSE","CITY HOUSE"]
["31 INTERNATIONAL BUSINESS PARK","31 INTERNATIONAL BUSINESS PARK"]
["CUSTOMS OPERATIONS COMMAND","CUSTOMS OPERATIONS COMMAND"]
["ENVIRONMENT BUILDING","ENVIRONMENT BUILDING"]
["GERMAN CENTRE","GERMAN CENTRE"]
["28 BIOPOLIS ROAD","28 BIOPOLIS ROAD"]
["1A INTERNATIONAL BUSINESS PARK","1A INTERNATIONAL BUSINESS PARK"]
["MOUNTBATTEN SQUARE","MOUNTBATTEN SQUARE"]
["JALAN BESAR PLAZA","JALAN BESAR PLAZA"]
["71 CHAI CHEE STREET","71 CHAI CHEE STREET"]
["ALEXANDRA POINT","ALEXANDRA POINT"]
["BANGKOK BANK BUILDING","BANGKOK BANK BUILDING"]
["OXLEY @ RAFFLES","OXLEY @ RAFFLES"]
["MAS BUILDING","MAS BUILDING"]
["COLLEGE OF MEDICINE BUILDING","COLLEGE OF MEDICINE BUILDING"]
["STATE COURTS","STATE COURTS"]
["REVENUE HOUSE","REVENUE HOUSE"]
["AXA TOWER","AXA TOWER"]
["KECK SENG TOWER","KECK SENG TOWER"]
["SOUTHPOINT","SOUTHPOINT"]
["WINSLAND HOUSE I","WINSLAND HOUSE I"]
["THE OCTAGON","THE OCTAGON"]
["THE TREASURY","THE TREASURY"]
["ONE MARINA BOULEVARD","ONE MARINA BOULEVARD"]
["20 HARBOUR DRIVE","20 HARBOUR DRIVE"]
["MND BUILDING","MND BUILDING"]
["79 ANSON ROAD","79 ANSON ROAD"]
["THE CONCOURSE","THE CONCOURSE"]
["KEPPEL BAY TOWER","KEPPEL BAY TOWER"]
["1 AVIATION DRIVE","1 AVIATION DRIVE"]
["ROBINSON 77","ROBINSON 77"]
["PARLIAMENT HOUSE COMPLEX","PARLIAMENT HOUSE COMPLEX"]
["MANULIFE TOWER","MANULIFE TOWER"]
["TELETECH PARK","TELETECH PARK"]
["GREAT EASTERN CENTRE","GREAT EASTERN CENTRE"]
["THE JTC SUMMIT","THE JTC SUMMIT"]
["6 BATTERY ROAD","6 BATTERY ROAD"]
["MINISTRY OF MANPOWER BUILDING","MINISTRY OF MANPOWER BUILDING"]
["THE URA CENTRE","THE URA CENTRE"]
["OLD HILL STREET POLICE STATION","OLD HILL STREET POLICE STATION"]
["VISIONCREST","VISIONCREST"]
["51 CUPPAGE ROAD","51 CUPPAGE ROAD"]
["CENTRAL MALL","CENTRAL MALL"]
["HQ SINGAPORE CIVIL DEFENCE FORCE","HQ SINGAPORE CIVIL DEFENCE FORCE"]
["ROBINSON POINT","ROBINSON POINT"]
["THE ALPHA","THE ALPHA"]
["TOURISM COURT","TOURISM COURT"]
["78 SHENTON WAY","78 SHENTON WAY"]
["MINISTRY OF MANPOWER SERVICES CENTRE","MINISTRY OF MANPOWER SERVICES CENTRE"]
["GOLDEN MILE TOWER","GOLDEN MILE TOWER"]
["MAPLETREE BUSINESS CITY","MAPLETREE BUSINESS CITY"]
["INTERNATIONAL PLAZA","INTERNATIONAL PLAZA"]
["THE STRATEGY","THE STRATEGY"]
["51 SCOTTS ROAD","51 SCOTTS ROAD"]
["ISTANA","ISTANA"]
["GALAXIS","GALAXIS"]
["FRAGRANCE EMPIRE BUILDING","FRAGRANCE EMPIRE BUILDING"]
["VISION EXCHANGE","VISION EXCHANGE"]
["SUPREME COURT BUILDING","SUPREME COURT BUILDING"]
["63 CHULIA STREET","63 CHULIA STREET"]
["PRUDENTIAL TOWER","PRUDENTIAL TOWER"]
["SHENTON HOUSE","SHENTON HOUSE"]
["TONG BUILDING","TONG BUILDING"]
["CAPITAGREEN","CAPITAGREEN"]
["SINGAPORE BUSINESS FEDERATION CENTER","SINGAPORE BUSINESS FEDERATION CENTER"]
["FOOK HAI BUILDING","FOOK HAI BUILDING"]
["ROBINSON CENTRE","ROBINSON CENTRE"]
["MYP CENTRE","MYP CENTRE"]
["18 ROBINSON","18 ROBINSON"]
["FRASERS TOWER","FRASERS TOWER"]
["THE RUTHERFORD","THE RUTHERFORD"]
["20 COLLYER QUAY","20 COLLYER QUAY"]
["GOLDBELL TOWERS","GOLDBELL TOWERS"]
["OUE DOWNTOWN","OUE DOWNTOWN"]
["MANHATTAN HOUSE","MANHATTAN HOUSE"]
["SAMSUNG HUB","SAMSUNG HUB"]
["111 SOMERSET","111 SOMERSET"]
["JTC CLEANTECH TWO @CLEANTECH PARK","JTC CLEANTECH TWO @CLEANTECH PARK"]
["MAPLETREE ANSON","MAPLETREE ANSON"]
["SPRINGLEAF TOWER","SPRINGLEAF TOWER"]
["SLF BUILDING","SLF BUILDING"]
["CENTENNIAL TOWER","CENTENNIAL TOWER"]
["GB BUILDING","GB BUILDING"]
["OCBC CENTRE","OCBC CENTRE"]
["OXLEY TOWER","OXLEY TOWER"]
["SCDF HQ 2ND CD DIVISION","SCDF HQ 2ND CD DIVISION"]
["71 ROBINSON ROAD","71 ROBINSON ROAD"]
["SINGAPORE LAND TOWER","SINGAPORE LAND TOWER"]
["TWENTY ANSON","TWENTY ANSON"]
["WINSLAND HOUSE II","WINSLAND HOUSE II"]
["INCOME AT RAFFLES","INCOME AT RAFFLES"]
["THE METROPOLIS","THE METROPOLIS"]
["ONE RAFFLES PLACE","ONE RAFFLES PLACE"]
["INCOME AT TAMPINES JUNCTION","INCOME AT TAMPINES JUNCTION"]
["SINGAPORE SCIENCE CENTRE","SINGAPORE SCIENCE CENTRE"]
["GATEWAY EAST","GATEWAY EAST"]
["SULTAN PLAZA","SULTAN PLAZA"]
["LAND TRANSPORT AUTHORITY","LAND TRANSPORT AUTHORITY"]
["18 SCIENCE PARK DRIVE","18 SCIENCE PARK DRIVE"]
["ONE GEORGE STREET","ONE GEORGE STREET"]
["80 ROBINSON ROAD","80 ROBINSON ROAD"]
["SINGAPORE POST CENTRE","SINGAPORE POST CENTRE"]
["THE SYNERGY","THE SYNERGY"]
["REPUBLIC PLAZA","REPUBLIC PLAZA"]
["CAPITAL TOWER","CAPITAL TOWER"]
["FORTUNE CENTRE","FORTUNE CENTRE"]
["MOE BUILDING","MOE BUILDING"]
["HARBOURFRONT CENTRE","HARBOURFRONT CENTRE"]
["ASCENT","ASCENT"]
["PEACE CENTRE","PEACE CENTRE"]
["SGX CENTRE II","SGX CENTRE II"]
["SCDF HQ 1ST CD DIVISION","SCDF HQ 1ST CD DIVISION"]
["MTOWER","MTOWER"]
["SGX CENTRE I","SGX CENTRE I"]
["ONE @ CHANGI CITY","ONE @ CHANGI CITY"]
["AIA ALEXANDRA","AIA ALEXANDRA"]
["6 RAFFLES QUAY","6 RAFFLES QUAY"]
["THE ARCADE","THE ARCADE"]
["ODEON TOWERS","ODEON TOWERS"]
["AIA TOWER","AIA TOWER"]
["PARKVIEW SQUARE","PARKVIEW SQUARE"]
["CROSS STREET EXCHANGE","CROSS STREET EXCHANGE"]
["NATIONAL LIBRARY BUILDING","NATIONAL LIBRARY BUILDING"]
["HDB HUB","HDB HUB"]
["OUR TAMPINES HUB","OUR TAMPINES HUB"]
["CURRENCY HOUSE","CURRENCY HOUSE"]
["2 BUKIT MERAH CENTRAL","2 BUKIT MERAH CENTRAL"]
["WOODLANDS CIVIC CENTRE","WOODLANDS CIVIC CENTRE"]
["3 TAMPINES GRANDE","3 TAMPINES GRANDE"]
["MINISTRY OF FOREIGN AFFAIRS BUILDING","MINISTRY OF FOREIGN AFFAIRS BUILDING"]
["HONG LEONG BUILDING","HONG LEONG BUILDING"]
["POLICE CANTONMENT COMPLEX","POLICE CANTONMENT COMPLEX"]
["PICKERING OPERATION CENTRE","PICKERING OPERATION CENTRE"]
["CLIFFORD CENTRE","CLIFFORD CENTRE"]
["PAYA LEBAR SQUARE","PAYA LEBAR SQUARE"]
["TANJONG PAGAR CENTRE","TANJONG PAGAR CENTRE"]
["UOB PLAZA","UOB PLAZA"]
["INTERNATIONAL BUILDING","INTERNATIONAL BUILDING"]
["SHAW HOUSE","SHAW HOUSE"]
["CERTIS CISCO CENTRE","CERTIS CISCO CENTRE"]
["DUO TOWER","DUO TOWER"]
["THE MENDEL","THE MENDEL"]
["984 UPPER CHANGI ROAD NORTH","984 UPPER CHANGI ROAD NORTH"]
["THE CAPRICORN","THE CAPRICORN"]
["OUE BAYFRONT","OUE BAYFRONT"]
["ONE RAFFLES LINK","ONE RAFFLES LINK"]
["CPF TAMPINES BUILDING","CPF TAMPINES BUILDING"]
["CAPITAL SQUARE","CAPITAL SQUARE"]
["PARKWAY PARADE","PARKWAY PARADE"]
["INFINITE STUDIOS","INFINITE STUDIOS"]
["BANK OF CHINA BUILDING","BANK OF CHINA BUILDING"]
["CLEANTECH ONE","CLEANTECH ONE"]
["KINESIS","KINESIS"]
["ICA BUILDING","ICA BUILDING"]
["WESTGATE TOWER","WESTGATE TOWER"]
["NEW PHOENIX PARK","NEW PHOENIX PARK"]
["THE GEMINI","THE GEMINI"]
["COMCENTRE","COMCENTRE"]
["SHAW CENTRE","SHAW CENTRE"]
["BANK OF SINGAPORE CENTRE","BANK OF SINGAPORE CENTRE"]
["VIVA BUSINESS PARK","VIVA BUSINESS PARK"]
["BANK OF AMERICA MERRILL LYNCH HARBOURFRONT","BANK OF AMERICA MERRILL LYNCH HARBOURFRONT"]
["VALLEY POINT","VALLEY POINT"]
["UE SQUARE","UE SQUARE"]
["HEALTH SCIENCES AUTHORITY BUILDING","HEALTH SCIENCES AUTHORITY BUILDING"]
["NOVENA SQUARE","NOVENA SQUARE"]
["INNOVIS","INNOVIS"]
["THE KENDALL","THE KENDALL"]
["TELEPARK","TELEPARK"]
["UOB ALEXANDRA BUILDING","UOB ALEXANDRA BUILDING"]
["SYNTHESIS","SYNTHESIS"]
["20 AYER RAJAH CRESCENT","20 AYER RAJAH CRESCENT"]
["26A AYER RAJAH CRESCENT","26A AYER RAJAH CRESCENT"]
["450 ALEXANDRA ROAD","450 ALEXANDRA ROAD"]
["SCHOOL OF PHYSICAL EDUCATION SWIMMING COMPLEX","SCHOOL OF PHYSICAL EDUCATION SWIMMING COMPLEX"]
["TECHQUEST","TECHQUEST"]
["ICON@CHANGI","ICON@CHANGI"]
["149 COMPASSVALE BOW","149 COMPASSVALE BOW"]
["1 MARYMOUNT LANE","1 MARYMOUNT LANE"]
["50 BUANGKOK DRIVE","50 BUANGKOK DRIVE"]
["DIOCESAN CENTRE BUILDING","DIOCESAN CENTRE BUILDING"]
["ICB ENTERPRISE HOUSE","ICB ENTERPRISE HOUSE"]
["223 @ MOUNTBATTEN","223 @ MOUNTBATTEN"]
["REALTY CENTRE","REALTY CENTRE"]
["UNITED HOUSE","UNITED HOUSE"]
["SWIBER@IBP","SWIBER@IBP"]
["UPPER THOMSON COMMUNITY HUB","UPPER THOMSON COMMUNITY HUB"]
["YUHUA COMMUNITY CLUB","YUHUA COMMUNITY CLUB"]
["LENG KEE COMMUNITY CENTRE","LENG KEE COMMUNITY CENTRE"]
["JTC LAUNCHPAD @ JURONG INNOVATION DISTRICT","JTC LAUNCHPAD @ JURONG INNOVATION DISTRICT"]
["NATIONAL COMMUNITY LEADERSHIP INSTITUTE","NATIONAL COMMUNITY LEADERSHIP INSTITUTE"]
["THE CHADWICK","THE CHADWICK"]
["145 WEST COAST ROAD","145 WEST COAST ROAD"]
["10 SCIENCE CENTRE ROAD","10 SCIENCE CENTRE ROAD"]
["36 ARMENIAN STREET","36 ARMENIAN STREET"]
["90 EU TONG SEN STREET","90 EU TONG SEN STREET"]
["EASTGATE","EASTGATE"]
["REGISTRY OF MARRIAGES","REGISTRY OF MARRIAGES"]
["MARITIME HOUSE","MARITIME HOUSE"]
["CES CENTRE","CES CENTRE"]
["THE KINGSMEN EXPERIENCE","THE KINGSMEN EXPERIENCE"]
["THONG TECK BUILDING","THONG TECK BUILDING"]
["MACDONALD HOUSE","MACDONALD HOUSE"]
["CIVIL SERVICE COLLEGE","CIVIL SERVICE COLLEGE"]
["PEOPLE'S ASSOCIATION","PEOPLE'S ASSOCIATION"]
["101 BUKIT PANJANG ROAD","101 BUKIT PANJANG ROAD"]
["INSTITUTE OF SOUTH EAST ASIA STUDIES","INSTITUTE OF SOUTH EAST ASIA STUDIES"]
["1 HILLVIEW RISE","1 HILLVIEW RISE"]
["PIXEL","PIXEL"]
["FAR EAST FINANCE BUILDING","FAR EAST FINANCE BUILDING"]
["BOON SIEW BUILDING","BOON SIEW BUILDING"]
["ROBINSON 112","ROBINSON 112"]
["PEK CHUAN BUILDING","PEK CHUAN BUILDING"]
["FAMILY LINK @ LENGKOK BAHRU","FAMILY LINK @ LENGKOK BAHRU"]
["GRACE GLOBAL RAFFLES","GRACE GLOBAL RAFFLES"]
["3 HAVELOCK SQUARE","3 HAVELOCK SQUARE"]
["THE OXLEY","THE OXLEY"]
["CROWN AT ROBINSON","CROWN AT ROBINSON"]
["MEWAH BUILDING","MEWAH BUILDING"]
["108 ROBINSON ROAD","108 ROBINSON ROAD"]
["METTA BUILDING","METTA BUILDING"]
["NKF CENTRE","NKF CENTRE"]
["THE GLOBE","THE GLOBE"]
["ANSON CENTRE","ANSON CENTRE"]
["150 CECIL STREET","150 CECIL STREET"]
["991G ALEXANDRA ROAD","991G ALEXANDRA ROAD"]
["VIVA VISTA","VIVA VISTA"]
["14 INTERNATIONAL BUSINESS PARK","14 INTERNATIONAL BUSINESS PARK"]
["120 ROBINSON ROAD","120 ROBINSON ROAD"]
["CECIL COURT","CECIL COURT"]
["10 RAEBURN PARK","10 RAEBURN PARK"]
["MRTC HEADQUARTERS","MRTC HEADQUARTERS"]
["FAR EASTERN BANK BUILDING","FAR EASTERN BANK BUILDING"]
["BEACH CENTRE","BEACH CENTRE"]
["PHILIPPINE AIRLINES BUILDING","PHILIPPINE AIRLINES BUILDING"]
["ANSON HOUSE","ANSON HOUSE"]
["158 CECIL STREET","158 CECIL STREET"]
["GENTING CENTRE","GENTING CENTRE"]
["ABI PLAZA","ABI PLAZA"]
["HIGH STREET PLAZA","HIGH STREET PLAZA"]
["11 TAMPINES CONCOURSE","11 TAMPINES CONCOURSE"]
["JIT POH BUILDING","JIT POH BUILDING"]
["25 NORTH BRIDGE","25 NORTH BRIDGE"]
["KEMBANGAN-CHAI CHEE COMMUNITY HUB","KEMBANGAN-CHAI CHEE COMMUNITY HUB"]
["ONE FINLAYSON GREEN","ONE FINLAYSON GREEN"]
["16 INTERNATIONAL BUSINESS PARK","16 INTERNATIONAL BUSINESS PARK"]
["TUNG ANN ASSOCIATION BUILDING","TUNG ANN ASSOCIATION BUILDING"]
["NORTH BRIDGE CENTRE","NORTH BRIDGE CENTRE"]
["NEHSONS BUILDING","NEHSONS BUILDING"]
["TOKIO MARINE CENTRE","TOKIO MARINE CENTRE"]
["STAMFORD COURT","STAMFORD COURT"]
["GREAT EASTERN @ CHANGI","GREAT EASTERN @ CHANGI"]
["ROYAL ONE PHILLIP","ROYAL ONE PHILLIP"]
["CENTROPOD @ CHANGI","CENTROPOD @ CHANGI"]
["TEMPCO TECHNOMINIUM","TEMPCO TECHNOMINIUM"]
["SCDF HQ 4TH CD DIVISION","SCDF HQ 4TH CD DIVISION"]
["NATIONAL DESIGN CENTRE","NATIONAL DESIGN CENTRE"]
["TAMPINES PLAZA 1","TAMPINES PLAZA 1"]
["KING'S CENTRE","KING'S CENTRE"]
["THE CURIE","THE CURIE"]
["ROYAL GROUP BUILDING","ROYAL GROUP BUILDING"]
["INCOME AT TAMPINES POINT","INCOME AT TAMPINES POINT"]
["ENABLING VILLAGE","ENABLING VILLAGE"]
["BHARAT BUILDING","BHARAT BUILDING"]
["ALFA CENTRE","ALFA CENTRE"]
["30 HILL STREET","30 HILL STREET"]
["SCDF HQ 3RD CD DIVISION","SCDF HQ 3RD CD DIVISION"]
["TECHSQ","TECHSQ"]
["RHB BANK BUILDING","RHB BANK BUILDING"]
["137 TELOK AYER STREET","137 TELOK AYER STREET"]
["MAXWELL CHAMBERS","MAXWELL CHAMBERS"]
["ORCHARD BUILDING","ORCHARD BUILDING"]
["FABER HOUSE","FABER HOUSE"]
["TAMPINES PLAZA 2","TAMPINES PLAZA 2"]
["CHOA CHU KANG CENTRE","CHOA CHU KANG CENTRE"]
["SENTOSA DEVELOPMENT CORPORATION OFFICE","SENTOSA DEVELOPMENT CORPORATION OFFICE"]
["50 SCOTTS ROAD","50 SCOTTS ROAD"]
["21 JURONG EAST CENTRAL 1","21 JURONG EAST CENTRAL 1"]
["INCOME CENTRE","INCOME CENTRE"]
["SIF BUILDING","SIF BUILDING"]
["HPL HOUSE","HPL HOUSE"]
["ARC 380","ARC 380"]
["SINGAPORE POOLS BUILDING","SINGAPORE POOLS BUILDING"]
["BURLINGTON SQUARE","BURLINGTON SQUARE"]
["PIL BUILDING","PIL BUILDING"]
["OCBC TAMPINES CENTRE ONE","OCBC TAMPINES CENTRE ONE"]
["IOB BUILDING","IOB BUILDING"]
["NEW BRIDGE CENTRE","NEW BRIDGE CENTRE"]
["TAN CHONG TOWER","TAN CHONG TOWER"]
["2 LENGKOK BAHRU","2 LENGKOK BAHRU"]
["93 HOUGANG AVENUE 4","93 HOUGANG AVENUE 4"]
["BEA BUILDING","BEA BUILDING"]
["OCBC TAMPINES CENTRE TWO","OCBC TAMPINES CENTRE TWO"]
["THE CRIMSON","THE CRIMSON"]
["8 ANTHONY ROAD","8 ANTHONY ROAD"]
["LAND TRANSPORT AUTHORITY","LAND TRANSPORT AUTHORITY"]
["GUTHRIE HOUSE","GUTHRIE HOUSE"]
["MAYBANK TOWER","MAYBANK TOWER"]
["THE CAVENDISH","THE CAVENDISH"]
["NEW WORLD CENTRE","NEW WORLD CENTRE"]
["OCBC CENTRE SOUTH","OCBC CENTRE SOUTH"]
["SUNSHINE PLAZA","SUNSHINE PLAZA"]
["NATIONAL ARCHIVES OF SINGAPORE","NATIONAL ARCHIVES OF SINGAPORE"]
["CPF BISHAN BUILDING","CPF BISHAN BUILDING"]
["MIWORLD","MIWORLD"]
["THE ARIES","THE ARIES"]
["HI-P BUILDING","HI-P BUILDING"]
["8 INTERNATIONAL BUSINESS PARK","8 INTERNATIONAL BUSINESS PARK"]
["10 INTERNATIONAL BUSINESS PARK","10 INTERNATIONAL BUSINESS PARK"]
["UOB TAMPINES CENTRE","UOB TAMPINES CENTRE"]
["CHANGI COVE","CHANGI COVE"]
["RELC BUILDING","RELC BUILDING"]
["ALEXANDRA CENTRAL","ALEXANDRA CENTRAL"]
["YORK HOTEL","YORK HOTEL"]
["BENCOOLEN RESIDENCES","BENCOOLEN RESIDENCES"]
["METRO-Y STEVENS","METRO-Y STEVENS"]
["30 BENCOOLEN","30 BENCOOLEN"]
["CENTRAL SQUARE","CENTRAL SQUARE"]
["CAPRI BY FRASER CHINA SQUARE, SINGAPORE","CAPRI BY FRASER CHINA SQUARE, SINGAPORE"]
["GRAND PARK CITY HALL","GRAND PARK CITY HALL"]
["HOTEL MIRAMAR","HOTEL MIRAMAR"]
["VILLAGE HOTEL CHANGI","VILLAGE HOTEL CHANGI"]
["HOTEL GRAND PACIFIC","HOTEL GRAND PACIFIC"]
["PARKROYAL ON KITCHENER ROAD","PARKROYAL ON KITCHENER ROAD"]
["GRAND HYATT SINGAPORE","GRAND HYATT SINGAPORE"]
["SWISSOTEL MERCHANT COURT SINGAPORE","SWISSOTEL MERCHANT COURT SINGAPORE"]
["MANDARIN ORCHARD SINGAPORE","MANDARIN ORCHARD SINGAPORE"]
["M HOTEL","M HOTEL"]
["QUALITY HOTEL MARLOW","QUALITY HOTEL MARLOW"]
["FURAMA CITY CENTRE SINGAPORE","FURAMA CITY CENTRE SINGAPORE"]
["HOLIDAY INN EXPRESS SINGAPORE ORCHARD ROAD","HOLIDAY INN EXPRESS SINGAPORE ORCHARD ROAD"]
["CROWNE PLAZA CHANGI AIRPORT","CROWNE PLAZA CHANGI AIRPORT"]
["COPTHORNE KING'S HOTEL","COPTHORNE KING'S HOTEL"]
["CONCORDE SHOPPING CENTRE","CONCORDE SHOPPING CENTRE"]
["GENTING HOTEL JURONG","GENTING HOTEL JURONG"]
["VILLAGE HOTEL ALBERT COURT","VILLAGE HOTEL ALBERT COURT"]
["KATONG SQUARE","KATONG SQUARE"]
["GRAND COPTHORNE WATERFRONT","GRAND COPTHORNE WATERFRONT"]
["HOLIDAY INN SINGAPORE ORCHARD CITY CENTRE","HOLIDAY INN SINGAPORE ORCHARD CITY CENTRE"]
["ASCOTT SINGAPORE RAFFLES PLACE","ASCOTT SINGAPORE RAFFLES PLACE"]
["HOTEL ROYAL @ QUEENS","HOTEL ROYAL @ QUEENS"]
["ORCHARD RENDEZVOUS HOTEL, SINGAPORE","ORCHARD RENDEZVOUS HOTEL, SINGAPORE"]
["VILLAGE HOTEL KATONG","VILLAGE HOTEL KATONG"]
["28 STEVENS ROAD","28 STEVENS ROAD"]
["VILLAGE HOTEL BUGIS","VILLAGE HOTEL BUGIS"]
["ORCHID HOTEL","ORCHID HOTEL"]
["8 ON CLAYMORE","8 ON CLAYMORE"]
["50 TIONG BAHRU ROAD","50 TIONG BAHRU ROAD"]
["51 IMBIAH WALK","51 IMBIAH WALK"]
["JEN SINGAPORE TANGLIN BY SHANGRI-LA","JEN SINGAPORE TANGLIN BY SHANGRI-LA"]
["SINGAPORE MARRIOTT TANG PLAZA HOTEL","SINGAPORE MARRIOTT TANG PLAZA HOTEL"]
["405 HAVELOCK ROAD","405 HAVELOCK ROAD"]
["CARLTON HOTEL","CARLTON HOTEL"]
["HOTEL ROYAL","HOTEL ROYAL"]
["HOLIDAY INN EXPRESS SINGAPORE CLARKE QUAY","HOLIDAY INN EXPRESS SINGAPORE CLARKE QUAY"]
["LE MERIDIEN SINGAPORE, SENTOSA","LE MERIDIEN SINGAPORE, SENTOSA"]
["1 LARKHILL ROAD","1 LARKHILL ROAD"]
["GOODWOOD PARK HOTEL","GOODWOOD PARK HOTEL"]
["HOTEL BOSS","HOTEL BOSS"]
["FOUR POINTS BY SHERATON SINGAPORE, RIVERVIEW","FOUR POINTS BY SHERATON SINGAPORE, RIVERVIEW"]
["SHANGRI-LA'S RASA SENTOSA RESORT & SPA","SHANGRI-LA'S RASA SENTOSA RESORT & SPA"]
["THE REGENT SINGAPORE","THE REGENT SINGAPORE"]
["HOTEL MI","HOTEL MI"]
["10 ARTILLERY AVENUE","10 ARTILLERY AVENUE"]
["PARK REGIS SINGAPORE","PARK REGIS SINGAPORE"]
["TRISTAR INN","TRISTAR INN"]
["PARC SOVEREIGN HOTEL - TYRWHITT","PARC SOVEREIGN HOTEL - TYRWHITT"]
["SHERATON TOWERS HOTEL","SHERATON TOWERS HOTEL"]
["ROBERTSON WALK","ROBERTSON WALK"]
["DORSETT SINGAPORE","DORSETT SINGAPORE"]
["CARLTON CITY SINGAPORE","CARLTON CITY SINGAPORE"]
["96 SOMERSET ROAD","96 SOMERSET ROAD"]
["THE ELIZABETH","THE ELIZABETH"]
["RENDEZVOUS HOTEL SINGAPORE","RENDEZVOUS HOTEL SINGAPORE"]
["CAPRI BY FRASER CHANGI CITY","CAPRI BY FRASER CHANGI CITY"]
["GRAND PARK ORCHARD","GRAND PARK ORCHARD"]
["FOUR SEASONS HOTEL","FOUR SEASONS HOTEL"]
["RAFFLES HOTEL","RAFFLES HOTEL"]
["ORCHARD HOTEL SINGAPORE","ORCHARD HOTEL SINGAPORE"]
["HOTEL FORT CANNING","HOTEL FORT CANNING"]
["PARK HOTEL CLARKE QUAY","PARK HOTEL CLARKE QUAY"]
["22 CAVENAGH ROAD","22 CAVENAGH ROAD"]
["PS100","PS100"]
["HOTEL CHANCELLOR @ ORCHARD","HOTEL CHANCELLOR @ ORCHARD"]
["IBIS SINGAPORE NOVENA","IBIS SINGAPORE NOVENA"]
["HOTEL TRAVELTINE","HOTEL TRAVELTINE"]
["1 THE KNOLLS","1 THE KNOLLS"]
["SHANGRI-LA HOTEL","SHANGRI-LA HOTEL"]
["SO SOFITEL SINGAPORE","SO SOFITEL SINGAPORE"]
["PARKROYAL COLLECTION PICKERING, SINGAPORE","PARKROYAL COLLECTION PICKERING, SINGAPORE"]
["STUDIO M HOTEL","STUDIO M HOTEL"]
["UP@ROBERTSON QUAY","UP@ROBERTSON QUAY"]
["V HOTEL LAVENDER","V HOTEL LAVENDER"]
["HOTEL G SINGAPORE","HOTEL G SINGAPORE"]
["OASIA HOTEL NOVENA, SINGAPORE","OASIA HOTEL NOVENA, SINGAPORE"]
["HILTON GARDEN INN SINGAPORE SERANGOON","HILTON GARDEN INN SINGAPORE SERANGOON"]
["MERCURE SINGAPORE BUGIS","MERCURE SINGAPORE BUGIS"]
["ST. REGIS HOTEL SINGAPORE","ST. REGIS HOTEL SINGAPORE"]
["IBIS SINGAPORE BENCOOLEN","IBIS SINGAPORE BENCOOLEN"]
["V HOTEL BENCOOLEN","V HOTEL BENCOOLEN"]
["175A CHIN SWEE ROAD","175A CHIN SWEE ROAD"]
["RAMADA SINGAPORE AT ZHONGSHAN PARK","RAMADA SINGAPORE AT ZHONGSHAN PARK"]
["W SINGAPORE SENTOSA COVE HOTEL","W SINGAPORE SENTOSA COVE HOTEL"]
["INTERCONTINENTAL SINGAPORE ROBERTSON QUAY","INTERCONTINENTAL SINGAPORE ROBERTSON QUAY"]
["3 DICKSON ROAD","3 DICKSON ROAD"]
["THE SINGAPORE RESORT & SPA","THE SINGAPORE RESORT & SPA"]
["FARRER SQUARE","FARRER SQUARE"]
["THE CAPITOL KEMPINSKI HOTEL SINGAPORE","THE CAPITOL KEMPINSKI HOTEL SINGAPORE"]
["VALUE HOTEL - THOMSON","VALUE HOTEL - THOMSON"]
["CHANGI EXHIBITION CENTRE","CHANGI EXHIBITION CENTRE"]
["112 KATONG","112 KATONG"]
["CHIJMES","CHIJMES"]
["SINGAPORE EXPO","SINGAPORE EXPO"]
["PARKLANE SHOPPING MALL","PARKLANE SHOPPING MALL"]
["67 QUEEN STREET","67 QUEEN STREET"]
["OG ORCHARD POINT","OG ORCHARD POINT"]
["BUKIT TIMAH SHOPPING CENTRE","BUKIT TIMAH SHOPPING CENTRE"]
["THE BENCOOLEN","THE BENCOOLEN"]
["TEXTILE CENTRE","TEXTILE CENTRE"]
["ROXY SQUARE","ROXY SQUARE"]
["BEAUTY WORLD CENTRE","BEAUTY WORLD CENTRE"]
["YEN SAN BUILDING","YEN SAN BUILDING"]
["GOLDEN MILE COMPLEX","GOLDEN MILE COMPLEX"]
["ORCHARD PLAZA","ORCHARD PLAZA"]
["CITY PLAZA","CITY PLAZA"]
["MARINA SQUARE","MARINA SQUARE"]
["PENINSULA SHOPPING COMPLEX","PENINSULA SHOPPING COMPLEX"]
["THE GRANDSTAND","THE GRANDSTAND"]
["TANJONG KATONG COMPLEX","TANJONG KATONG COMPLEX"]
["JOO CHIAT COMPLEX","JOO CHIAT COMPLEX"]
["KATONG SHOPPING CENTRE","KATONG SHOPPING CENTRE"]
["FU LU SHOU COMPLEX","FU LU SHOU COMPLEX"]
["HAVELOCK2","HAVELOCK2"]
["ESPLANADE MALL","ESPLANADE MALL"]
["SUNTEC CITY MALL","SUNTEC CITY MALL"]
["THE CATHAY","THE CATHAY"]
["PEOPLE'S PARK COMPLEX","PEOPLE'S PARK COMPLEX"]
["ROYAL SQUARE AT NOVENA","ROYAL SQUARE AT NOVENA"]
["THE CENTRAL","THE CENTRAL"]
["LUCKY PLAZA","LUCKY PLAZA"]
["FAR EAST PLAZA","FAR EAST PLAZA"]
["THE CENTREPOINT","THE CENTREPOINT"]
["CATHAY CINELEISURE ORCHARD","CATHAY CINELEISURE ORCHARD"]
["THE GALEN","THE GALEN"]
["SIM LIM SQUARE","SIM LIM SQUARE"]
["WISMA ATRIA","WISMA ATRIA"]
["JEM","JEM"]
["THE STAR","THE STAR"]
["MERCHANTS' COURT","MERCHANTS' COURT"]
["BUGIS+","BUGIS+"]
["THE PARAGON","THE PARAGON"]
["BUKIT TIMAH PLAZA","BUKIT TIMAH PLAZA"]
["PLAZA SINGAPURA","PLAZA SINGAPURA"]
["CITY SQUARE MALL","CITY SQUARE MALL"]
["LEISURE PARK KALLANG","LEISURE PARK KALLANG"]
["TIONG BAHRU PLAZA","TIONG BAHRU PLAZA"]
["CONNEXION","CONNEXION"]
["KINEX","KINEX"]
["WEST COAST PLAZA","WEST COAST PLAZA"]
["RAFFLES CITY SHOPPING CENTRE","RAFFLES CITY SHOPPING CENTRE"]
["CUSTOMS HOUSE","CUSTOMS HOUSE"]
["TANGLIN MALL","TANGLIN MALL"]
["CHANGI CITY POINT","CHANGI CITY POINT"]
["CENTURY SQUARE","CENTURY SQUARE"]
["92 TELOK AYER STREET","92 TELOK AYER STREET"]
["SEMBAWANG SHOPPING CENTRE","SEMBAWANG SHOPPING CENTRE"]
["VIVO CITY","VIVO CITY"]
["AMK HUB","AMK HUB"]
["WEST MALL","WEST MALL"]
["EASTPOINT MALL","EASTPOINT MALL"]
["TAMPINES ONE","TAMPINES ONE"]
["ION ORCHARD","ION ORCHARD"]
["313 @ SOMERSET","313 @ SOMERSET"]
["CAUSEWAY POINT","CAUSEWAY POINT"]
["NEX","NEX"]
["JURONG POINT","JURONG POINT"]
["JUNCTION 8 SHOPPING CENTRE","JUNCTION 8 SHOPPING CENTRE"]
["TAMPINES MALL","TAMPINES MALL"]
["THOMSON PLAZA","THOMSON PLAZA"]
["LOT ONE, SHOPPERS' MALL","LOT ONE, SHOPPERS' MALL"]
["1 PASIR RIS CENTRAL STREET 3","1 PASIR RIS CENTRAL STREET 3"]
["COMPASS ONE","COMPASS ONE"]
["930 YISHUN AVENUE 2","930 YISHUN AVENUE 2"]
["WATERWAY POINT","WATERWAY POINT"]
["HOUGANG MALL","HOUGANG MALL"]
["BUKIT PANJANG PLAZA","BUKIT PANJANG PLAZA"]
["BEDOK MALL","BEDOK MALL"]
["ORCHARD CENTRAL","ORCHARD CENTRAL"]
["THE CLEMENTI MALL","THE CLEMENTI MALL"]
["JCUBE","JCUBE"]
["THE SELETAR MALL","THE SELETAR MALL"]
["SUN PLAZA","SUN PLAZA"]
["HILLION MALL","HILLION MALL"]
["OASIS","OASIS"]
["TELOK BLANGAH HOUSE","TELOK BLANGAH HOUSE"]
["DEPOT HEIGHTS SHOPPING CENTRE","DEPOT HEIGHTS SHOPPING CENTRE"]
["MING ARCADE","MING ARCADE"]
["UPPER SERANGOON SHOPPING CENTRE","UPPER SERANGOON SHOPPING CENTRE"]
["DELFI ORCHARD","DELFI ORCHARD"]
["SINGAPORE SHOPPING CENTRE","SINGAPORE SHOPPING CENTRE"]
["THE FLOW MALL","THE FLOW MALL"]
["RUBIKON","RUBIKON"]
["LUCKY CHINATOWN","LUCKY CHINATOWN"]
["BALMORAL PLAZA","BALMORAL PLAZA"]
["OG BUILDING","OG BUILDING"]
["CUPPAGE PLAZA","CUPPAGE PLAZA"]
["BALESTIER PLAZA","BALESTIER PLAZA"]
["SCAPE","SCAPE"]
["SINGAPORE DISCOVERY CENTRE","SINGAPORE DISCOVERY CENTRE"]
["KATONG PLAZA","KATONG PLAZA"]
["BUGIS CUBE","BUGIS CUBE"]
["SINGAPORE FLYER","SINGAPORE FLYER"]
["THE MIDTOWN","THE MIDTOWN"]
["321 CLEMENTI","321 CLEMENTI"]
["ORCHARD SHOPPING CENTRE","ORCHARD SHOPPING CENTRE"]
["230 STADIUM BOULEVARD","230 STADIUM BOULEVARD"]
["ORCHARD GATEWAY @ EMERALD","ORCHARD GATEWAY @ EMERALD"]
["THE ORIENTAL PLAZA","THE ORIENTAL PLAZA"]
["QUEENSWAY SHOPPING CENTRE/QUEENSWAY TOWER","QUEENSWAY SHOPPING CENTRE/QUEENSWAY TOWER"]
["JUNCTION NINE","JUNCTION NINE"]
["MIDPOINT ORCHARD","MIDPOINT ORCHARD"]
["BALESTIER POINT","BALESTIER POINT"]
["BEDOK POINT","BEDOK POINT"]
["GRANDLINK SQUARE","GRANDLINK SQUARE"]
["HOLLAND ROAD SHOPPING CENTRE","HOLLAND ROAD SHOPPING CENTRE"]
["THE WOODGROVE","THE WOODGROVE"]
["61 ANG MO KIO AVENUE 8","61 ANG MO KIO AVENUE 8"]
["TAMAN JURONG SHOPPING CENTRE","TAMAN JURONG SHOPPING CENTRE"]
["DJIT SUN MALL","DJIT SUN MALL"]
["SEMBAWANG MART","SEMBAWANG MART"]
["HOUGANG GREEN SHOPPING MALL","HOUGANG GREEN SHOPPING MALL"]
["SCOTTS SQUARE","SCOTTS SQUARE"]
["RAFFLES HOLLAND V","RAFFLES HOLLAND V"]
["VISTA POINT","VISTA POINT"]
["KAP","KAP"]
["ALEXANDRA CENTRAL","ALEXANDRA CENTRAL"]
["JUNCTION 10","JUNCTION 10"]
["ANCHORPOINT SHOPPING CENTRE","ANCHORPOINT SHOPPING CENTRE"]
["QUAYSIDE ISLE","QUAYSIDE ISLE"]
["YISHUN 10 CINEMA COMPLEX","YISHUN 10 CINEMA COMPLEX"]
["HEARTLAND MALL- KOVAN","HEARTLAND MALL- KOVAN"]
["YEWTEE POINT","YEWTEE POINT"]
["5 TAMPINES STREET 32","5 TAMPINES STREET 32"]
["YEW TEE SQUARE","YEW TEE SQUARE"]
["MYVILLAGE AT SERANGOON GARDEN","MYVILLAGE AT SERANGOON GARDEN"]
["HOUGANG 1","HOUGANG 1"]
["RIVERVALE MALL","RIVERVALE MALL"]
["PUBLIC MANSIONS","PUBLIC MANSIONS"]
["KITCHENER COMPLEX","KITCHENER COMPLEX"]
["ORCHARD TOWERS","ORCHARD TOWERS"]
["THE HEEREN","THE HEEREN"]
["SIM LIM TOWER","SIM LIM TOWER"]
["CONCORDE HOTEL AND SHOPPING MALL","CONCORDE HOTEL AND SHOPPING MALL"]
["THE ADELPHI","THE ADELPHI"]
["PENINSULA PLAZA","PENINSULA PLAZA"]
["OG ALBERT COMPLEX","OG ALBERT COMPLEX"]
["PALAIS RENAISSANCE","PALAIS RENAISSANCE"]
["PEOPLE'S PARK CENTRE","PEOPLE'S PARK CENTRE"]
["TANGLIN SHOPPING CENTRE","TANGLIN SHOPPING CENTRE"]
["INCOME AT PRINSEP","INCOME AT PRINSEP"]
["HEXACUBE","HEXACUBE"]
["RB CAPITAL BUILDING","RB CAPITAL BUILDING"]
["SEACARE BUILDING","SEACARE BUILDING"]
["WILKIE EDGE","WILKIE EDGE"]
["IMM BUILDING","IMM BUILDING"]
["SCOTTSWALK","SCOTTSWALK"]
["LIAT TOWERS","LIAT TOWERS"]
["LINK@896","LINK@896"]
["TEKKA PLACE","TEKKA PLACE"]
["FAR EAST SHOPPING CENTRE","FAR EAST SHOPPING CENTRE"]
["THE ATRIUM @ ORCHARD","THE ATRIUM @ ORCHARD"]
["THE RIVERWALK","THE RIVERWALK"]
["THE PLAZA","THE PLAZA"]
["MACPHERSON MALL","MACPHERSON MALL"]
["UNITED SQUARE","UNITED SQUARE"]
["WHEELOCK PLACE","WHEELOCK PLACE"]
["GREAT WORLD CITY","GREAT WORLD CITY"]
["HILTON INTERNATIONAL SINGAPORE","HILTON INTERNATIONAL SINGAPORE"]
["NGEE ANN CITY","NGEE ANN CITY"]
["RIVERSIDE POINT","RIVERSIDE POINT"]
["FUNAN","FUNAN"]
["AMARA SINGAPORE","AMARA SINGAPORE"]
["ORCHARD GATEWAY","ORCHARD GATEWAY"]
["PACIFIC PLAZA","PACIFIC PLAZA"]
["CHINATOWN POINT","CHINATOWN POINT"]
["FORUM","FORUM"]
["GOLDHILL PLAZA","GOLDHILL PLAZA"]
["SQUARE 2","SQUARE 2"]
["BRIGHT VISION HOSPITAL","BRIGHT VISION HOSPITAL"]
["ANG MO KIO COMMUNITY HOSPITAL","ANG MO KIO COMMUNITY HOSPITAL"]
["1 JURONG EAST STREET 21","1 JURONG EAST STREET 21"]
["RAFFLES HOSPITAL","RAFFLES HOSPITAL"]
["SENGKANG GENERAL HOSPITAL","SENGKANG GENERAL HOSPITAL"]
["THOMSON MEDICAL CENTRE","THOMSON MEDICAL CENTRE"]
["MOUNT ALVERNIA HOSPITAL","MOUNT ALVERNIA HOSPITAL"]
["KHOO TECK PUAT HOSPITAL","KHOO TECK PUAT HOSPITAL"]
["TAN TOCK SENG HOSPITAL","TAN TOCK SENG HOSPITAL"]
["MOUNT ELIZABETH HOSPITAL","MOUNT ELIZABETH HOSPITAL"]
["38 IRRAWADDY ROAD","38 IRRAWADDY ROAD"]
["CHANGI GENERAL HOSPITAL","CHANGI GENERAL HOSPITAL"]
["KK WOMEN'S AND CHILDREN'S HOSPITAL","KK WOMEN'S AND CHILDREN'S HOSPITAL"]
["PARKWAY EAST HOSPITAL","PARKWAY EAST HOSPITAL"]
["GLENEAGLES HOSPITAL","GLENEAGLES HOSPITAL"]
["SINGAPORE GENERAL HOSPITAL","SINGAPORE GENERAL HOSPITAL"]
["GLENEAGLES MEDICAL CENTRE","GLENEAGLES MEDICAL CENTRE"]
["NATIONAL SKIN CENTRE","NATIONAL SKIN CENTRE"]
["CHANGI GENERAL HOSPITAL","CHANGI GENERAL HOSPITAL"]
["NUH MEDICAL CENTRE","NUH MEDICAL CENTRE"]
["NATIONAL DENTAL CENTRE","NATIONAL DENTAL CENTRE"]
["NATIONAL HEART CENTRE OF SINGAPORE","NATIONAL HEART CENTRE OF SINGAPORE"]
["SINGAPORE NATIONAL EYE CENTRE","SINGAPORE NATIONAL EYE CENTRE"]
["ACADEMIA","ACADEMIA"]
["NATIONAL CANCER CENTRE","NATIONAL CANCER CENTRE"]
["PIONEER POLYCLINIC","PIONEER POLYCLINIC"]
["GEYLANG POLYCLINIC","GEYLANG POLYCLINIC"]
["BUKIT BATOK POLYCLINIC","BUKIT BATOK POLYCLINIC"]
["TAMPINES POLYCLINIC","TAMPINES POLYCLINIC"]
["SATA COMMHEALTH BUILDING","SATA COMMHEALTH BUILDING"]
["CHOA CHU KANG POLYCLINIC","CHOA CHU KANG POLYCLINIC"]
["THONG CHAI BUILDING","THONG CHAI BUILDING"]
["WOODLANDS POLYCLINIC","WOODLANDS POLYCLINIC"]
["HOUGANG POLYCLINIC","HOUGANG POLYCLINIC"]
["CAMDEN CENTRE","CAMDEN CENTRE"]
["ANG MO KIO POLYCLINIC","ANG MO KIO POLYCLINIC"]
["SAINT JOSEPH'S HOME","SAINT JOSEPH'S HOME"]
["551 YISHUN RING ROAD","551 YISHUN RING ROAD"]
["10 ANG MO KIO AVENUE 8","10 ANG MO KIO AVENUE 8"]
["70 BUANGKOK VIEW","70 BUANGKOK VIEW"]
["20 WOODLANDS STREET 82","20 WOODLANDS STREET 82"]
["WOODLANDS CARE HOME","WOODLANDS CARE HOME"]
["INSTITUTE OF MENTAL HEALTH","INSTITUTE OF MENTAL HEALTH"]
["205 JALAN KAYU","205 JALAN KAYU"]
["APEX HARMONY LODGE","APEX HARMONY LODGE"]
["BRIGHT HILL EVERGREEN HOME","BRIGHT HILL EVERGREEN HOME"]
["91 YISHUN CENTRAL","91 YISHUN CENTRAL"]
["9 CHOA CHU KANG AVENUE 4","9 CHOA CHU KANG AVENUE 4"]
["JAMIYAH NURSING HOME","JAMIYAH NURSING HOME"]
["SWAMI HOME FOR THE AGED","SWAMI HOME FOR THE AGED"]
["ST. ANDREW'S NURSING HOME (QUEENSTOWN)","ST. ANDREW'S NURSING HOME (QUEENSTOWN)"]
["TAMPINES CARE HOME","TAMPINES CARE HOME"]
["ST. ANDREW'S NURSING HOME (HENDERSON)","ST. ANDREW'S NURSING HOME (HENDERSON)"]
["THONG TECK HOME FOR SENIOR CITIZENS","THONG TECK HOME FOR SENIOR CITIZENS"]
["KWONG WAI SHIU HOSPITAL","KWONG WAI SHIU HOSPITAL"]
["NTUC HEALTH (CHAI CHEE)","NTUC HEALTH (CHAI CHEE)"]
["SOCIETY FOR THE AGED SICK","SOCIETY FOR THE AGED SICK"]
["5 POH HUAT ROAD","5 POH HUAT ROAD"]
["LIONS HOME FOR THE ELDERS (BISHAN)","LIONS HOME FOR THE ELDERS (BISHAN)"]
["11 TAMPINES STREET 44","11 TAMPINES STREET 44"]
["ASSISI HOSPICE","ASSISI HOSPICE"]
["48 HOUGANG AVENUE 8","48 HOUGANG AVENUE 8"]
["NTUC HEALTH (GEYLANG EAST)","NTUC HEALTH (GEYLANG EAST)"]
["NTUC HEALTH (JURONG WEST)","NTUC HEALTH (JURONG WEST)"]
["ALL SAINTS HOME (JURONG EAST)","ALL SAINTS HOME (JURONG EAST)"]
["2 BUKIT BATOK STREET 11","2 BUKIT BATOK STREET 11"]
["RENCI @ BUKIT BATOK ST. 52","RENCI @ BUKIT BATOK ST. 52"]
["YISHUN COMMUNITY HOSPITAL","YISHUN COMMUNITY HOSPITAL"]
["71 IRRAWADDY ROAD","71 IRRAWADDY ROAD"]
["SAINT ANDREW'S COMMUNITY HOSPITAL","SAINT ANDREW'S COMMUNITY HOSPITAL"]
["149 SIMS DRIVE","149 SIMS DRIVE"]
["NATIONAL INSTITUTE OF EDUCATION","NATIONAL INSTITUTE OF EDUCATION"]
["29B TAMPINES AVENUE 1","29B TAMPINES AVENUE 1"]
["FOUR ACRES SINGAPORE","FOUR ACRES SINGAPORE"]
["510 DOVER ROAD","510 DOVER ROAD"]
["SINGAPORE INSTITUTE OF MANAGEMENT","SINGAPORE INSTITUTE OF MANAGEMENT"]
["SINGAPORE MANAGEMENT UNIVERSITY","SINGAPORE MANAGEMENT UNIVERSITY"]
["461 CLEMENTI ROAD","461 CLEMENTI ROAD"]
["SINGAPORE UNIVERSITY OF TECHNOLOGY AND DESIGN","SINGAPORE UNIVERSITY OF TECHNOLOGY AND DESIGN"]
["10 DOVER DRIVE","10 DOVER DRIVE"]
["11 MANDALAY ROAD","11 MANDALAY ROAD"]
["NATIONAL UNIVERSITY OF SINGAPORE","NATIONAL UNIVERSITY OF SINGAPORE"]
["469A BUKIT TIMAH ROAD","469A BUKIT TIMAH ROAD"]
["NANYANG TECHNOLOGICAL UNIVERSITY","NANYANG TECHNOLOGICAL UNIVERSITY"]
["11 SCIENCE PARK ROAD","11 SCIENCE PARK ROAD"]
["NGEE ANN POLYTECHNIC","NGEE ANN POLYTECHNIC"]
["ITE COLLEGE EAST","ITE COLLEGE EAST"]
["ITE COLLEGE CENTRAL","ITE COLLEGE CENTRAL"]
["SINGAPORE POLYTECHNIC","SINGAPORE POLYTECHNIC"]
["TEMASEK POLYTECHNIC","TEMASEK POLYTECHNIC"]
["ITE COLLEGE WEST","ITE COLLEGE WEST"]
["REPUBLIC POLYTECHNIC","REPUBLIC POLYTECHNIC"]
["NANYANG POLYTECHNIC","NANYANG POLYTECHNIC"]
["80 BENCOOLEN STREET","80 BENCOOLEN STREET"]
["21 BUKIT BATOK STREET 22","21 BUKIT BATOK STREET 22"]
["YO:HA@TAMPINES","YO:HA@TAMPINES"]
["1 TELOK BLANGAH RISE","1 TELOK BLANGAH RISE"]
["9 AH HOOD ROAD","9 AH HOOD ROAD"]
["SINGAPORE BIBLE COLLEGE","SINGAPORE BIBLE COLLEGE"]
["92 JALAN RAJAH","92 JALAN RAJAH"]
["CEREBRAL PALSY CENTRE","CEREBRAL PALSY CENTRE"]
["1A WOODLEIGH PARK","1A WOODLEIGH PARK"]
["UNITED WORLD COLLEGE","UNITED WORLD COLLEGE"]
["58 LOWLAND ROAD","58 LOWLAND ROAD"]
["1 TAMPINES STREET 73","1 TAMPINES STREET 73"]
["29 HENG MUI KENG TERRACE","29 HENG MUI KENG TERRACE"]
["501 STIRLING ROAD","501 STIRLING ROAD"]
["10 HYDERABAD ROAD","10 HYDERABAD ROAD"]
["MOUNTBATTEN CENTRE","MOUNTBATTEN CENTRE"]
["LIFELONG LEARNING INSTITUTE","LIFELONG LEARNING INSTITUTE"]
["1 AYER RAJAH AVENUE","1 AYER RAJAH AVENUE"]
["GR:ID","GR:ID"]
["2 ONE-NORTH GATEWAY","2 ONE-NORTH GATEWAY"]
["LASALLE COLLEGE OF THE ARTS","LASALLE COLLEGE OF THE ARTS"]
["NTUC TRADE UNION HOUSE","NTUC TRADE UNION HOUSE"]
["PARKWAY CENTRE","PARKWAY CENTRE"]
["SPECIAL OPERATIONS COMMAND","SPECIAL OPERATIONS COMMAND"]
["9 VERNON PARK","9 VERNON PARK"]
["POLICE COAST GUARD GUL BASE","POLICE COAST GUARD GUL BASE"]
["POLICE COAST GUARD LOYANG BASE","POLICE COAST GUARD LOYANG BASE"]
["OLD POLICE ACADEMY","OLD POLICE ACADEMY"]
["KALLANG FIRE STATION","KALLANG FIRE STATION"]
["2 JURONG WEST AVENUE 5","2 JURONG WEST AVENUE 5"]
["TRAFFIC POLICE HEADQUARTERS","TRAFFIC POLICE HEADQUARTERS"]
["POLICE COAST GUARD HQ AND POLCOM BUILDING","POLICE COAST GUARD HQ AND POLCOM BUILDING"]
["BEDOK POLICE DIVISION HEADQUARTERS","BEDOK POLICE DIVISION HEADQUARTERS"]
["21 KAMPONG JAVA ROAD","21 KAMPONG JAVA ROAD"]
["ANG MO KIO POLICE DIVISION HEADQUARTERS","ANG MO KIO POLICE DIVISION HEADQUARTERS"]
["CLEMENTI POLICE DIVISION HEADQUARTERS","CLEMENTI POLICE DIVISION HEADQUARTERS"]
["1 HEMMANT ROAD","1 HEMMANT ROAD"]
["RAMAKRISHNA MISSION BOYS' HOME","RAMAKRISHNA MISSION BOYS' HOME"]
["MUHAMMADIYAH WELFARE HOME","MUHAMMADIYAH WELFARE HOME"]
["GOOD SHEPHERD PLACE","GOOD SHEPHERD PLACE"]
["105 PUNGGOL ROAD","105 PUNGGOL ROAD"]
["LITTLE SISTERS OF THE POOR","LITTLE SISTERS OF THE POOR"]
["ST. ANDREW'S ADULT HOME (SENGKANG)","ST. ANDREW'S ADULT HOME (SENGKANG)"]
["HOME @ HONG SAN","HOME @ HONG SAN"]
["GRACEHAVEN","GRACEHAVEN"]
["ACACIA HOME","ACACIA HOME"]
["ANGLICAN CARE CENTRE (SIMEI)","ANGLICAN CARE CENTRE (SIMEI)"]
["SPD ABILITY CENTRE","SPD ABILITY CENTRE"]
["HOME FOR THE AGED","HOME FOR THE AGED"]
["PELANGI VILLAGE","PELANGI VILLAGE"]
["FU HUI LINK","FU HUI LINK"]
["HOME FOR THE AGED","HOME FOR THE AGED"]
["SALVATION ARMY","SALVATION ARMY"]
["500 UPPER BUKIT TIMAH ROAD","500 UPPER BUKIT TIMAH ROAD"]
["HOME FOR THE AGED","HOME FOR THE AGED"]
["SINGAPORE MANUFACTURING FEDERATION BUILDING","SINGAPORE MANUFACTURING FEDERATION BUILDING"]
["THK HOME FOR DISABLED @ SEMBAWANG","THK HOME FOR DISABLED @ SEMBAWANG"]
["BISHAN COMMUNITY CLUB","BISHAN COMMUNITY CLUB"]
["SINGAPORE RACECOURSE","SINGAPORE RACECOURSE"]
["20 SEMBAWANG CRESCENT","20 SEMBAWANG CRESCENT"]
["YMCA","YMCA"]
["60 BUANGKOK VIEW","60 BUANGKOK VIEW"]
["SREE NARAYANA MISSION HOME FOR THE AGED SICK","SREE NARAYANA MISSION HOME FOR THE AGED SICK"]
["DEVAN NAIR INSTITUTE","DEVAN NAIR INSTITUTE"]
["1 SEGAR ROAD","1 SEGAR ROAD"]
["ULU PANDAN COMMUNITY CENTRE","ULU PANDAN COMMUNITY CENTRE"]
["WISMA GEYLANG SERAI","WISMA GEYLANG SERAI"]
["YOUNG WOMEN CHRISTIAN ASSOCIATION HOSTELS","YOUNG WOMEN CHRISTIAN ASSOCIATION HOSTELS"]
["HEARTBEAT @ BEDOK","HEARTBEAT @ BEDOK"]
["SENGKANG COMMUNITY HUB","SENGKANG COMMUNITY HUB"]
["KEBUN BARU COMMUNITY CLUB","KEBUN BARU COMMUNITY CLUB"]
["CI YUAN COMMUNITY CLUB","CI YUAN COMMUNITY CLUB"]
["THE JAPANESE ASSOCIATION, SINGAPORE","THE JAPANESE ASSOCIATION, SINGAPORE"]
["2 CHOA CHU KANG LOOP","2 CHOA CHU KANG LOOP"]
["190 KENG LEE ROAD","190 KENG LEE ROAD"]
["TAMPINES WEST COMMUNITY CLUB","TAMPINES WEST COMMUNITY CLUB"]
["MARINE PARADE COMMUNITY CENTRE","MARINE PARADE COMMUNITY CENTRE"]
["KALLANG THEATRE","KALLANG THEATRE"]
["SINGAPORE CHINESE CULTURAL CENTRE","SINGAPORE CHINESE CULTURAL CENTRE"]
["NATIONAL GALLERY SINGAPORE","NATIONAL GALLERY SINGAPORE"]
["SINGAPORE CONFERENCE HALL","SINGAPORE CONFERENCE HALL"]
["VICTORIA THEATRE","VICTORIA THEATRE"]
["EMPRESS PLACE BUILDING","EMPRESS PLACE BUILDING"]
["32 JURONG PORT ROAD","32 JURONG PORT ROAD"]
["NATIONAL MUSEUM OF SINGAPORE","NATIONAL MUSEUM OF SINGAPORE"]
["BEDOK STADIUM","BEDOK STADIUM"]
["QUEENSTOWN SWIMMING COMPLEX","QUEENSTOWN SWIMMING COMPLEX"]
["JALAN BESAR STADIUM","JALAN BESAR STADIUM"]
["JURONG WEST SPORTS & RECREATION CTR","JURONG WEST SPORTS & RECREATION CTR"]
["KALLANG INDOOR STADIUM","KALLANG INDOOR STADIUM"]
["CHOA CHU KANG STADIUM","CHOA CHU KANG STADIUM"]
["TOA PAYOH ATHLETIC CENTRE","TOA PAYOH ATHLETIC CENTRE"]
["3 STADIUM DRIVE","3 STADIUM DRIVE"]
["120 PASIR RIS CENTRAL","120 PASIR RIS CENTRAL"]
["57 ANCHORVALE ROAD","57 ANCHORVALE ROAD"]
["SINGAPORE SWIMMING CLUB","SINGAPORE SWIMMING CLUB"]
["CHINESE SWIMMING CLUB","CHINESE SWIMMING CLUB"]
["SAF YACHT CLUB","SAF YACHT CLUB"]
["70 JALAN BAHTERA","70 JALAN BAHTERA"]
["515 WEST CAMP ROAD","515 WEST CAMP ROAD"]
["100 TURF CLUB ROAD","100 TURF CLUB ROAD"]
["10 TUAS WEST DRIVE","10 TUAS WEST DRIVE"]
["ONE15 MARINA CLUB","ONE15 MARINA CLUB"]
["52 WEST COAST FERRY ROAD","52 WEST COAST FERRY ROAD"]
["31 BEACH VIEW","31 BEACH VIEW"]
["131 RIFLE RANGE ROAD","131 RIFLE RANGE ROAD"]
["KEPPEL CLUB","KEPPEL CLUB"]
["TUAS SOUTH RECREATION CENTRE","TUAS SOUTH RECREATION CENTRE"]
["11 SLIM BARRACKS RISE","11 SLIM BARRACKS RISE"]
["TERUSAN RECREATION CENTRE","TERUSAN RECREATION CENTRE"]
["48 BOON LAY WAY","48 BOON LAY WAY"]
["11 NORTHSHORE DRIVE","11 NORTHSHORE DRIVE"]
["ARENA COUNTRY CLUB","ARENA COUNTRY CLUB"]
["SINGAPORE POLO CLUB","SINGAPORE POLO CLUB"]
["CLUB CSC @ TESSENSOHN","CLUB CSC @ TESSENSOHN"]
["31 AH HOOD ROAD","31 AH HOOD ROAD"]
["CLUB CSC @ BUKIT BATOK","CLUB CSC @ BUKIT BATOK"]
["SAFRA CLUBHOUSE (TAMPINES)","SAFRA CLUBHOUSE (TAMPINES)"]
["726 UPPER CHANGI ROAD EAST","726 UPPER CHANGI ROAD EAST"]
["SAFRA CLUBHOUSE (JURONG)","SAFRA CLUBHOUSE (JURONG)"]
["CLUB CSC @ CHANGI","CLUB CSC @ CHANGI"]
["190 ANG MO KIO AVENUE 8","190 ANG MO KIO AVENUE 8"]
["1010 DOVER ROAD","1010 DOVER ROAD"]
["SEMBAWANG COUNTRY CLUB","SEMBAWANG COUNTRY CLUB"]
["1 TANAH MERAH COAST ROAD","1 TANAH MERAH COAST ROAD"]
["50 NEO TIEW LANE 3","50 NEO TIEW LANE 3"]
["9 SENTUL CRESCENT","9 SENTUL CRESCENT"]
["ORCHID COUNTRY CLUB","ORCHID COUNTRY CLUB"]
["NATIONAL SERVICE RESORT & COUNTRY CLUB","NATIONAL SERVICE RESORT & COUNTRY CLUB"]
["SINGAPORE ISLAND COUNTRY CLUB","SINGAPORE ISLAND COUNTRY CLUB"]
["SAFRA CLUBHOUSE (MOUNT FABER)","SAFRA CLUBHOUSE (MOUNT FABER)"]
["SELETAR COUNTRY CLUB","SELETAR COUNTRY CLUB"]
["2 BUKIT BATOK WEST AVENUE 7","2 BUKIT BATOK WEST AVENUE 7"]
["E!HUB@DOWNTOWN EAST","E!HUB@DOWNTOWN EAST"]
["SAFRA COUNTRY CLUB (YISHUN)","SAFRA COUNTRY CLUB (YISHUN)"]
["81 CHOA CHU KANG WAY","81 CHOA CHU KANG WAY"]
["22 KENSINGTON PARK ROAD","22 KENSINGTON PARK ROAD"]
["1 PLYMOUTH AVENUE","1 PLYMOUTH AVENUE"]
["SAFRA CLUBHOUSE (TOA PAYOH)","SAFRA CLUBHOUSE (TOA PAYOH)"]
["BRITISH CLUB","BRITISH CLUB"]
["SENTOSA GOLF CLUB","SENTOSA GOLF CLUB"]
["TANGLIN CLUB","TANGLIN CLUB"]
["AMERICAN CLUB","AMERICAN CLUB"]
["SINGAPORE RECREATION CLUB","SINGAPORE RECREATION CLUB"]
["ISLAND GOLF CLUB","ISLAND GOLF CLUB"]
[]
[]
[]
[]
[]
[]
[]
[]
[]
[]
[]
[]
[]
[]
[]
[]
[]
[]
[]
[]
[]
[]
[]
[]
[]
[]
[]
[]
[]
[]
[]
[]
[]
[]
[]
[]
[]
[]
[]
[]
[]
[]
[]
[]
[]
[]
[]
[]
[]
[]
[]
[]
[]
[]
[]
[]
[]
[]
[]
[]
[]
[]
[]
[]
[]
[]
[]
[]
[]
[]
[]
[]
[]
[]
[]
[]
[]
[]
[]
[]
[]
[]
[]
[]
[]
[]
[]
[]
[]
[]
[]
[]
[]
[]
[]
[]
[]
[]
[]
[]
[]
[]
[]
[]
[]
[]
[]
[]
[]
[]
[]
[]
[]
[]
[]
[]
[]
[]
[]
[]
[]
[]
[]
[]
[]
[]
[]
[]
[]
[]
[]
[]
[]
[]
[]
[]
[]
[]
[]
[]
[]
[]
[]
[]
[]
[]
[]
[]
[]
[]
[]
[]
[]
[]
[]
[]
[]
[]
[]
[]
[]
[]
[]
[]
[]
[]
[]
[]
[]
[]
[]
[]
[]
[]
[]
[]
[]
[]
[]
[]
[]
[]
[]
[]
[]
[]
[]
[]
[]
[]
[]
[]
[]
[]
[]
[]
[]
[]
[]
[]
[]
[]
[]
[]
[]
[]
[]
[]
[]
[]
[]
[]
[]
[]
[]
[]
[]
[]
[]
[]
[]
[]
[]
[]
[]
[]
[]
[]
[]
[]
[]
[]
[]
[]
[]
[]
[]
[]
[]
[]
[]
[]
[]
[]
[]
[]
[]
[]
[]
[]
[]
[]
[]
[]
[]
[]
[]
[]
[]
[]
[]
[]
[]
[]
[]
[]
[]
[]
[]
[]
[]
[]
[]
[]
[]
[]
[]
[]
[]
[]
[]
[]
[]
[]
[]
[]
[]
[]
[]
[]
[]
[]
[]
[]
[]
[]
[]
[]
[]
[]
["note: includes buildings without completed submissions in 2021, NA refers to buildings that were not benchmarked, or EUI has been combined under the main building"]

{"sheet":"Benchmarks","index":1,"n_rows":19,"n_cols":22,"rows_kept":19,"cut":false,"hidden":true,"merged":[[7,0,8,0],[1,0,2,0],[1,1,2,1],[1,3,1,6],[4,0,5,0]]}
[]
["Building Type","Size*",null,"EUI Ranges (kWh/m².yr)",null,null,null,null,null,null,null,""]
[null,null,null,"Top Quartile","2nd Quartile","3rd Quartile","Bottom Quartile"]
[null,null,null,"(1% - 25%)","(26% - 50%)","(51% - 75%)","(76% - 100%)"]
["Office Buildings","Large",null,"≤122","122 - 160","160 - 206",">206"]
[null,"Small",null,"≤109","109 - 155","155 - 215",">215"]
["Hotels","All",null,"≤199","199 - 232","232 - 284",">284"]
["Retail Buildings","Large",null,"≤189","189 - 367","367 - 472",">472"]
[null,"Small",null,"≤243","243 - 331","331 - 480",">480"]
["Mixed Developments","All",null,"≤180","180 - 226","226 - 259",">259"]
[]
[]
[2022,null,null,null,null,null,null,null,2021,null,null,null,null,null,null,null,2020]
["Office","Large",{"$f":"A14&B14","v":"OfficeLarge"},122,160,206,null,null,"Office","Large",{"$f":"I14&J14","v":"OfficeLarge"},121,156,201,null,null,"Office","Large",{"$f":"Q14&R14","v":"OfficeLarge"},124,163,211]
["Office","Medium",{"$f":"A15&B15","v":"OfficeMedium"},109,255,215,null,null,"Office","Medium","OfficeMedium",113,151,224,null,null,"Office","Medium","OfficeMedium",110,142,225]
["Hotel",null,"Hotel",199,232,284,null,null,"Hotel",null,"Hotel",189,219,276,null,null,"Hotel",null,"Hotel",187,219,270]
["Retail","Large","RetailLarge",189,367,472,null,null,"Retail","Large","RetailLarge",196,389,509,null,null,"Retail","Large","RetailLarge",190,390,460]
["Retail","Medium","RetailMedium",243,331,480,null,null,"Retail","Medium","RetailMedium",227,345,533,null,null,"Retail","Medium","RetailMedium",216,294,434]
["Mixed Development",null,"Mixed Development",180,226,259,null,null,"Mixed Development",null,"Mixed Development",177,224,270,null,null,"Mixed Development",null,"Mixed Development",170,199,289]

{"sheet":"All Buildings","index":2,"n_rows":1129,"n_cols":24,"rows_kept":1129,"cut":false,"hidden":true,"merged":[]}
["Building Name","Address","Building Type","Main Function","Building Size","TOP/CSC Year","Award (Green/Non-Green)","Year of GM Award","Green Mark Version","GFA","AC Area","AC Area Percentage","No. Of Hotel Room","AC Type","Age  of Chiller","Air-con system efficiency (kW/RT)","Date of Last Audit/Health Check","2020 EUI","2020 EUI Quartile/ Energy Ranking","2021 EUI","2021 EUI Quartile/ Energy Ranking","2022 EUI","2022 EUI Quartile/ Energy Ranking","Reason for High EUI (if any)"]
["EQUINIX SG3 DATA CENTRE","26A AYER RAJAH CRESCENT, SINGAPORE 139963","Commercial Building","Office","Large",2015,"Platinum",2022,"Existing Data Centres",35218,28536,0.81026747685842471,0,"Water Cooled Chilled Water Plant",7,0.74399999999999999,"2023-05-03",3724.675904367085,{"$f":"IFERROR(IF(R2<=VLOOKUP($D2&$E2,Benchmarks!$S$14:$V$19,2,FALSE),\"Top Quartile\",IF(R2<=VLOOKUP($D2&$E2,Benchmarks!$S$14:$V$19,3,FALSE),\"2nd Quartile\",IF(R2<=VLOOKUP($D2&$E2,Benchmarks!$S$14:$V$19,4,FALSE),\"3rd Quartile\",IF(R2>VLOOKUP($D2&$E2,Benchmarks!$S$14:$V$19,4,FALSE),\"Bottom Quartile\",\"\")))),\"\")","v":"Bottom Quartile"},4453.2057754557327,{"$f":"IFERROR(IF(T2<=VLOOKUP($D2&$E2,Benchmarks!$K$14:$N$19,2,FALSE),\"Top Quartile\",IF(T2<=VLOOKUP($D2&$E2,Benchmarks!$K$14:$N$19,3,FALSE),\"2nd Quartile\",IF(T2<=VLOOKUP($D2&$E2,Benchmarks!$K$14:$N$19,4,FALSE),\"3rd Quartile\",IF(T2>VLOOKUP($D2&$E2,Benchmarks!$K$14:$N$19,4,FALSE),\"Bottom Quartile\",\"\")))),\"\")","v":"Bottom Quartile"},4579.5895280822306,{"$f":"IFERROR(IF(V2<=VLOOKUP($D2&$E2,Benchmarks!$C$14:$F$19,2,FALSE),\"Top Quartile\",IF(V2<=VLOOKUP($D2&$E2,Benchmarks!$C$14:$F$19,3,FALSE),\"2nd Quartile\",IF(V2<=VLOOKUP($D2&$E2,Benchmarks!$C$14:$F$19,4,FALSE),\"3rd Quartile\",IF(V2>VLOOKUP($D2&$E2,Benchmarks!$C$14:$F$19,4,FALSE),\"Bottom Quartile\",\"\")))),\"\")","v":"Bottom Quartile"},"Office Building with Non-Typical Activity (e.g. Industrial Function)"]
["BLK 20 ARC","BLK 20 AYER RAJAH CRESCENT, SINGAPORE 139964","Commercial Building","Office","Large",1999,null,null,null,38349,20000,0.52152598503220426,0,"Water Cooled Chilled Water Plant",20,"","",2043.5498938694616,"Bottom Quartile",2213.9957524316151,"Bottom Quartile",2305.2968651073043,"Bottom Quartile","Office Building with Non-Typical Activity (e.g. Industrial Function)"]
["SYNTHESIS","6 FUSIONOPOLIS WAY, SINGAPORE 138636","Commercial Building","Office","Large",2014,"Platinum",2020,"New Building for Non-Residential buildings (version 3)",19173,19173,1,0,"Water Cooled Chilled Water Plant",5,0.57799999999999996,"2023-02-20",1157.4027538726334,"Bottom Quartile",1182.1218119230168,"Bottom Quartile",1150.5562900954467,"Bottom Quartile","Office Building with Non-Typical Activity (e.g. Industrial Function)"]
["DSO NATIONAL LABORATORIES","20 SCIENCE PARK DRIVE, SINGAPORE 118230","Commercial Building","Office","Large",1986,null,null,null,15819.43,12724,0.80432733669923628,0,"Water Cooled Chilled Water Plant","","","",553.08993434023853,"Bottom Quartile",660.88190282456446,"Bottom Quartile",805.35280032213552,"Bottom Quartile"]
["UOB ALEXANDRA BUILDING","396 ALEXANDRA ROAD, SINGAPORE 119954","Commercial Building","Office","Large",1995,"GoldPlus",2022,"Existing Building for Non-Residential buildings (version 3)",30469,22476,0.73766779349502776,0,"Water Cooled Chilled Water Plant",8,0.58199999999999996,"2021-10-01",712.94639633726081,"Bottom Quartile",712.22323935803604,"Bottom Quartile",723.91930322622989,"Bottom Quartile","Office Building with Non-Typical Activity (e.g. Industrial Function)"]
["TELEPARK","5 TAMPINES CENTRAL 6, SINGAPORE 529482","Commercial Building","Office","Large",1995,null,null,null,31179,21500,0.68956669553224925,0,"Water Cooled Chilled Water Plant",27,"","",790.92122903236157,"Bottom Quartile",753.6836332146637,"Bottom Quartile",695.23615253856758,"Bottom Quartile","Office Building with Non-Typical Activity (e.g. Industrial Function)"]
["HELIOS","11 BIOPOLIS WAY, SINGAPORE 138667","Commercial Building","Office","Large",2008,"GoldPlus",2016,"Existing Building for Non-Residential buildings (version 3)",36007,25895,0.71916571777709892,0,"District Cooling System (DCS)","",0.05,"2010-08-01",641.82718985578492,null,649.48149154843838,null,658.71549696820716]
["THE KENDALL","50 SCIENCE PARK ROAD, SINGAPORE 117406","Commercial Building","Office","Large",2011,"Certified",2021,"Existing Non-Residental Buildings ENRB: 2017",20190,16870,0.83556215948489354,0,"Water Cooled Chilled Water Plant",12,"","",566.20564635958397,"Bottom Quartile",529.39249678058445,"Bottom Quartile",568.24349925705792,"Bottom Quartile","Office Building with Non-Typical Activity (e.g. Industrial Function)"]
["XILINX ASIA PACIFIC PTE LTD","XILINX ASIA PACIFIC PTE LTD, 5 CHANGI BUSINESS PARK VISTA, SINGAPORE 486040","Commercial Building","Office","Large",2007,"Platinum",2007,"New Building (version 1)",20619,13947,0.67641495707842281,0,"District Cooling System (DCS)","","","",495.96940928270044,null,521.52153353702897,null,522.81229109074161]
["INNOVIS","2 FUSIONOPOLIS WAY, SINGAPORE 138634","Commercial Building","Office","Large",2014,"Gold",2023,"GM:2021 In Operation",41193,30413,0.73830505182919426,0,"Water Cooled Chilled Water Plant",5,0.57799999999999996,"2023-02-20",503.36340324812454,"Bottom Quartile",491.18200640885578,"Bottom Quartile",494.47539994659286,"Bottom Quartile"]
["ESR BIZPARK@CHAI CHEE","750 CHAI CHEE ROAD, SINGAPORE 469000","Commercial Building","Office","Large",2017,null,null,null,141841,105166,0.74143583308070304,0,"Water Cooled Chilled Water Plant",2,0.62,"2017-03-01",520.52023907050852,"Bottom Quartile",360.17597344914378,"Bottom Quartile",490.10717676835333,"Bottom Quartile"]
["HEALTH PROMOTION BOARD","3 SECOND HOSPITAL AVENUE, SINGAPORE 168937","Commercial Building","Office","Large",1996,"Platinum",2020,"Existing Building for Non-Residential buildings (version 2.1)",32147.8,23595,0.73395380088217543,0,"Water Cooled Chilled Water Plant",9,0.65,"2020-01-06",148.40478104255968,"2nd Quartile",507.23150573289621,"Bottom Quartile",483.30921556062935,"Bottom Quartile"]
["SEAGATE SINGAPORE DESIGN CENTER - THE SHUGART","26 AYER RAJAH CRESCENT, SINGAPORE 139944","Commercial Building","Office","Large",2014,"Platinum",2015,"New Building for Non-Residential buildings (version 4.1)",40880,35333,0.86431017612524463,0,"District Cooling System (DCS)","","","",492.7328033268102,null,482.50437866927592,null,456.91308708414874]
["HEALTH SCIENCES AUTHORITY","11 OUTRAM ROAD, SINGAPORE 169078","Commercial Building","Office","Large",1988,"Platinum",2022,"Existing Non-Residential Buildings (RECERT 2017)",17284,15751,0.91130525341356172,0,"Water Cooled Chilled Water Plant",3,0.58399999999999996,"2022-06-03",447.36173802360565,"Bottom Quartile",458.8381526267068,"Bottom Quartile",438.14511918537374,"Bottom Quartile","Office Building with Non-Typical Activity (e.g. Industrial Function)"]
["BANK OF AMERICA HARBOURFRONT","2 HARBOURFRONT PLACE, SINGAPORE 098499, SINGAPORE 098499","Commercial Building","Office","Large",2008,"GoldPlus",2021,"Existing Building for Non-Residential buildings (version 3)",22651,21106,0.93179109090106393,0,"Water Cooled Chilled Water Plant",13,0.64,"2020-09-30",348.74354333142026,"Bottom Quartile",397.75692022427268,"Bottom Quartile",435.14052359719216,"Bottom Quartile","Office Building with Non-Typical Activity (e.g. Industrial Function)"]
["NEUROS","8 BIOMEDICAL GROVE, SINGAPORE 138665, SINGAPORE 138665","Commercial Building","Office","Large",2006,"Gold",2023,"GM:2021 In Operation",12960,10000,0.77160493827160492,0,"District Cooling System (DCS)","","","",413.49142391182096,null,411.26377797773029,null,423.68774603531659]
["VALLEY POINT","491 RIVER VALLEY ROAD, SINGAPORE 248371","Commercial Building","Office","Large",1998,"Gold",2022,"GM:2021 In Operation",26417,22930,0.86800166559412495,0,"Others","",0.76,"2022-06-06",384.91865086875873,"Bottom Quartile",399.58861339289098,"Bottom Quartile",407.07956240299808,"Bottom Quartile"]
["RAFFLES CITY TOWER","252 NORTH BRIDGE ROAD, SINGAPORE 179103","Commercial Building","Office","Large",1986,"GoldPlus",2020,"Existing Building for Non-Residential buildings (version 2.1)",44934,41000,0.91244937018738592,0,"Water Cooled Chilled Water Plant","","","",378.49213840641107,"Bottom Quartile",390.53270405281364,"Bottom Quartile",397.20681529337003,"Bottom Quartile"]
["SHAW CENTRE","1 SCOTTS ROAD, SINGAPORE 228208","Commercial Building","Office","Large",1975,"Gold",2021,"Existing Building for Non-Residential buildings (version 3)",40939,35950,0.87813576296441043,0,"Water Cooled Chilled Water Plant",10,0.65,"2021-07-02",317.63807127677762,"Bottom Quartile",327.99785046044116,"Bottom Quartile",371.05205305454456,"Bottom Quartile"]
["UE SQUARE","83 CLEMENCEAU AVENUE, SINGAPORE 239920","Commercial Building","Office","Large",1995,null,null,null,30809,29361,0.95300074653510336,180,"Water Cooled Chilled Water Plant",17,"","",451.93334837222909,"Bottom Quartile",422.77255866792171,"Bottom Quartile",355.66723489889318,"Bottom Quartile"]
["WESTGATE TOWER","1 GATEWAY DRIVE, #01-51 WESTGATE TOWER, SINGAPORE 608531","Commercial Building","Office","Large",2014,"Platinum",2018,"New Building for Non-Residential buildings (version 4.1)",38868,32602,0.83878769167438505,0,"Water Cooled Chilled Water Plant",8,0.47199999999999998,"2022-01-27",289.32588839504075,"Bottom Quartile",303.54432937073346,"Bottom Quartile",327.36448121132213,"Bottom Quartile"]
["THE GEMINI","41 SCIENCE PARK ROAD, SINGAPORE 117610","Commercial Building","Office","Large",1998,"Gold",2022,"GM:2021 In Operation",33322,11653,0.34970890102634894,0,"Others","",0.21540000000000001,"2022-12-01",271.42636246323752,"Bottom Quartile",298.64363423564009,"Bottom Quartile",315.31023918132161,"Bottom Quartile","Office Building with Non-Typical Activity (e.g. Industrial Function)"]
["P&G SINGAPORE INNOVATION CENTRE","70 BIOPOLIS STREET , SINGAPORE 138547","Commercial Building","Office","Large",2012,"GoldPlus",2022,"Existing Non-Residental Buildings ENRB: 2017",31539,28385,0.8999968293224262,0,"District Cooling System (DCS)","","","",296.43049082088845,null,309.63121849139162,null,311.01983258822412]
["BANK OF SINGAPORE CENTRE","63 MARKET STREET, SINGAPORE 048942","Commercial Building","Office","Large",2000,"Certified",2021,"Existing Non-Residental Buildings ENRB: 2017",18275,18074,0.98900136798905613,0,"Others","",0.81,"2022-08-31",377.95256908344732,"Bottom Quartile",343.66616689466485,"Bottom Quartile",303.53361422708616,"Bottom Quartile"]
["NEW PHOENIX PARK","28 IRRAWADDY ROAD, SINGAPORE 329560","Commercial Building","Office","Large",2001,"Platinum",2019,"Existing Non-Residental Buildings ENRB: 2017",99091,77451,0.78161487925240436,0,"Water Cooled Chilled Water Plant",16,"","",319.10667971864245,"Bottom Quartile",304.78687267259386,"Bottom Quartile",302.92237438314277,"Bottom Quartile","Office Building with Non-Typical Activity (e.g. Industrial Function)"]
["BANK OF CHINA BUILDING","4 BATTERY ROAD, SINGAPORE 049908","Commercial Building","Office","Large",1953,null,null,null,15480,15480,1,0,"Others","","","",301.97509043927653,"Bottom Quartile",295.50542635658917,"Bottom Quartile",300.88201550387595,"Bottom Quartile"]
["INFINITE STUDIOS","21 MEDIA CIRCLE, SINGAPORE 138562","Commercial Building","Office","Large",2014,"GoldPlus",2022,"Existing Non-Residential Buildings (RECERT 2017)",20484,18058,0.88156610037102123,0,"Water Cooled Chilled Water Plant",9,0.64,"2023-07-15",297.46145772310098,"Bottom Quartile",294.98093634055846,"Bottom Quartile",300.8384348760008,"Bottom Quartile"]
["DBS ASIA HUB","2 CHANGI BUSINESS PARK CRESCENT, SINGAPORE 486029, SINGAPORE 486029","Commercial Building","Office","Large",2008,"Platinum",2018,"Existing Building for Non-Residential buildings (version 3)",38774,34511,0.89005519162325275,0,"District Cooling System (DCS)","","","",298.50928457213598,null,283.21442203538453,null,299.36323309434158]
["PARKWAY PARADE","80 MARINE PARADE ROAD, #08-02 PARKWAY PARADE, SINGAPORE 449269, SINGAPORE 449269","Commercial Building","Office","Large",1983,"Platinum",2022,"Existing Non-Residential Buildings (RECERT 2017)",94753,94753,1,0,"Water Cooled Chilled Water Plant",10,0.63100000000000001,"2022-10-10",260.69736778782737,"Bottom Quartile",300.70776935822613,"Bottom Quartile",298.99086456365501,"Bottom Quartile"]
["KINESIS","4 FUSIONOPOLIS WAY, SINGAPORE 138635","Commercial Building","Office","Large",2014,"Platinum",2020,"New Building for Non-Residential buildings (version 3)",33123,26327,0.79482534794553639,0,"Water Cooled Chilled Water Plant",5,0.57799999999999996,"2023-02-20",290.5293853213779,"Bottom Quartile",299.40596443558854,"Bottom Quartile",298.63147359840599,"Bottom Quartile"]
["OUE BAYFRONT","50 COLLYER QUAY, SINGAPORE 049321","Commercial Building","Office","Large",2011,"Gold",2022,"Existing Building for Non-Residential buildings (version 2.1)",38624,38624,1,0,"Water Cooled Chilled Water Plant",11,0.81599999999999995,"2021-12-20",271.51940667490732,"Bottom Quartile",276.22927070457354,"Bottom Quartile",293.94932014833125,"Bottom Quartile"]
["NOVENA SQUARE","238 THOMSON ROAD, SINGAPORE 307683","Commercial Building","Office","Large",2000,"GoldPlus",2022,"Existing Non-Residential Buildings (RECERT 2017)",22349,18949,0.84786791355317914,0,"Water Cooled Chilled Water Plant",2018,0.65,"2021-11-10",293.10204014999215,"Bottom Quartile",284.14535851262531,"Bottom Quartile",289.08467713189901,"Bottom Quartile"]
["CLEANTECH ONE","1 CLEANTECH LOOP, SINGAPORE 637141","Commercial Building","Office","Large",2012,"Platinum",2021,"New Building for Non-Residential buildings (version 3)",28800,20897,0.72559027777777774,0,"Water Cooled Chilled Water Plant",11,"","",289.62226840277771,"Bottom Quartile",298.30469027777781,"Bottom Quartile",288.91996736111111,"Bottom Quartile","Office Building with Non-Typical Activity (e.g. Industrial Function)"]
["ICA BUILDING","10 KALLANG ROAD, SINGAPORE 208718","Commercial Building","Office","Large",1997,"Platinum",2022,"New Non-Residential Buildings (NRB: 2015) (R3)",37000,3700,0.1,0,"Water Cooled Chilled Water Plant",2,"","",351.00491891891892,"Bottom Quartile",307.06140540540542,"Bottom Quartile",288.80886486486486,"Bottom Quartile","Office Building with Non-Typical Activity (e.g. Industrial Function)"]
["COMCENTRE","31 EXETER ROAD, SINGAPORE 239732","Commercial Building","Office","Large",1981,null,null,null,104962,83076,0.79148644271260071,0,"Water Cooled Chilled Water Plant",5,0.72,"2014-11-30",328.68092261961471,"Bottom Quartile",315.5146433947524,"Bottom Quartile",288.40408909891198,"Bottom Quartile","Office Building with Non-Typical Activity (e.g. Industrial Function)"]
["CPF TAMPINES BUILDING","1 TAMPINES CENTRAL 5, SINGAPORE 529508","Commercial Building","Office","Large",1997,"GoldPlus",2021,"Existing Non-Residental Buildings ENRB: 2017",15550,13873,0.89215434083601286,0,"Water Cooled Chilled Water Plant",2,0.61799999999999999,"2019-02-25",296.04778906752415,"Bottom Quartile",281.01022122186492,"Bottom Quartile",287.62980707395496,"Bottom Quartile","Office Building with Non-Typical Activity (e.g. Industrial Function)"]
["CAPITAL SQUARE","23 CHURCH STREET, SINGAPORE 049481","Commercial Building","Office","Large",1998,"GoldPlus",2021,"Existing Building for Non-Residential buildings (version 3)",38209,31200,0.81656154309194173,0,"Water Cooled Chilled Water Plant",5,0.6,"2021-09-24",282.70601167264255,"Bottom Quartile",266.22836242770029,"Bottom Quartile",283.73698605040698,"Bottom Quartile","Office Building with Non-Typical Activity (e.g. Industrial Function)"]
["THE CAPRICORN","1 SCIENCE PARK ROAD\nSINGAPORE SCIENCE PARK 2, SINGAPORE 117528","Commercial Building","Office","Large",2001,"GoldPlus",2022,"Existing Non-Residential Buildings (RECERT 2017)",28602,28602,1,0,"Air Cooled Chilled Water Plant","","","",264.2544954898259,"Bottom Quartile",275.80436927487585,"Bottom Quartile",278.09360813929095,"Bottom Quartile","Office Building with Non-Typical Activity (e.g. Industrial Function)"]
["ONE RAFFLES LINK","1 RAFFLES LINK, SINGAPORE 039393","Commercial Building","Office","Large",1999,"Platinum",2020,"Existing Non-Residental Buildings ENRB: 2017",36280,30698,0.84614112458654911,0,"Water Cooled Chilled Water Plant",1999,0.56000000000000005,"2021-03-28",296.74744349503857,"Bottom Quartile",278.64310915104738,"Bottom Quartile",275.19443219404633,"Bottom Quartile","Office Building with Non-Typical Activity (e.g. Industrial Function)"]
["DSO NATIONAL LABORATORIES","12 SCIENCE PARK DRIVE, SINGAPORE 118225","Commercial Building","Office","Large",2013,"GoldPlus",2013,"New Building for Non-Residential buildings (version 4)",45637,30912,0.6773451366216009,0,"Water Cooled Chilled Water Plant",7,0.65,"2020-10-20",246.18021555849845,"Bottom Quartile",264.46478817837334,"Bottom Quartile",266.94398625880132,"Bottom Quartile","Office Building with Non-Typical Activity (e.g. Industrial Function)"]
["ECLIPSE","1 FUSIONOPOLIS VIEW, SINGAPORE 138577","Commercial Building","Office","Large",2013,"Platinum",2022,"Existing Building for Non-Residential buildings (version 3)",22500,2800,0.12444444444444444,0,"District Cooling System (DCS)","","","",256.5496,null,243.08789999999999,null,259.32676666666669]
["GOLDEN MILE TOWER","6001 BEACH ROAD, SINGAPORE 199589","Commercial Building","Office","Large",1970,"Gold",2014,"Existing Building for Non-Residential buildings (version 3)",20999,18900,0.90004285918377069,0,"Water Cooled Chilled Water Plant",13,0.52600000000000002,"2023-01-01",241.77654793085387,"Bottom Quartile",243.19198390399546,"Bottom Quartile",247.63525405971714,"Bottom Quartile"]
["SHAW HOUSE","350 ORCHARD ROAD, SINGAPORE 238868","Commercial Building","Office","Large",1993,"Gold",2021,"Existing Building for Non-Residential buildings (version 3)",49048,26199,0.5341502201924645,0,"Water Cooled Chilled Water Plant",12,0.60099999999999998,"2021-07-02",225.98765495025282,"Bottom Quartile",237.47619678682108,"Bottom Quartile",240.23010112542815,"Bottom Quartile"]
["GUOCO TOWER","1 5 7 9 WALLICH STREET, SINGAPORE 078884","Commercial Building","Office","Large",2016,"Platinum",2020,"New Building for Non-Residential buildings (version 4)",129726,115000,0.88648381974315094,223,"Water Cooled Chilled Water Plant",5,0.64500000000000002,"2018-05-17",326.89234232150841,"Bottom Quartile",226.47304318332485,"Bottom Quartile",234.80560566116276,"Bottom Quartile"]
["INTERNATIONAL BUILDING","360 ORCHARD ROAD, SINGAPORE 238869","Commercial Building","Office","Large",1990,"GoldPlus",2019,"Existing Building for Non-Residential buildings (version 3)",15159,14547,0.95962794379576488,0,"Water Cooled Chilled Water Plant",9,0.6,"2014-09-17",239.85549276521968,"Bottom Quartile",236.34577615523108,"Bottom Quartile",229.43097152763886,"Bottom Quartile"]
["HARBOURFRONT CENTRE","1 MARITIME SQUARE, SINGAPORE 099253","Commercial Building","Office","Large",1979,"Platinum",2022,"Existing Non-Residential Buildings (RECERT 2017)",110520,79182,0.7164495114006515,0,"Water Cooled Chilled Water Plant",13,0.64700000000000002,"2020-03-04",204.23494028230186,"3rd Quartile",211.80369163952227,"Bottom Quartile",225.45038002171552,"Bottom Quartile"]
["PARKVIEW SQUARE","600 NORTH BRIDGE ROAD, SINGAPORE 188778","Commercial Building","Office","Large",2002,null,null,null,39145,34501,0.88136415889641073,0,"Water Cooled Chilled Water Plant",21,"","",202.69234793715671,"3rd Quartile",200.19914803934088,"3rd Quartile",218.24720705070891,"Bottom Quartile"]
["THE ATRIUM@ORCHARD","60 ORCHARD ROAD, SINGAPORE 238889","Commercial Building","Office","Large",2002,null,null,null,53581.36,42866,0.80001702084456239,0,"Water Cooled Chilled Water Plant","","","",76.248609964360739,"Top Quartile",210.09429454571517,"Bottom Quartile",215.47779115722332,"Bottom Quartile"]
["9 PENANG ROAD","9 PENANG ROAD, SINGAPORE 238459","Commercial Building","Office","Large",2019,null,null,null,42630,36510,0.85643912737508798,0,"Air Cooled Chilled Water Plant","",0.57299999999999995,"2021-07-27",95.731367581515372,"Top Quartile",203.51817968566738,"Bottom Quartile",214.31550551254983,"Bottom Quartile"]
["PAYA LEBAR SQUARE","60 PAYA LEBAR ROAD SINGAPORE 409051, SINGAPORE 409051","Commercial Building","Office","Large",2014,"GoldPlus",2021,"New Building for Non-Residential buildings (version 4)",62328,57395,0.92085419073289698,0,"Water Cooled Chilled Water Plant",8,"","",213.31976800154024,"Bottom Quartile",218.06505102040816,"Bottom Quartile",211.94657296881016,"Bottom Quartile"]
["WOODLANDS CIVIC CENTRE","900 SOUTH WOODLANDS DRIVE, SINGAPORE 730900","Commercial Building","Office","Large",1999,"Platinum",2015,"Existing Building for Non-Residential buildings (version 3)",38324,30249,0.78929652437115128,0,"Water Cooled Chilled Water Plant",7,0.6,"2020-10-31",212.22555970149253,"Bottom Quartile",209.77163631144973,"Bottom Quartile",211.75532747103642,"Bottom Quartile"]
["OUR TAMPINES HUB","1 TAMPINES WALK SINGAPORE 528523, SINGAPORE 528523","Commercial Building","Office","Large",2016,"Platinum",2020,"New Building for Non-Residential buildings (version 4.1)",120267.9,42473,0.35315325203150633,0,"Water Cooled Chilled Water Plant",7,"","",215.47421988743469,"Bottom Quartile",207.86453825168644,"Bottom Quartile",211.75307160098413,"Bottom Quartile"]
["3 TAMPINES GRANDE","3 TAMPINES GRANDE, SINGAPORE 528799","Commercial Building","Office","Large",2002,null,null,null,15345,13475,0.87813620071684584,0,"Others",null,null,null,207.08830237862495,"3rd Quartile",211.63554903877485,"Bottom Quartile",210.81759530791788,"Bottom Quartile"]
["CURRENCY HOUSE","109 PASIR PANJANG ROAD, SINGAPORE 118536","Commercial Building","Office","Large",2001,null,null,null,15423,8863,0.57466122025546262,0,"Water Cooled Chilled Water Plant",22,"","",199.60130973221811,"3rd Quartile",208.23964209297802,"Bottom Quartile",210.04399273811839,"Bottom Quartile"]
["CONNEXIS","1 FUSIONOPOLIS WAY, SINGAPORE 138632, SINGAPORE 138632","Commercial Building","Office","Large",2008,null,null,null,120383,86950,0.72227806251713278,0,"District Cooling System (DCS)",null,null,null,197.49235911749074,null,204.45041616826157,null,209.95402395667202]
["CAPITAL TOWER","168 ROBINSON ROAD, SINGAPORE 068912","Commercial Building","Office","Large",2000,"Platinum",2020,"Existing Building for Non-Residential buildings (version 3)",75021,69037,0.92023566734647633,0,"Water Cooled Chilled Water Plant",23,3.617,"2020-12-30",266.97900587835409,"Bottom Quartile",236.22181789099054,"Bottom Quartile",209.74075258927499,"Bottom Quartile"]
["HDB HUB","490 LORONG 6 TOA PAYOH, SINGAPORE 310490","Commercial Building","Office","Large",2000,"Platinum",2020,"Existing Building for Non-Residential buildings (version 3)",187345,122472,0.65372441218073607,0,"Water Cooled Chilled Water Plant",10,0.65,"2019-09-15",217.2691570631722,"Bottom Quartile",205.15591934665991,"Bottom Quartile",209.33697184339056,"Bottom Quartile"]
["1ST SCDF DIVISION HQ / ALEXANDRA FIRE STATION","3 QUEENSWAY, SINGAPORE 149073","Commercial Building","Office","Large",2005,null,null,null,16616,9195,0.55338228213769858,0,"Air Cooled Chilled Water Plant","",1.41,"2019-11-01",210.76085158883004,"3rd Quartile",220.23695414058739,"Bottom Quartile",208.60228574867597,"Bottom Quartile"]
["HONG LEONG BUILDING","16 RAFFLES QUAY, SINGAPORE 048581","Commercial Building","Office","Large",1980,"Platinum",2022,"Existing Non-Residental Buildings ENRB: 2017",47740,44136,0.92450775031420196,0,"Water Cooled Chilled Water Plant",13,"","",224.30858965228322,"Bottom Quartile",212.58265354000841,"Bottom Quartile",208.4438680351906,"Bottom Quartile"]
["PICKERING OPERATION CENTRE","20 PICKERING STREET, SINGAPORE 048658","Commercial Building","Office","Large",1989,null,null,null,34560,18000,0.52083333333333337,0,"Water Cooled Chilled Water Plant",3,"","",222.24270833333333,"Bottom Quartile",215.66996527777778,"Bottom Quartile",206.42528935185186,"Bottom Quartile"]
["ASCENT","2 SCIENCE PARK DRIVE, SINGAPORE 118222","Commercial Building","Office","Large",2016,"Platinum",2022,"Existing Non-Residential Buildings (RECERT 2017)",51564,41400,0.80288573423318599,0,"Water Cooled Chilled Water Plant",2016,0.55000000000000004,"2023-02-25",186.14735862229463,"3rd Quartile",190.31193856178731,"3rd Quartile",204.60139632301608,"3rd Quartile"]
["NATIONAL LIBRARY BUI","100 VICTORIA STREET, SINGAPORE 188064","Commercial Building","Office","Large",2005,"Platinum",2019,"Existing Building for Non-Residential buildings (version 2.1)",58783,58783,1,0,"Water Cooled Chilled Water Plant",18,0.81,"2019-05-30",188.46804007961487,"3rd Quartile",201.28971981695386,"Bottom Quartile",204.13669258118841,"3rd Quartile"]
["POLICE CANTONMENT COMPLEX","391 NEW BRIDGE ROAD, SINGAPORE 088762","Commercial Building","Office","Large",2001,"Platinum",2019,"Existing Building for Non-Residential buildings (version 3)",106793,27600,0.25844390549942414,0,"Water Cooled Chilled Water Plant",3,0.52,"2019-08-22",216.86317455263921,"Bottom Quartile",214.4199385727529,"Bottom Quartile",203.0746022679389,"3rd Quartile"]
["MTOWER/ARC","460 ALEXANDRA ROAD, SINGAPORE 119963","Commercial Building","Office","Large",1986,"GoldPlus",2018,"Existing Building for Non-Residential buildings (version 2.1)",79650,74816,0.93930947897049588,0,"Water Cooled Chilled Water Plant",11,0.69,"2021-04-20",198.66567269303201,"3rd Quartile",192.30346327683617,"3rd Quartile",202.59139962335217,"3rd Quartile"]
["MINISTRY OF FOREIGN AFFAIRS","1 SHERWOOD ROAD, SINGAPORE 248163","Commercial Building","Office","Large",2003,"Gold",2020,"Existing Non-Residental Buildings ENRB: 2017",35533,26752,0.75287760673177051,0,"Water Cooled Chilled Water Plant",2,0.59,"2016-05-25",204.28530098781414,"3rd Quartile",212.43659696620043,"Bottom Quartile",198.55955872006302,"3rd Quartile"]
["CAPITASPRING","88 MARKET STREET, SINGAPORE 048948","Commercial Building","Office","Large",2021,null,null,null,80102,67798,0.84639584529724599,0,"Water Cooled Chilled Water Plant",2,0.752,"2022-09-03","",null,67.07278220269157,"Top Quartile",198.34778157848743,"3rd Quartile"]
["THE ARCADE","11 COLLYER QUAY, SINGAPORE 049317","Commercial Building","Office","Large",1983,null,null,null,19928,14629,0.7340927338418306,3,"Water-Cooled Package Units",null,0.83,"2017-07-12",210.40291649939783,"3rd Quartile",197.75843235648338,"3rd Quartile",198.21868576876759,"3rd Quartile"]
["ONE@CHANGI CITY","NO. 1 CHANGI BUSINESS PARK CENTRAL 1, SINGAPORE 486036","Commercial Building","Office","Large",2012,"GoldPlus",2022,"Existing Non-Residential Buildings (RECERT 2017)",71158,53000,0.74482138340032045,0,"Water Cooled Chilled Water Plant",10,0.63200000000000001,"2023-04-30",199.87414275274742,"3rd Quartile",192.81696365833778,"3rd Quartile",196.11769934511932,"3rd Quartile"]
["INCOME AT TAMPINES JUNCTION","300 TAMPINES AVENUE 5, SINGAPORE 529653","Commercial Building","Office","Large",1997,"GoldPlus",2016,"Existing Building for Non-Residential buildings (version 3)",18110,14803,0.81739370513528442,0,"Water Cooled Chilled Water Plant",6,"","",184.0236057426836,"3rd Quartile",186.81165102153506,"3rd Quartile",194.48520154610713,"3rd Quartile"]
["6 RAFFLES QUAY","6 RAFFLES QUAY, SINGAPORE 048580","Commercial Building","Office","Large",1992,null,null,null,16105,16000,0.9934802856255821,0,"Others","","","",210.41181310152126,"3rd Quartile",196.3417342440236,"3rd Quartile",194.20538652592361,"3rd Quartile"]
["FORTUNE CENTRE","190 MIDDLE RD, #06-00 FORTUNE CENTRE, SINGAPORE 188979","Commercial Building","Office","Large",1980,"Gold",2018,"Existing Building for Non-Residential buildings (version 3)",23965,20875,0.87106196536615899,0,"Water Cooled Chilled Water Plant",2015,0.55600000000000005,"2023-04-12",204.47373628207799,"3rd Quartile",196.79816190277484,"3rd Quartile",193.84607928228667,"3rd Quartile"]
["AIA TAMPINES","3 TAMPINES GRANDE, SINGAPORE 048542","Commercial Building","Office","Large",2002,"Certified",2019,"Existing Building for Non-Residential buildings (version 3)",15343,13475,0.8782506680570944,0,"Others","",0.87,"2011-06-06",190.22730235286451,"3rd Quartile",198.37020139477286,"3rd Quartile",192.40070390406049,"3rd Quartile"]
["ONE GEORGE STREET","1 GEORGE STREET, SINGAPORE 049145","Commercial Building","Office","Large",2006,"GoldPlus",2021,"Existing Building for Non-Residential buildings (version 2.1)",50310,41621,0.82729079705823894,0,"Water Cooled Chilled Water Plant",18.5,0.9,"2023-05-18",193.63430232558139,"3rd Quartile",186.21499701848538,"3rd Quartile",191.73297555158021,"3rd Quartile"]
["SCIENCE CENTRE SINGAPORE","15 SCIENCE CENTRE ROAD, SINGAPORE 609081, SINGAPORE 609081","Commercial Building","Office","Large",1975,"GoldPlus",2023,"GM:2021 In Operation",30477,27429,0.89999015651146763,0,"Water Cooled Chilled Water Plant",0,0.629,"2018-03-15",164.06634511270795,"3rd Quartile",178.79579683039668,"3rd Quartile",190.57371132329297,"3rd Quartile"]
["2 BUKIT MERAH CENTRAL","2 BUKIT MERAH CENTRAL, SINGAPORE 159835","Commercial Building","Office","Large",1988,null,null,null,23278,22000,0.94509837614915371,0,"Water Cooled Chilled Water Plant",19,"","",210.76349987112295,"3rd Quartile",209.38686742847324,"Bottom Quartile",188.6774851791391,"3rd Quartile"]
["MOE BUILDING","1 NORTH BUONA VISTA DRIVE, SINGAPORE 138675","Commercial Building","Office","Large",2000,"Platinum",2022,"Existing Non-Residental Buildings ENRB: 2017",51479,30615,0.59470852192156021,0,"Water Cooled Chilled Water Plant",2,0.18,"2018-10-22",182.50061189999806,"3rd Quartile",188.81289457837175,"3rd Quartile",188.43116610656773,"3rd Quartile"]
["NUCLEOS","21 BIOPOLIS ROAD, SINGAPORE 138567","Commercial Building","Office","Large",2014,"GoldPlus",2022,"Existing Non-Residential Buildings (RECERT 2017)",46612,38820,0.8328327469321205,0,"District Cooling System (DCS)","","","",152.81270917360337,null,157.6106689264567,null,186.82568866386339]
["REPUBLIC PLAZA","9 RAFFLES PLACE, SINGAPORE 048619, SINGAPORE 048619","Commercial Building","Office","Large",1998,"Platinum",2023,"Existing Non-Residential Buildings Re-Cert (GM:2021 In Operation)",102898,81652,0.79352368364788428,0,"Water Cooled Chilled Water Plant",5,0.61,"2017-01-23",183.12823378491322,"3rd Quartile",185.43405119633036,"3rd Quartile",185.6344826915975,"3rd Quartile"]
["71 ROBINSON","71 ROBINSON ROAD, SINGAPORE 068895","Commercial Building","Office","Large",2009,"Gold",2022,"Existing Non-Residential Buildings (RECERT 2017)",24089,23530,0.97679438747976255,0,"Water Cooled Chilled Water Plant",9,0.60199999999999998,"2022-04-27",177.101660508946,"3rd Quartile",166.25883183195648,"3rd Quartile",184.28411308065921,"3rd Quartile"]
["THE SYNERGY","1 INTERNATIONAL BUSINESS PARK, SINGAPORE 609917","Commercial Building","Office","Large",1998,"GoldPlus",2021,"Existing Non-Residental Buildings ENRB: 2017",41363,28100,0.67935111089621159,0,"Water Cooled Chilled Water Plant",2,0.59899999999999998,"2021-05-10",197.31095423446075,"3rd Quartile",181.73974324879723,"3rd Quartile",183.61281821918141,"3rd Quartile"]
["80 ROBINSON ROAD","80 ROBINSON ROAD, SINGAPORE 068898","Commercial Building","Office","Large",1997,null,null,null,31031,25833,0.83249009055460665,0,"Water-Cooled Package Units",null,"","",171.36336727788338,"3rd Quartile",181.44050078953305,"3rd Quartile",181.34834455866715,"3rd Quartile"]
["SINGAPORE POST CENTRE","10 EUNOS ROAD 8, SINGAPORE 408600","Commercial Building","Office","Large",1999,"GoldPlus",2022,"Existing Non-Residental Buildings ENRB: 2017",162134,153490,0.94668607448160169,0,"Water Cooled Chilled Water Plant",2,0.62,"2022-06-16",187.5277548200871,"3rd Quartile",181.70844795046074,"3rd Quartile",179.69007117569419,"3rd Quartile"]
["THE GATEWAY","152 BEACH ROAD, SINGAPORE 189721","Commercial Building","Office","Large",1990,null,null,null,105312,70526,0.66968626557277422,0,"Water Cooled Chilled Water Plant","",0.72,"2023-04-04",271.93285665451231,"Bottom Quartile",174.39335973108479,"3rd Quartile",178.55289995442115,"3rd Quartile"]
["CLEANTECH TWO BLK A","3 CLEANTECH LOOP, SINGAPORE 637143","Commercial Building","Office","Large",2014,"Platinum",2020,"New Building for Non-Residential buildings (version 4.0)",22485,10537,0.46862352679564157,0,"Water Cooled Chilled Water Plant",5,0.6,"2022-12-02",149.90373137647319,"2nd Quartile",162.02221614409606,"3rd Quartile",177.87338225483657,"3rd Quartile"]
["WINSLAND HOUSE II","163/165/167 PENANG ROAD, SINGAPORE 238463","Commercial Building","Office","Large",1997,"GoldPlus",2021,"Existing Building for Non-Residential buildings (version 3)",17839,7821,0.43842143617915802,0,"Water Cooled Chilled Water Plant",16,0.64200000000000002,"2021-06-02",173.48993833735074,"3rd Quartile",175.14885924098886,"3rd Quartile",177.55183194125232,"3rd Quartile"]
["ONE RAFFLES PLACE","1 RAFFLES PLACE, SINGAPORE 048616","Commercial Building","Office","Large",1988,"Gold",2022,"GM:2021 In Operation",117541,106000,0.90181298440544155,0,"Water Cooled Chilled Water Plant",5,0.623,"2023-01-04",172.11403680417897,"3rd Quartile",171.73765749823465,"3rd Quartile",177.18270220603875,"3rd Quartile"]
["COLLYER QUAY CENTRE","16 COLLYER QUAY, SINGAPORE 049318","Commercial Building","Office","Large",1992,"Gold",2023,"GM:2021 In Operation",38596,36706,0.95103119494248112,0,"Water Cooled Chilled Water Plant",3,0.60499999999999998,"2022-12-16",173.74909317027672,"3rd Quartile",170.84857239092133,"3rd Quartile",174.16158410197949,"3rd Quartile"]
["SPRINGLEAF TOWER","3 ANSON ROAD, SINGAPORE 079909","Commercial Building","Office","Large",2003,null,null,null,33846,33846,1,0,"Others","","","",168.16586893576789,"3rd Quartile",162.74451929326952,"3rd Quartile",173.2335283342197,"3rd Quartile"]
["MAPLETREE ANSON BUILDING","60 ANSON ROAD, SINGAPORE 079914","Commercial Building","Office","Large",2009,"Platinum",2022,"Existing Non-Residential Buildings (RECERT 2017)",35657,32771,0.9190621757298707,0,"Water Cooled Chilled Water Plant",12,"","",174.82250329528563,"3rd Quartile",162.21793757186526,"3rd Quartile",172.98948313094203,"3rd Quartile"]
["SGX CENTRE 1","2 SHENTON WAY, SINGAPORE 068804","Commercial Building","Office","Large",2000,"Platinum",2021,"Existing Building for Non-Residential buildings (version 3)",30408.1,28950,0.9520489606387772,0,"Water Cooled Chilled Water Plant",2,0.55000000000000004,"2022-09-12",266.93795403198493,"Bottom Quartile",189.87451369865266,"3rd Quartile",172.89264768268981,"3rd Quartile"]
["OCEAN FINANCIAL CENTRE","10 COLLYER QUAY SINGAPORE 049315, SINGAPORE 049315","Commercial Building","Office","Large",2011,"Platinum",2022,"Existing Building for Non-Residential buildings (version 3)",95992,85783,0.89364738728227355,0,"District Cooling System (DCS)",null,null,null,184.59973226935577,null,179.32192266022167,null,172.38095362113509]
["MARINA BAY FINANCIAL CENTRE TOWER 1","8 MARINA BOULEVARD, SINGAPORE 018981","Commercial Building","Office","Large",2009,"Platinum",2020,"Existing Building for Non-Residential buildings (version 3)",68130,60000,0.8806693086745927,0,"District Cooling System (DCS)","","","",173.30423175459345,null,167.11787285367578,null,171.52965485668673]
["OCBC CENTRE","65 CHULIA STREET, SINGAPORE 049513","Commercial Building","Office","Large",1979,"Gold",2022,"Existing Non-Residential Buildings (RECERT 2017)",75079,50258,0.66940156368625048,0,"Water Cooled Chilled Water Plant",12,0.79,"2014-10-04",172.66897201614299,"3rd Quartile",165.51413844084232,"3rd Quartile",170.53309180996018,"3rd Quartile"]
["20 COLLYER QUAY","20 COLLYER QUAY, SINGAPORE 049319","Commercial Building","Office","Large",1985,"Certified",2021,"Existing Building for Non-Residential buildings (version 2.1)",32150,27761,0.86348367029548989,0,"Water Cooled Chilled Water Plant",10,0.72,"2021-02-11",181.37670295489892,"3rd Quartile",167.67200622083982,"3rd Quartile",170.1108864696734,"3rd Quartile"]
["OXLEY TOWER","138 ROBINSON ROAD, SINGAPORE 068906","Commercial Building","Office","Large",2017,null,null,null,16839,1000,5.938594928439931E-2,0,"Others","","","",174.165810321278,"3rd Quartile",165.80141873032846,"3rd Quartile",169.89042817269433,"3rd Quartile"]
["THE RUTHERFORD","89 SCIENCE PARK DRIVE, SCIENCE PARK 1, SINGAPORE 118261","Commercial Building","Office","Large",1995,"Certified",2022,"Existing Non-Residential Buildings (RECERT 2017)",20143,16115,0.80002978702278704,0,"Water-Cooled Package Units","",0.65,"2022-12-07",163.40955617336044,"3rd Quartile",154.55290125601942,"2nd Quartile",168.28657498882987,"3rd Quartile"]
["ASIA SQUARE TOWER 2","12 MARINA VIEW, SINGAPORE 018961","Commercial Building","Office","Large",2013,"Platinum",2020,"New Building for Non-Residential buildings (version 3)",99576,82727,0.83079256045633487,305,"District Cooling System (DCS)","","","",161.13611713665944,null,151.1411183417691,null,166.9743914196192]
["ODEON TOWERS","331 NORTH BRIDGE ROAD, SINGAPORE 188720","Commercial Building","Office","Large",36161,"Platinum",2022,"Existing Non-Residental Buildings ENRB: 2017",23236,18357,0.79002410053365468,0,"Water Cooled Chilled Water Plant",2022,0.53,"2023-02-07","",null,"",null,165.95050783267345,"3rd Quartile"]
["SGX CENTRE 2","4 SHENTON WAY, SINGAPORE 068807","Commercial Building","Office","Large",2001,"Platinum",2021,"Existing Building for Non-Residential buildings (version 3)",30404,28950,0.95217734508617291,0,"Water Cooled Chilled Water Plant",2,0.55000000000000004,"2022-09-12",285.38059367188526,"Bottom Quartile",188.79684712537824,"3rd Quartile",165.0619076437311,"3rd Quartile"]
["MYP CENTRE","9 BATTERY ROAD, SINGAPORE 049910","Commercial Building","Office","Large",2009,"Gold",2023,"GM:2021 In Operation",18565,14762,0.79515216805817401,0,"Others","","","",116.01373983301913,"Top Quartile",153.55433342310798,"2nd Quartile",164.76571990304336,"3rd Quartile"]
["FRASERS TOWER","182 CECIL STREET, SINGAPORE 069547","Commercial Building","Office","Large",2018,"Platinum",2017,"New Building for Non-Residential buildings (version 4.1)",76208,67215,0.88199401637623343,0,"Water Cooled Chilled Water Plant",4,0.58199999999999996,"2021-01-20",153.59537056477009,"2nd Quartile",154.46261022464833,"2nd Quartile",163.47946672265377,"3rd Quartile"]
["SHENTON HOUSE","3 SHENTON WAY, SINGAPORE 068805","Commercial Building","Office","Large",1983,null,null,null,28835,28835,1,0,"Water Cooled Chilled Water Plant",19,"","",144.09994381827642,"2nd Quartile",148.39728975203744,"2nd Quartile",162.10711496445293,"3rd Quartile"]
["SAMSUNG HUB","NO 3 CHURCH STREET SAMSUNG HUB #07-02 SINGAPORE 049483, SINGAPORE 049483","Commercial Building","Office","Large",2005,"GoldPlus",2021,"Existing Building for Non-Residential buildings (version 3)",27562.25,33840,1.2277662382425238,0,"Water Cooled Chilled Water Plant",7,0.624,"2021-05-18",176.37884098721983,"3rd Quartile",159.65757512539795,"3rd Quartile",161.37481519106748,"3rd Quartile"]
["GB BUILDING","143 CECIL STREET, SINGAPORE 069542","Commercial Building","Office","Large",1989,null,null,null,17306,15000,0.86675141569397895,0,"Water Cooled Chilled Water Plant",20,"","",150.73633364151164,"2nd Quartile",164.85149254593784,"3rd Quartile",160.85882930775452,"3rd Quartile"]
["LAND TRANSPORT AUTHORITY","1 HAMPSHIRE ROAD, SINGAPORE 219428","Commercial Building","Office","Large",1997,null,null,null,37923,30003,0.79115576299343404,0,"Others","","","",185.35978482714975,"3rd Quartile",175.24180260000526,"3rd Quartile",160.84864804999606,"3rd Quartile"]
["CAPITAGREEN","138 MARKET STREET, SINGAPORE 048946","Commercial Building","Office","Large",2014,"Platinum",2021,"New Building for Non-Residential buildings (version 4.0)",82003,65225,0.79539772935136521,0,"Water Cooled Chilled Water Plant",9,0.56000000000000005,"2021-01-25",156.31420191944198,"2nd Quartile",149.83533529261123,"2nd Quartile",160.40868626757558,"3rd Quartile"]
["FOOK HAI BUILDING","150 SOUTH BRIDGE ROAD, SINGAPORE 058727","Commercial Building","Office","Large",1976,null,null,null,17884,10888,0.60881234623126812,0,"Water Cooled Chilled Water Plant",4,"","",152.17173115634091,"2nd Quartile",152.72779747260128,"2nd Quartile",160.19218183851487,"3rd Quartile"]
["OUE DOWNTOWN","6 SHENTON WAY, SINGAPORE 068809, SINGAPORE 068809","Commercial Building","Office","Large",1974,"Gold",2022,"Existing Building for Non-Residential buildings (version 3)",116055,110000,0.94782646159148676,268,"Water Cooled Chilled Water Plant",6,"","",159.57736848907845,"2nd Quartile",156.28364999353755,"3rd Quartile",160.03699108181465,"3rd Quartile"]
["THE ALPHA","10 SCIENCE PARK ROAD, SINGAPORE 117684","Commercial Building","Office","Large",1995,"GoldPlus",2022,"Existing Non-Residential Buildings (RECERT 2017)",28533,19537,0.68471594294325866,0,"Water Cooled Chilled Water Plant",1995,"","",156.03017558616338,"2nd Quartile",136.0453860442295,"2nd Quartile",158.29639364945851,"2nd Quartile"]
["111 SOMERSET","111 SOMERSET ROAD #B1-01, SINGAPORE 238164","Commercial Building","Office","Large",1975,"GoldPlus",2011,"Existing Building (version 2)",71214,70000,0.98295279018170589,0,"Water Cooled Chilled Water Plant",1,"","",150.64925955570536,"2nd Quartile",153.16785758418285,"2nd Quartile",158.24373536102451,"2nd Quartile"]
["GOLDBELL TOWERS","47 SCOTTS ROAD, SINGAPORE 228233","Commercial Building","Office","Large",1999,"Gold",2022,"Existing Non-Residential Buildings (RECERT 2017)",17815,16000,0.8981195621667134,0,"Others","",0.75,"2020-01-04",145.508830760595,"2nd Quartile",156.0730008419871,"3rd Quartile",157.872877911872,"2nd Quartile"]
["78 SHENTON WAY","78 SHENTON WAY, SINGAPORE 079120","Commercial Building","Office","Large",1989,null,null,null,38697.85,31000,0.80107809606993674,0,"Water Cooled Chilled Water Plant","","","",172.59396839876118,"3rd Quartile",162.13799991472396,"3rd Quartile",157.76814474189135,"2nd Quartile"]
["18 ROBINSON","ROBINSON ROAD, SINGAPORE 048547","Commercial Building","Office","Large",2019,"GoldPlus",2022,"Existing Non-Residental Buildings ENRB: 2017",24085.49,20000,0.83037546672291074,0,"Water Cooled Chilled Water Plant",4,0.53,"2021-10-12",145.26186513124708,"2nd Quartile",153.8397765625694,"2nd Quartile",157.28885731616836,"2nd Quartile"]
["WILMAR INTERNATIONAL","28 BIOPOLIS ROAD, SINGAPORE 138568","Commercial Building","Office","Large",2022,"GoldPlus",2020,"Non-Residential Buildings NRB: 2015",19792,15075,0.76167138237671783,0,"District Cooling System (DCS)","","","","",null,"",null,157.26440481002425]
["SYNAPSE","3 BIOPOLIS DRIVE, SINGAPORE 138623","Commercial Building","Office","Large",2011,"Gold",2011,"New Building for Non-Residential buildings (version 3)",33458,28003,0.83695977045848524,0,"District Cooling System (DCS)","","","",181.54649106478035,null,193.86753071481758,null,157.05835815338793]
["MANHATTAN HOUSE","151 CHIN SWEE ROAD, SINGAPORE 169876","Commercial Building","Office","Large",1969,null,null,null,16450,16350,0.99392097264437695,0,"Water Cooled Chilled Water Plant",53,"","",166.16282613981761,"3rd Quartile",156.7462407294833,"3rd Quartile",155.7806303951368,"2nd Quartile"]
["UOB PLAZA 1 & 2","80 RAFFLES PLACE, SINGAPORE 048624","Commercial Building","Office","Large",1992,"GoldPlus",2022,"Existing Building for Non-Residential buildings (version 3)",131811,113717,0.86272769343984945,0,"Water Cooled Chilled Water Plant",6,0.75,"2021-10-23",180.52254743534303,"3rd Quartile",175.60680443969017,"3rd Quartile",155.27187412279704,"2nd Quartile"]
["HARBOURFRONT TOWER ONE","1 HARBOURFRONT PLACE, SINGAPORE 098633, SINGAPORE 098633","Commercial Building","Office","Large",2002,"Gold",2022,"Existing Building for Non-Residential buildings (version 2.1)",40061,34377,0.85811637253188888,0,"Water Cooled Chilled Water Plant",9,0.80900000000000005,"2022-10-01",147.42951612631012,"2nd Quartile",146.62771126225718,"2nd Quartile",154.32653170410626,"2nd Quartile"]
["OCBC CENTRE EAST","63 CHULIA STREET, SINGAPORE 049514","Commercial Building","Office","Large",1996,"Gold",2022,"Existing Non-Residential Buildings (RECERT 2017)",22518,18014,0.79998223643307576,0,"Water Cooled Chilled Water Plant",12,0.73299999999999998,"2016-10-03",146.5704325428546,"2nd Quartile",144.71866950883737,"2nd Quartile",154.21107558397728,"2nd Quartile"]
["PRUDENTIAL TOWER","30 CECIL STREET, SINGAPORE 049712","Commercial Building","Office","Large",1998,"GoldPlus",2021,"Existing Building for Non-Residential buildings (version 2.1)",27699,27699,1,0,"Water Cooled Chilled Water Plant",8,0.68,"2021-02-21",156.39920574749991,"2nd Quartile",147.63828297050435,"2nd Quartile",153.83196505288998,"2nd Quartile"]
["HQ SCDF","91 UBI AVENUE 4, SINGAPORE 408827","Commercial Building","Office","Large",2001,"Platinum",2022,"Existing Non-Residental Buildings ENRB: 2017",42127,34000,0.80708334322406061,0,"Water Cooled Chilled Water Plant",2,"","",177.24832055451373,"3rd Quartile",158.18591402188619,"3rd Quartile",153.58848244593727,"2nd Quartile"]
["CENTENNIAL TOWER","3 TEMASEK AVENUE SINGAPORE 039190, SINGAPORE 039190","Commercial Building","Office","Large",1997,"GoldPlus",2022,"Existing Building for Non-Residential buildings (version 2.1)",64846,51932,0.80085124757116866,0,"Water Cooled Chilled Water Plant",7,0.65,"2013-03-20",167.7988310767048,"3rd Quartile",164.22257348178761,"3rd Quartile",152.1883231039694,"2nd Quartile"]
["SINGAPORE BUSINESS FEDERATION CENTER","160 ROBINSON ROAD, SINGAPORE 068914","Commercial Building","Office","Large",2017,"Platinum",2021,"New Building for Non-Residential buildings (version 4)",28189,26779,0.94998048884316577,0,"Water Cooled Chilled Water Plant",7,0.6,"2021-07-22",149.89159778637057,"2nd Quartile",151.34869275249213,"2nd Quartile",151.99463762460533,"2nd Quartile"]
["THE MCST PLAN NO 4484","2 VENTURE DRIVE, SINGAPORE 608526","Commercial Building","Office","Large",2017,"GoldPlus",2022,"Existing Non-Residential Buildings (RECERT 2017)",64562,52918,0.81964623152938265,0,"Water Cooled Chilled Water Plant",7,0.56799999999999995,"2021-10-04",121.20045847402497,"Top Quartile",142.88143489978623,"2nd Quartile",151.89512096899105,"2nd Quartile"]
["CAPITASKY","79 ROBINSON ROAD, SINGAPORE 068897","Commercial Building","Office","Large",2020,null,null,null,56533,52417,0.92719296693966358,0,"Water Cooled Chilled Water Plant",3,0.63,"2022-06-30",47.419100348469037,"Top Quartile",125.02969946756761,"2nd Quartile",151.01197530645817,"2nd Quartile"]
["GALAXIS","1 FUSIONOPOLIS PLACE 138522, SINGAPORE 138522","Commercial Building","Office","Large",2014,"Platinum",2021,"New Building for Non-Residential buildings (version 4.0)",68839,55585,0.80746379232702392,0,"Water Cooled Chilled Water Plant",9,0.62,"2023-06-17",147.99398596725695,"2nd Quartile",142.09134356977876,"2nd Quartile",149.87213643428871,"2nd Quartile"]
["THE METROPOLIS","9 NORTH BUONA VISTA DRIVE, SINGAPORE 138588","Commercial Building","Office","Large",2013,"Platinum",2021,"New Building for Non-Residential buildings (version 3)",115395,102171,0.88540231379175871,0,"Water Cooled Chilled Water Plant",10,0.54200000000000004,"2021-08-01",149.19877810997011,"2nd Quartile",148.63647471727543,"2nd Quartile",149.52770050695437,"2nd Quartile"]
["LAZADA ONE","51 BRAS BASAH ROAD, #02-06, SINGAPORE 189554","Commercial Building","Office","Large",45190,"Platinum",2017,"Existing Building for Non-Residential buildings (version 3)",29051,23241,0.80000688444459744,0,"Water Cooled Chilled Water Plant",14,0.61,"2023-10-30","",null,"",null,148.73481119410692,"2nd Quartile"]
["ROBINSON POINT","39 ROBINSON ROAD, SINGAPORE 068911","Commercial Building","Office","Large",1997,"Gold",2013,"Existing Building for Non-Residential buildings (version 2.1)",15400,13927,0.90435064935064935,0,"Water Cooled Chilled Water Plant",25,"","",154.41999999999999,"2nd Quartile",138.56948051948052,"2nd Quartile",147.36194805194805,"2nd Quartile"]
["TELETECH PARK","20 SCIENCE PARK ROAD, SINGAPORE 117674","Commercial Building","Office","Large",1996,"GoldPlus",2022,"Existing Non-Residential Buildings (RECERT 2017)",17701.61,17700,0.99990904782107382,0,"Water Cooled Chilled Water Plant",2015,"","",182.37790234899538,"3rd Quartile",167.04265318239413,"3rd Quartile",146.99734091983723,"2nd Quartile"]
["ASIA SQUARE TOWER 1","8 MARINA VIEW, SINGAPORE 018960","Commercial Building","Office","Large",2011,"Platinum",2021,"Existing Building for Non-Residential buildings (version 3)",145650,123715,0.84939924476484718,0,"District Cooling System (DCS)","","","",145.29172674219018,null,133.3507037418469,null,146.62239958805355]
["TWENTY ANSON","20 ANSON ROAD, SINGAPORE 079912","Commercial Building","Office","Large",2009,"Platinum",2021,"Existing Building for Non-Residential buildings (version 3)",22946,20132,0.87736424649176326,0,"Water Cooled Chilled Water Plant",14,0.63300000000000001,"2021-07-26",193.55495511200209,"3rd Quartile",171.67214329294868,"3rd Quartile",146.38900026148349,"2nd Quartile"]
["MINISTRY OF MANPOWER SERVICE CENTRE","1500 BENDEMEER RD, SINGAPORE 339946","Commercial Building","Office","Large",2012,"Platinum",2022,"Existing Non-Residental Buildings ENRB: 2017",27542,16190,0.58782949676857166,0,"Water Cooled Chilled Water Plant",11,0.63600000000000001,"2015-07-01",143.00788613753539,"2nd Quartile",134.47109723331639,"2nd Quartile",144.9611095780989,"2nd Quartile"]
["FRAGRANCE EMPIRE BUILDING","456 ALEXANDRA ROAD, SINGAPORE 119962","Commercial Building","Office","Large",2016,null,null,null,28100,19300,0.68683274021352314,0,"Water Cooled Chilled Water Plant",18,"","",133.85903914590747,"2nd Quartile",142.6020640569395,"2nd Quartile",143.76451957295373,"2nd Quartile"]
["STANDARD CHARTERED @ CHANGI","7 CHANGI BUSINESS PARK CRESCENT, SINGAPORE 486028","Commercial Building","Office","Large",2009,"Platinum",2019,"Existing Building for Non-Residential buildings (version 3)",27076,22004,0.81267543211700399,0,"District Cooling System (DCS)","","","",165.1869183040331,null,141.2172772935441,null,143.73732272122913]
["30 RAFFLES PLACE","30 RAFFLES PLACE, SINGAPORE 048622","Commercial Building","Office","Large",2020,"Platinum",2022,"Non-Residential Buildings NRB: 2015",37387,37387,1,0,"Water Cooled Chilled Water Plant",4,0.60399999999999998,"2022-01-14",54.692647176826171,"Top Quartile",114.99812769144356,"Top Quartile",142.59310054296949,"2nd Quartile"]
["MAPLETREE BUSINESS CITY","10 PASIR PANJANG ROAD,, SINGAPORE 117438","Commercial Building","Office","Large",2010,"Platinum",2022,"Existing Building for Non-Residential buildings (version 3)",184167,171504,0.93124175340859117,0,"Water Cooled Chilled Water Plant",13,0.61,"2022-11-24",142.07589759660274,"2nd Quartile",137.33452501247106,"2nd Quartile",142.2540802752587,"2nd Quartile"]
["ISTANA","ORCHARD RD SINGAPORE 238823, SINGAPORE 238823","Commercial Building","Office","Large",1959,"Platinum",2022,"New Non-Residential Buildings (NRB: 2015) (R3)",22974,10038,0.43692870201096889,0,"Water Cooled Chilled Water Plant",3,"","",138.0130965439192,"2nd Quartile",141.97589623052144,"2nd Quartile",141.6148589710107,"2nd Quartile"]
["VISIONCREST","103 PENANG ROAD, SINGAPORE 238467","Commercial Building","Office","Large",2008,null,null,null,15847,14047,0.88641383227109227,0,"Others","","","",132.86577774973182,"2nd Quartile",131.10091499968451,"2nd Quartile",140.90329715403544,"2nd Quartile"]
["INTERNATIONAL PLAZA","10 ANSON ROAD #36-05 INTERNATIONAL PLAZA, SINGAPORE 079903","Commercial Building","Office","Large",1976,"Gold",2023,"GM:2021 In Operation",103899,102370,0.98528378521448712,0,"Water Cooled Chilled Water Plant",5,0.63,"2019-07-17",139.98052512536211,"2nd Quartile",137.90103042377694,"2nd Quartile",140.55920952078461,"2nd Quartile"]
["MINISTRY OF MANPOWER HQ","18 HAVELOCK ROAD, SINGAPORE 059764","Commercial Building","Office","Large",2009,"Platinum",2019,"Existing Building for Non-Residential buildings (version 2.1)",31298,25632,0.81896606811936867,0,"Water Cooled Chilled Water Plant",14,"","",134.68654738321936,"2nd Quartile",131.99126333951051,"2nd Quartile",137.51068822288963,"2nd Quartile"]
["6 BATTERY ROAD","6 BATTERY ROAD, SINGAPORE 049909","Commercial Building","Office","Large",1984,null,null,null,66408,55000,0.8282134682568365,0,"Water Cooled Chilled Water Plant",6,0.65,"2021-01-21",127.09465124683773,"2nd Quartile",128.00234911456451,"2nd Quartile",137.17142512950247,"2nd Quartile"]
["THE URA CENTRE","45 MAXWELL ROAD, SINGAPORE 069118","Commercial Building","Office","Large",1998,"Platinum",2017,"Existing Building for Non-Residential buildings (version 3)",53825,50622,0.9404923362749652,0,"Water Cooled Chilled Water Plant",7,0.6,"2020-11-20",138.49605053413842,"2nd Quartile",130.26498169995355,"2nd Quartile",135.73540083604274,"2nd Quartile"]
["TOURISM COURT","1 ORCHARD SPRING LANE, SINGAPORE 247729","Commercial Building","Office","Large",1995,"Platinum",2022,"Existing Non-Residental Buildings ENRB: 2017",17824.830000000002,10572,0.59310523578625984,0,"Water Cooled Chilled Water Plant",1,0.61,"2021-10-07",143.34403918578744,"2nd Quartile",136.12335377111592,"2nd Quartile",134.55464932905389,"2nd Quartile"]
["TONG ENG BUILDING","101 CECIL STREET, SINGAPORE 069533","Commercial Building","Office","Large",1979,"Platinum",2020,"Existing Building for Non-Residential buildings (version 3)",15839.6,17842,1.1264173337710548,0,"Water Cooled Chilled Water Plant",11,0.66,"2020-09-06",135.79821460137885,"2nd Quartile",133.60474191267454,"2nd Quartile",133.99266900679308,"2nd Quartile"]
["PARK AVENUE CHANGI","2 CHANGI BUSINESS PARK AVE 1, SINGAPORE 486015, SINGAPORE 486015","Commercial Building","Office","Large",2012,"GoldPlus",2020,"New Building for Non-Residential buildings (version 3)",72781.72,0,0,251,"District Cooling System (DCS)","","","",195.8739158678855,null,132.27498608166997,null,132.46677874609173]
["CITI CAMPUS BLOCK 1 & 2","3 & 5 CHANGI BUSINESS PARK CRESENT, SINGAPORE 486026","Commercial Building","Office","Large",2009,null,null,null,42159,37589,0.89160084442230603,0,"District Cooling System (DCS)","","","",145.85393700040322,null,121.97443630067126,null,132.09647406247777]
["ONE MARINA BOULEVARD","1 MARINA BOULEVARD, SINGAPORE 018989","Commercial Building","Office","Large",2004,"GoldPlus",2022,"GM:2021 In Operation",48257,35268,0.73083697701887806,0,"District Cooling System (DCS)","",24506,"2022-09-01",118.97436641316285,null,120.09601094141782,null,131.65392792755455]
["OLD HILL STREET POLICE STATION","140 HILL STREET, SINGAPORE 179369, SINGAPORE 179369","Commercial Building","Office","Large",2002,"Platinum",2023,"Existing Non-Residential Buildings Re-Cert (GM:2021 In Operation)",26137,24225,0.92684699850786245,0,"Water Cooled Chilled Water Plant",3,0.75,"2021-05-14",130.40231204805448,"2nd Quartile",131.01195470023339,"2nd Quartile",131.38419941079695,"2nd Quartile"]
["NEXUS @ ONE NORTH","1&3 FUSIONPOLIS LINK, SINGAPORE 138542","Commercial Building","Office","Large",2013,"Platinum",2022,"Existing Non-Residential Buildings (RECERT 2017)",25510,2148,8.4202273618188939E-2,0,"Water Cooled Chilled Water Plant",10,0.60299999999999998,"2022-10-14",179.47997569580556,"3rd Quartile",165.40901136809094,"3rd Quartile",131.21245864366915,"2nd Quartile"]
["MANULIFE TOWER","8 CROSS STREET, SINGAPORE 048424","Commercial Building","Office","Large",1999,"Gold",2022,"Existing Non-Residential Buildings (RECERT 2017)",42561,34616,0.81332675454054182,0,"Water Cooled Chilled Water Plant",4,0.36899999999999999,"2022-11-06",124.06687460351026,"2nd Quartile",124.54461831253965,"2nd Quartile",130.90780291816452,"2nd Quartile"]
["THE STRATEGY","2 INTERNATIONAL BUSINESS PARK, SINGAPORE 609930","Commercial Building","Office","Large",2002,"GoldPlus",2021,"Existing Building for Non-Residential buildings (version 3)",67370,51680,0.76710702092919703,0,"Water Cooled Chilled Water Plant",5,0.62,"2021-03-21",131.25676116966008,"2nd Quartile",139.39557666617188,"2nd Quartile",130.15033397654742,"2nd Quartile"]
["61 ROBINSON","61 ROBINSON AND 61 ROBINSON ROAD, SINGAPORE 068893","Commercial Building","Office","Large",2000,"Gold",2021,"Existing Non-Residental Buildings ENRB: 2017",15740,12800,0.81321473951715373,0,"Air Cooled Chilled Water Plant","","","",196.20115247776366,"3rd Quartile",153.49997204574333,"2nd Quartile",129.82691613722997,"2nd Quartile"]
["51 CUPPAGE ROAD","51 CUPPAGE ROAD, SINGAPORE 229469","Commercial Building","Office","Large",1997,"Gold",2021,"Existing Building for Non-Residential buildings (version 2.1)",30915,25701,0.8313440077632217,0,"Water Cooled Chilled Water Plant",25,"","",128.76074268154619,"2nd Quartile",131.65897978327672,"2nd Quartile",129.33787643538736,"2nd Quartile"]
["GREAT EASTERN CENTRE","1 PICKERING STREET, SINGAPORE 048659","Commercial Building","Office","Large",2000,"Platinum",2019,"Existing Building for Non-Residential buildings (version 3)",26020,20206,0.77655649500384316,0,"Water Cooled Chilled Water Plant",3,"","",127.6473050272055,"2nd Quartile",125.37829605171372,"2nd Quartile",128.82546621401664,"2nd Quartile"]
["MARINA ONE","5, 7, 9 STRAITS VIEW, SINGAPORE 018935","Commercial Building","Office","Large",2017,"Platinum",2022,"Existing Non-Residential Buildings (RECERT 2017)",226765,195173,0.86068396798447733,0,"District Cooling System (DCS)","",0.32,"2022-09-19",113.97036579719092,null,117.68888276409498,null,127.3786585231407]
["SINGAPORE LAND TOWER","50 RAFFLES PLACE, SINGAPORE 048623","Commercial Building","Office","Large",1982,"Platinum",2022,"Existing Non-Residental Buildings ENRB: 2017",74215,61495,0.82860607693862431,0,"Water Cooled Chilled Water Plant",7,0.63,"2022-10-24",182.7730512699589,"3rd Quartile",167.04484268678837,"3rd Quartile",126.85591861483528,"2nd Quartile"]
["SINGAPORE AVIATION ACADEMY","1 AVIATION DRIVE, SINGAPORE 499867","Commercial Building","Office","Large",1992,"Platinum",2022,"Existing Non-Residental Buildings ENRB: 2017",22368,11813,0.52812052932761089,0,"Water Cooled Chilled Water Plant",4,0.63,"2014-12-01",129.43065987124464,"2nd Quartile",123.21812410586553,"2nd Quartile",126.74568580114449,"2nd Quartile"]
["JTC SUMMIT","8 JURONG TOWN HALL ROAD, SINGAPORE 609434","Commercial Building","Office","Large",2000,"Platinum",2021,"Existing Building for Non-Residential buildings (version 2.1)",56667,54238,0.95713554626149255,0,"Water Cooled Chilled Water Plant",11,0.59199999999999997,"2021-09-24",127.70125116911076,"2nd Quartile",125.23245204439972,"2nd Quartile",126.31761960223763,"2nd Quartile"]
["KEPPEL BAY TOWER","1 HARBOURFRONT AVENUE, SINGAPORE 098632","Commercial Building","Office","Large",2002,"Platinum",2020,"Existing Non-Residental Buildings ENRB: 2017",41908,38443,0.91731888899494129,0,"Water Cooled Chilled Water Plant",8,0.59,"2018-05-22",125.19226639305144,"2nd Quartile",122.21223871337214,"2nd Quartile",126.26280185167509,"2nd Quartile"]
["UE BIZHUB TOWER","79 ANSON ROAD, SINGAPORE 079906","Commercial Building","Office","Large",1992,"GoldPlus",2019,"Existing Building for Non-Residential buildings (version 3)",26866,25505,0.94934117471897561,0,"Water Cooled Chilled Water Plant",3,0.67900000000000005,"2022-09-25",128.23615164147995,"2nd Quartile",121.51477704161394,"2nd Quartile",125.51179930023078,"2nd Quartile"]
["KECK SENG TOWER","133 CECIL STREET, SINGAPORE 069535","Commercial Building","Office","Large",1985,"Certified",2018,"Existing Building for Non-Residential buildings (version 2.1)",16122,11438,0.70946532688252073,0,"Water Cooled Chilled Water Plant",12,"","",120.4363137327875,"Top Quartile",115.72683289914403,"Top Quartile",125.44982818508869,"2nd Quartile"]
["CENTRO PROPERTY HOLDING PTE LTD","NO. 1 MAGAZINE ROAD, SINGAPORE 059567","Commercial Building","Office","Large",1999,"Platinum",2017,"Existing Building for Non-Residential buildings (version 3)",15769,12000,0.76098674614750461,0,"Water Cooled Chilled Water Plant",2016,0.6,"2020-11-01",139.96833978058214,"2nd Quartile",134.69222842285498,"2nd Quartile",123.04261525778426,"2nd Quartile"]
["ROBINSON 77","77 ROBINSON ROAD, SINGAPORE 068896","Commercial Building","Office","Large",1997,"Gold",2021,"Existing Building for Non-Residential buildings (version 3)",36836,30882,0.83836464328374416,0,"Water Cooled Chilled Water Plant",5,0.65,"2022-11-18",128.4581387772831,"2nd Quartile",123.77452492127267,"2nd Quartile",122.72218481919862,"2nd Quartile"]
["THE TREASURY","100 HIGH STREET, SINGAPORE 179434","Commercial Building","Office","Large",2000,"Platinum",2023,"GM:2021 In Operation",41771,27343,0.65459289937995258,0,"Water Cooled Chilled Water Plant",6,0.69099999999999995,"2022-02-28",115.66143975485384,"Top Quartile",118.68425462641545,"Top Quartile",122.35230183620214,"2nd Quartile"]
["HAW PAR CENTRE","180 CLEMENCEAU AVENUE, SINGAPORE 239922","Commercial Building","Office","Large",2001,null,null,null,12291,11003,0.89520787568139293,0,"Water Cooled Chilled Water Plant",2.5,0.67600000000000005,"2021-01-11",151.76884799321994,"2nd Quartile",116.41664749682185,"Top Quartile",122.18032568557419,"2nd Quartile"]
["WINSLAND HOUSE I","3 KILLINEY ROAD, SINGAPORE 239519","Commercial Building","Office","Large",1997,"GoldPlus",2020,"Existing Building for Non-Residential buildings (version 3)",21102,19862,0.94123779736517865,0,"Water Cooled Chilled Water Plant",16,0.63800000000000001,"2020-08-26",116.96446924462136,"Top Quartile",116.66892237702588,"Top Quartile",120.58553454648849,"Top Quartile"]
["PARLIAMENT HOUSE","1 PARLIAMENT PLACE, SINGAPORE 178880","Commercial Building","Office","Large",1999,"Platinum",2022,"Existing Non-Residential Buildings (RECERT 2017)",19765,16269,0.82312167973690864,0,"Water Cooled Chilled Water Plant",9,"","",126.45226410321276,"2nd Quartile",124.13450543890715,"2nd Quartile",120.29020996711358,"Top Quartile"]
["GERMAN CENTRE","25 INTERNATIONAL BUSINESS PARK #01-78 GERMAN CENTRE, SINGAPORE 609916","Commercial Building","Office","Large",1995,"Platinum",2023,"GM:2021 In Operation",23575,19806,0.84012725344644745,0,"Water Cooled Chilled Water Plant",9,0.61,"2021-11-15",119.65272492046658,"Top Quartile",117.53799278897138,"Top Quartile",120.0632309650053,"Top Quartile"]
["31 INTERNATIONAL BUSINESS PARK","31 INTERNATIONAL BUSINESS PARK, SINGAPORE 609921","Commercial Building","Office","Large",1997,null,null,null,52903,352002,6.6537247415080429,0,"Air Cooled Chilled Water Plant","","","",116.42712133527399,"Top Quartile",110.47348921611251,"Top Quartile",118.61712946335747,"Top Quartile"]
["18 SPD","18 SCIENCE PARK DRIVE, SINGAPORE 118229","Commercial Building","Office","Large",1996,null,null,null,16692,15504,0.92882818116462973,0,"Water Cooled Chilled Water Plant",11,"","",580.14989216391086,"Bottom Quartile",171.11295830337886,"3rd Quartile",118.37571890726096,"Top Quartile"]
["THE CONCOURSE","300 BEACH ROAD, SINGAPORE 199555","Commercial Building","Office","Large",1992,"Platinum",2022,"Existing Building for Non-Residential buildings (version 3)",62392,58287,0.93420630850108988,0,"Water Cooled Chilled Water Plant",9,0.65,"2018-03-15",110.67829096679063,"Top Quartile",121.51745095525067,"2nd Quartile",117.00378189511476,"Top Quartile"]
["20 HARBOUR DRIVE","20 HARBOUR DRIVE, SINGAPORE 117612","Commercial Building","Office","Large",1998,"Certified",2022,"Existing Non-Residential Buildings (RECERT 2017)",23229,14631,0.62985922768952607,0,"Air Cooled Chilled Water Plant","",0.88200000000000001,"2022-10-01",122.5276998579362,"Top Quartile",120.73207628395542,"Top Quartile",116.42705325240001,"Top Quartile"]
["CINTECH II","75 SCIENCE PARK DRIVE, SINGAPORE 118255","Commercial Building","Office","Large",1990,"GoldPlus",2022,"Existing Non-Residential Buildings (RECERT 2017)",13207,10564,0.79987885212387366,0,"District Cooling System (DCS)","",0.59,"2019-03-01",123.52416375273501,null,118.12589943357258,null,116.2012171032452]
["SUPREME COURT BUILDING","1 SUPREME COURT LANE, SINGAPORE 178879","Commercial Building","Office","Large",2005,"Platinum",2022,"Existing Non-Residental Buildings ENRB: 2017",58824,43516,0.73976608187134507,0,"Water Cooled Chilled Water Plant",0.6,0.83,"2021-02-16",144.8529171766626,"2nd Quartile",143.97137222902217,"2nd Quartile",116.15036379708962,"Top Quartile"]
["CIVIL DEFENCE ACADEMY","101 JALAN BAHAR, SINGAPORE 649734","Commercial Building","Office","Large",1999,"Platinum",2022,"Existing Non-Residental Buildings ENRB: 2017",31278,25585,0.81798708357311845,0,"Water Cooled Chilled Water Plant",2,"","",130.14368469851016,"2nd Quartile",118.37872785983758,"Top Quartile",116.08007737067588,"Top Quartile"]
["SOLARIS","1 FUSIONOPOLIS WALK, SINGAPORE 138628","Commercial Building","Office","Large",2010,"Platinum",2022,"New Building for Non-Residential buildings (version 3)",51264,41113,0.80198579900124844,0,"District Cooling System (DCS)","","","",107.79466760299623,null,106.60274598158551,null,115.90108302122347]
["MAS BUILDING","10 SHENTON WAY, SINGAPORE 079117","Commercial Building","Office","Large",1985,"Platinum",2022,"Existing Non-Residential Buildings (RECERT 2017)",55128,40706,0.73839065447685381,0,"Water Cooled Chilled Water Plant",5,0.54200000000000004,"2022-03-15",116.54781671745755,"Top Quartile",108.4524060368597,"Top Quartile",114.64304817878391,"Top Quartile"]
["ALEXANDRA POINT","438 ALEXANDRA ROAD, SINGAPORE 119958","Commercial Building","Office","Large",1996,"Platinum",2021,"Existing Building for Non-Residential buildings (version 3)",24388.66,19990,0.81964322763120234,0,"Water Cooled Chilled Water Plant",10,0.57499999999999996,"2021-10-13",108.6566461626018,"Top Quartile",106.56819603865075,"Top Quartile",113.41262701599842,"Top Quartile"]
["CENTRIUM SQUARE","320 SERANGOON ROAD, SINGAPORE 218108","Commercial Building","Office","Large",2020,null,null,null,19097,15880,0.8315442216054878,0,"Water Cooled Chilled Water Plant",3,0.495,"2022-03-13",35.544588155207627,"Top Quartile",86.811900298476189,"Top Quartile",111.4915269414044,"Top Quartile"]
["REVENUE HOUSE","55 NEWTON ROAD, SINGAPORE 307987","Commercial Building","Office","Large",1996,"Platinum",2022,"Existing Non-Residential Buildings (RECERT 2017)",86572,83381,0.96314050732338397,0,"Water Cooled Chilled Water Plant",10,0.61199999999999999,"2023-01-01",137.42628101464678,"2nd Quartile",112.52722820311416,"Top Quartile",111.15912766252367,"Top Quartile"]
["THE SIGNATURE","51 CHANGI BUSINESS PARK CENTRAL 2, SINGAPORE 486066","Commercial Building","Office","Large",2002,"Gold",2023,"GM:2021 In Operation",47410,32745,0.690677072347606,0,"District Cooling System (DCS)","","","",121.99931892005905,null,111.94946150601139,null,110.70700084370387]
["PLAZA 8","1 CHANGI BUSINESS PARK CRESCENT, SINGAPORE 486025","Commercial Building","Office","Large",2009,"Gold",2023,"Existing Non-Residential Buildings (RECERT 2017)",32504,32504,1,0,"District Cooling System (DCS)","","","",129.10284118877678,null,115.50069222249569,null,109.54987478464189]
["NORDIC EUROPEAN CENTRE","3 INTERNATIONAL BUSINESS PARK, SINGAPORE 609927","Commercial Building","Office","Large",2000,"GoldPlus",2022,"Existing Non-Residential Buildings (RECERT 2017)",28355,27042,0.95369423382119556,0,"Water Cooled Chilled Water Plant",8,0.61799999999999999,"2002-07-18",101.5154850996297,"Top Quartile",92.300747310879913,"Top Quartile",107.22704249691412,"Top Quartile"]
["SOUTHPOINT","200 CANTONMENT ROAD, SINGAPORE 089763","Commercial Building","Office","Large",1986,"Certified",2019,"Existing Building for Non-Residential buildings (version 3)",33735.81,27000,0.80033649703386411,0,"Water Cooled Chilled Water Plant",3,0.69,"2018-07-10",124.31016270248143,"2nd Quartile",116.39034219127986,"Top Quartile",107.0895206014025,"Top Quartile"]
["MND BUILDING","5 MAXWELL ROAD, SINGAPORE 069110","Commercial Building","Office","Large",1970,"Platinum",2022,"Existing Non-Residental Buildings ENRB: 2017",43687,24638,0.56396639732643583,0,"Water Cooled Chilled Water Plant",2,0.57999999999999996,"2020-12-17",138.6674125301262,"2nd Quartile",120.89996557005306,"Top Quartile",106.50164052760925,"Top Quartile"]
["JALAN BESAR PLAZA","101 KITCHENER ROAD,\n#05-00\nJALAN BESAR PLAZA, SINGAPORE 208511","Commercial Building","Office","Large",1985,null,null,null,16815,0,0,0,"Water Cooled Chilled Water Plant",8,"","",105.73278620279511,"Top Quartile",103.3980808801665,"Top Quartile",106.32703716919417,"Top Quartile"]
["ENVIRONMENT BUILDING","40 SCOTTS ROAD, SINGAPORE 228231","Commercial Building","Office","Large",1986,"Platinum",2023,"GM:2021 In Operation",49122,30300,0.61683156223280811,0,"Water Cooled Chilled Water Plant",4,0.57999999999999996,"2016-11-30",98.394222547941865,"Top Quartile",97.094468873417213,"Top Quartile",106.31471642034118,"Top Quartile"]
["BEDOK CAMPUS","71 CHAI CHEE STREET, SINGAPORE 468981","Commercial Building","Office","Large",2017,"Gold",2023,"GM:2021 In Operation",21678,13750,0.63428360549866225,0,"Others","","","",103.67295599225019,"Top Quartile",103.72616246886244,"Top Quartile",104.24680597841129,"Top Quartile"]
["COLLEGE OF MEDICINE BUILDING","16 COLLEGE ROAD, SINGAPORE 169854","Commercial Building","Office","Large",1926,"Platinum",2022,"Existing Non-Residential Buildings (RECERT 2017)",11277,6555,0.58127161479116785,0,"Water Cooled Chilled Water Plant",4,0.625,"2022-11-06",144.72188130944738,"2nd Quartile",108.54570519927643,"Top Quartile",103.66396568827682,"Top Quartile"]
["AFRO-ASIA BUILDING","63 ROBINSON ROAD, SINGAPORE 068894","Commercial Building","Office","Large",2021,null,null,null,16908,13,7.6886680861130822E-4,0,"Water Cooled Chilled Water Plant",2,0.60099999999999998,"2022-09-28","",null,75.910811450201095,"Top Quartile",103.27898036432458,"Top Quartile"]
["MOUNTBATTEN SQUARE","229 MOUNTBATTEN ROAD, SINGAPORE 398007, SINGAPORE 398007","Commercial Building","Office","Large",2009,null,null,null,19916,17415,0.8744225748142197,0,"Others","","","",98.54848413336012,"Top Quartile",102.19678248644306,"Top Quartile",101.56330186784494,"Top Quartile"]
["STATE COURTS","1 HAVELOCK SQUARE, SINGAPORE 059724","Commercial Building","Office","Large",2019,"Platinum",2023,"GM:2021 In Operation",103444,72091,0.69690847221685159,0,"Water Cooled Chilled Water Plant",4,0.6,"2022-09-15",114.18552182823557,"Top Quartile",111.01193689339161,"Top Quartile",101.51868837245271,"Top Quartile"]
["CITY HOUSE","36 ROBINSON ROAD B1-01 CITY HOUSE S068877, SINGAPORE 068877","Commercial Building","Office","Large",1983,"Platinum",2021,"GM:2021 In Operation",21722.3,157771,7.2630890835684987,0,"Water Cooled Chilled Water Plant",5,0.57999999999999996,"2021-04-28",99.330549711586713,"Top Quartile",87.795914797236023,"Top Quartile",100.93325292441408,"Top Quartile"]
["CUSTOMS OPERATIONS COMMAND","1 BULIM DRIVE, SINGAPORE 648171","Commercial Building","Office","Large",2019,"Platinum",2019,"New Building for Non-Residential buildings (version 4.1)",21595,12000,0.55568418615420234,0,"Water Cooled Chilled Water Plant",4,"","",89.914813614262556,"Top Quartile",95.065624913174346,"Top Quartile",100.19962491317435,"Top Quartile"]
["HANSAPOINT","10 CHANGI BUSINESS PARK CENTRAL 2, SINGAPORE 486030","Commercial Building","Office","Large",2008,"Certified",2022,"Existing Non-Residential Buildings (RECERT 2017)",19447.5,16640,0.85563697133307626,0,"District Cooling System (DCS)","","","",146.77760637614088,null,132.45355444144491,null,99.375819514076355]
["7 CBP","7 CHANGI BUSINESS PARK CENTRAL 1, SINGAPORE 486072","Commercial Building","Office","Large",2003,"GoldPlus",2022,"Existing Building for Non-Residential buildings (version 3)",15996,14000,0.8752188047011753,0,"District Cooling System (DCS)","","","",176.66478744686171,null,161.88771005251314,null,95.925937109277328]
["HIGH STREET CENTRE","1 NORTH BRIDGE ROAD #B1-05A, SINGAPORE 179094","Commercial Building","Office","Large",1976,"Platinum",2022,"GM:2021 In Operation",43000,41000,0.95348837209302328,0,"Water-Cooled Package Units","","","",92.421358604651161,"Top Quartile",93.930988604651162,"Top Quartile",95.55705534883721,"Top Quartile"]
["GOODMAN ARTS CENTRE","90 GOODMAN ROAD BLOCK L #01-47, SINGAPORE 439053","Commercial Building","Office","Large",2010,null,null,null,16153,2843,0.17600445737633877,0,"Others","","","",78.092002723952206,"Top Quartile",92.731066055841026,"Top Quartile",94.16780164675292,"Top Quartile"]
["1A INTERNATIONAL BUSINESS PARK","1A INTERNATIONAL BUSINESS PARK, SINGAPORE 609933","Commercial Building","Office","Large",2009,"Gold",2022,"New Building for Non-Residential buildings (version 3)",19949,14913,0.74755626848463586,0,"Water Cooled Chilled Water Plant",12,0.7,"2023-01-16",94.672339465637378,"Top Quartile",102.2135069427039,"Top Quartile",93.985036843952074,"Top Quartile"]
["PLUS","20 CECIL STREET, SINGAPORE 049705","Commercial Building","Office","Large",2018,null,null,null,33123,29000,0.87552455997343237,0,"Others","","","",73.05321377894515,"Top Quartile",79.729010053437193,"Top Quartile",89.350916281737767,"Top Quartile"]
["THE OCTAGON","105 CECIL STREET, SINGAPORE 069534","Commercial Building","Office","Large",1982,"Certified",2018,"Existing Building for Non-Residential buildings (version 3)",20965,15000,0.71547817791557355,0,"Water Cooled Chilled Water Plant",8,0.72099999999999997,"2023-04-24",94.354800858573782,"Top Quartile",91.259751013594084,"Top Quartile",89.064597185785829,"Top Quartile"]
["17CBP","17 CHANGI BUSINESS PARK CENTRAL 1, SINGAPORE 486073","Commercial Building","Office","Large",2000,"GoldPlus",2022,"Existing Non-Residental Buildings ENRB: 2017",17642,12224,0.69289196236254391,0,"District Cooling System (DCS)","",0.18,"2022-12-08",103.33721346786078,null,104.92554132184559,null,88.550527717945812]
["ICON","3A INTERNATIONAL BUSINESS PARK, SINGAPORE 609935","Commercial Building","Office","Large",2009,"GoldPlus",2022,"Existing Non-Residential Buildings (RECERT 2017)",41137,40137,0.97569098378588615,0,"Water Cooled Chilled Water Plant",14,"","",84.607528259231358,"Top Quartile",81.801605124340611,"Top Quartile",88.439069450859321,"Top Quartile"]
["STANDARD CHARTERED @ CHANGI 2","9 CHANGI BUSINESS PARK CRESCENT, SINGAPORE 486005","Commercial Building","Office","Large",2014,"Gold",2020,"New Building for Non-Residential buildings (version 4)",18365,15073,0.82074598420909339,0,"District Cooling System (DCS)","","","",89.714211815954258,null,85.572774298938199,null,85.743642798802071]
["INTERPOL GOBAL COMPLEX SINGAPORE","18 NAPIER ROAD, SINGAPORE 258510","Commercial Building","Office","Large",2015,"Platinum",2014,"New Building for Non-Residential buildings (version 4)",15211,12160,0.79942147130366181,0,"Water Cooled Chilled Water Plant",6,"","",82.200676484123335,"Top Quartile",80.42523305502597,"Top Quartile",85.328502399579264,"Top Quartile"]
["ACER BUILDING","29 INTERNATIONAL BUSINESS PARK, SINGAPORE 609923","Commercial Building","Office","Large",1998,null,null,null,22438,22337,0.9954987075496925,0,"Water Cooled Chilled Water Plant",12,"","",102.88712897762726,"Top Quartile",85.225602994919342,"Top Quartile",83.679580622158838,"Top Quartile"]
["SINGAPORE GIRLS HOME","1 DEFU AVE 1, SINGAPORE 539540, SINGAPORE 539540","Commercial Building","Office","Large",2004,null,null,null,19516,1090,5.585160893625743E-2,0,"Others","","","",83.448384402541507,"Top Quartile",80.148342898134871,"Top Quartile",83.673820967411359,"Top Quartile"]
["NATIONAL SERVICE TRAINING CENTRE","91 JALAN BAHAR, SINGAPORE 649735","Commercial Building","Office","Large",2005,null,null,null,32812,34622,1.0551627453370718,0,"Others","","","",91.94971443374375,"Top Quartile",87.891266305010362,"Top Quartile",82.853594111910269,"Top Quartile"]
["SINGAPORE BOYS' HOME","3 BULIM DR, SINGAPORE 648172, SINGAPORE 648172","Commercial Building","Office","Large",2019,"GoldPlus",2022,"Existing Non-Residential Buildings (RECERT 2017)",19403,4910,0.25305365149719117,0,"Others","","","",81.873754058650732,"Top Quartile",81.058350770499402,"Top Quartile",81.116729887130845,"Top Quartile"]
["1KAY SIANG ROAD","1 KAY SIANG ROAD, SINGAPORE 248922","Commercial Building","Office","Large",1960,null,null,null,15091,9500,0.62951428003445764,0,"Others","","","",83.392564442382863,"Top Quartile",78.123525279968206,"Top Quartile",80.243548472599556,"Top Quartile"]
["HOME TEAM ACADEMY","501 OLD CHOA CHU KANG ROAD, SINGAPORE 698928","Commercial Building","Office","Large",2005,"Platinum",2019,"Existing Building for Non-Residential buildings (version 3)",133192,57969,0.43522884257312749,0,"Water Cooled Chilled Water Plant",5,1.6049,"2023-01-31",87.042146675476005,"Top Quartile",80.244224878371085,"Top Quartile",77.289569944140794,"Top Quartile"]
["HSBC BUILDING","21 COLLYER QUAY, SINGAPORE 049320, SINGAPORE 049320","Commercial Building","Office","Large",1982,null,null,null,25879,20000,0.77282738900266623,0,"Water Cooled Chilled Water Plant",12,0.72,"2016-10-26",83.410487267668771,"Top Quartile",41.210324973917075,"Top Quartile",75.913839406468568,"Top Quartile"]
["MITSUBISHI ELECTRIC BUILDING","307 ALEXANDRA ROAD, SINGAPORE 159943","Commercial Building","Office","Large",1991,"Platinum",2021,"Existing Building for Non-Residential buildings (version 3)",16654,6662,0.40002401825387296,0,"Others","","","",77.487132220487567,"Top Quartile",77.565716944878105,"Top Quartile",75.130189744205595,"Top Quartile"]
["AKZONOBLE HOUSE","3 CHANGI BUSINESS PARK VISTA, SINGAPORE 486051","Commercial Building","Office","Large",2003,"Gold",2022,"Existing Non-Residential Buildings (RECERT 2017)",19225,19225,1,0,"District Cooling System (DCS)","","","",85.460403120936277,null,78.859115734720419,null,73.628516514954484]
["NKF CENTRE","81 KIM KEAT ROAD, SINGAPORE 328836","Commercial Building","Office","Large",1999,null,null,null,19096,9096,0.4763301214914118,0,"Others","","","",67.676824989526594,"Top Quartile",68.829058441558445,"Top Quartile",71.671325408462494,"Top Quartile"]
["HAITE BUILDING","15 CHANGI BUSINESS PARK CRESCENT, SINGAPORE 486006","Commercial Building","Office","Large",2014,null,null,null,16377,11180,0.68266471270684492,0,"District Cooling System (DCS)","","","",68.841721927092863,null,72.240245466202595,null,71.161432496794291]
["RAZER SEA HQ","1 ONE-NORTH CRESCENT, SINGAPORE 138538","Commercial Building","Office","Large",2021,null,null,null,19102,16784,0.87865145010993617,0,"District Cooling System (DCS)","","","","",null,31.078368757198199,null,69.72086273688619]
["ONE RAFFLES QUAY PTE LTD","1 RAFFLES QUAY, SINGAPORE 048583","Commercial Building","Office","Large",2006,"Platinum",2022,"Existing Non-Residential Buildings (RECERT 2017)",148466,140000,0.94297684318295094,0,"District Cooling System (DCS)","","","",186.9554510797085,null,138.74708013956058,null,69.669917691592687]
["EIGHTRIUM","15A CHANGI BUSINESS PARK CENTRAL 1, SINGAPORE 486035","Commercial Building","Office","Large",2007,null,null,null,18500,18000,0.97297297297297303,0,"District Cooling System (DCS)","","","",76.705804324324319,null,65.978946486486478,null,68.855042162162164]
["SINGAPORE EXAMINATIONS AND ASSESSMENT BOARD","298 JALAN BUKIT HO SWEE, SINGAPORE 169565","Commercial Building","Office","Large",2020,"Platinum",2021,"Non-Residential Buildings NRB: 2015",22085,11905,0.53905365632782432,0,"Water Cooled Chilled Water Plant",3,0.56000000000000005,"2021-12-09",57.388453701607425,"Top Quartile",69.030095087163232,"Top Quartile",63.736701381027849,"Top Quartile"]
["ALICE @ MEDIAPOLIS","29 MEDIA CIRCLE, SINGAPORE 138565","Commercial Building","Office","Large",2018,"Platinum",2022,"Existing Non-Residential Buildings (RECERT 2017)",39500,16035,0.40594936708860757,0,"District Cooling System (DCS)","","","",53.290293670886079,null,54.689286075949362,null,62.387091139240511]
["JURONG TOWN HALL (JTH)","9 JURONG TOWN HALL ROAD, SINGAPORE 609431","Commercial Building","Office","Large",2002,"Platinum",2020,"Existing Building for Non-Residential buildings (version 3)",26248,21823,0.83141572691252663,0,"Water Cooled Chilled Water Plant",5,"","",65.2726310576044,"Top Quartile",65.987356370009138,"Top Quartile",62.203838768668092,"Top Quartile"]
["MOEHQ (GRANGE ROAD)","51 GRANGE ROAD, SINGAPORE 249564","Commercial Building","Office","Large",1978,"Certified",2017,"New Building for Non-Residential buildings (version 4.1)",20916,14101,0.67417288200420733,0,"Others","","","",51.812814113597248,"Top Quartile",48.306804360298337,"Top Quartile",56.758608720596676,"Top Quartile"]
["9 CBP","9 CHANGI BUSINESS PARK CENTRAL 1, SINGAPORE 486048","Commercial Building","Office","Large",2003,"GoldPlus",2022,"Existing Building for Non-Residential buildings (version 3)",16259,15500,0.95331816224860078,0,"District Cooling System (DCS)","","","",56.469148779137711,null,52.155671320499422,null,50.973583246202104]
["RIGEL INNOVATION CENTRE","20 CHANGI BUSINESS PARK CENTRAL 2, SINGAPORE 486031","Commercial Building","Office","Large",2015,"Gold",2016,"New Building for Non-Residential buildings (version 4.1)",15990,13141,0.82182614133833642,0,"District Cooling System (DCS)","","","",37.414474671669794,null,45.861412132582863,null,40.951581613508445]
["BCA BRADDELL CAMPUS","200 BRADDELL ROAD, SINGAPORE 579700","Commercial Building","Office","Large",1994,"Platinum",2022,"New Non-Residential Buildings (NRB: 2015) (R3)",46217.52,18758,0.40586340418092537,0,"Water Cooled Chilled Water Plant",3,"","",37.803363529674471,"Top Quartile",39.004127655486492,"Top Quartile",39.996559746174185,"Top Quartile"]
["15 CBP","15 CHANGI BUSINESS PARK CENTRAL 1, SINGAPORE 486057","Commercial Building","Office","Large",2003,"Gold",2022,"Existing Building for Non-Residential buildings (version 2.1)",19040,14000,0.73529411764705888,0,"District Cooling System (DCS)","","","",33.62480829831933,null,43.10006302521009,null,39.210755252100839]
["HDB CENTRE OF BUILDING RESEARCH","10 WOODLANDS AVENUE 8 SINGAPORE 738973\n1 WOODLANDS INDUSTRIAL PARK E3 SINGAPORE 757780\nPLEASE NOTE THAT THERE ARE 2 ADDRESSES FOR THIS PREMISE, SINGAPORE 738973","Commercial Building","Office","Large",2000,"Platinum",2014,"Existing Building for Non-Residential buildings (version 3)",20642,5300,0.25675806607886831,0,"Others","","","",53.525284371669407,"Top Quartile",34.921141846720275,"Top Quartile",38.274605173917259,"Top Quartile"]
["MOEHQ (BALESTIER)","565 BALESTIER ROAD, SINGAPORE 329927","Commercial Building","Office","Large",2022,null,null,null,16300,5670,0.34785276073619631,0,"Others","","","","",null,"",null,36.996613496932518,"Top Quartile"]
["BISHAN SPORT HALL","5, BISHAN STREET 14, SINGAPORE 579783","Commercial Building","Office","Large",1998,"Gold",2022,"Existing Non-Residental Buildings ENRB: 2017",2372,0,0,0,"Others","","","",24.311255208641004,"Top Quartile",29.546806199930018,"Top Quartile",35.210308678720565,"Top Quartile"]
["JURONG EAST ACTIVESG SPORT CENTRE","21 JURONG EAST ST 31, SINGAPORE 609517","Commercial Building","Office","Large",2000,"Gold",2022,"Existing Non-Residental Buildings ENRB: 2017",91069,8,8.7845479801029985E-5,0,"Others","","","",32.553856416563264,"Top Quartile",27.471991347220236,"Top Quartile",25.549601401135401,"Top Quartile"]
["CONNECTION ONE","BLK 167, 168 & 169 \nJALAN BUKIT MERAH, SINGAPORE 150168","Commercial Building","Office","Large",1986,"Platinum",2020,"Existing Building for Non-Residential buildings (version 3)",56369,64356,1.1416913551774912,0,"Water Cooled Chilled Water Plant",20,"","",284.66703329844415,"Bottom Quartile",72.638258617325121,"Top Quartile",1.0427717362380031,"Top Quartile"]
["THE MANAGEMENT CORPORATION- STRATA TITLE PLAN NO. 4728","9 TAMPINES GRANDE, SINGAPORE 528735","Commercial Building","Office","Large",2009,"Platinum",2021,"Existing Building for Non-Residential buildings (version 2.1)",33599,2601,7.7413018244590612E-2,0,"Water Cooled Chilled Water Plant",14,0.64,"2021-05-12",0,null,0,null,0]
["UOB TAMPINES CENTRE","1 TAMPINES CENTRAL 1, SINGAPORE 529539","Commercial Building","Office","Medium",1997,null,null,null,8905,8904,0.99988770353733858,0,"Water Cooled Chilled Water Plant",25,1.18,"2018-09-05",1508.8210443571029,"Bottom Quartile",1515.5967209432904,"Bottom Quartile",1528.2336889387984,"Bottom Quartile","Office Building with Non-Typical Activity (e.g. Industrial Function)"]
["M1 , MAIN OPERATION CENTER","10 INTERNATIONAL BUSINESS PARK, SINGAPORE 609928","Commercial Building","Office","Medium",1997,null,null,null,11816,11816,1,0,"Water Cooled Chilled Water Plant",26,"","",1221.8770311442113,"Bottom Quartile",1312.2011255924172,"Bottom Quartile",1292.4828622207176,"Bottom Quartile","Office Building with Non-Typical Activity (e.g. Industrial Function)"]
["THE ARIES","51 SCIENCE PARK ROAD, SINGAPORE 117586","Commercial Building","Office","Medium",1999,"Gold",2023,"GM:2021 In Operation",11686,11683,0.99974328256032863,0,"Others","","","",946.61479804894759,"Bottom Quartile",958.52610217354095,"Bottom Quartile",1007.7821376005477,"Bottom Quartile","Office Building with Non-Typical Activity (e.g. Industrial Function)"]
["MENICON SINGAPORE PTE LTD","8 INTERNATIONAL BUSINESS PARK, SINGAPORE 609925","Commercial Building","Office","Medium",1995,null,null,null,8288,5942,0.71694015444015446,0,"Air Cooled Chilled Water Plant","","","",1056.8227557915059,"Bottom Quartile",1052.297689430502,"Bottom Quartile",983.44230212355205,"Bottom Quartile","Office Building with Non-Typical Activity (e.g. Industrial Function)"]
["TECHSQ","722 UPPER CHANGI ROAD EAST, SINGAPORE 486854","Commercial Building","Office","Medium",1983,null,null,null,12133,8736,0.72001978076320783,0,"Water Cooled Chilled Water Plant",20,1.3779999999999999,"2022-09-30",263.06255666364461,"Bottom Quartile",186.04104508365614,"3rd Quartile",787.21173658616999,"Bottom Quartile"]
["HI-P BUILDING","11 INTERNATIONAL BUSINESS PARK, SINGAPORE 609926","Commercial Building","Office","Medium",1997,null,null,null,8213,3413,0.41556069645683674,0,"Water Cooled Chilled Water Plant",2,"","",926.21018507244617,"Bottom Quartile",970.33553512723734,"Bottom Quartile",733.09742237915498,"Bottom Quartile","Office Building with Non-Typical Activity (e.g. Industrial Function)"]
["M1 LIMITED","9 INTERNATIONAL BUSINESS PARK, SINGAPORE 609915","Commercial Building","Office","Medium",2003,"Gold",2019,"New Building for Non-Residential buildings (version 4)",10960,10960,1,0,"Water Cooled Chilled Water Plant",9,0.6,"2019-05-22",805.5617244525547,"Bottom Quartile",747.00843978102193,"Bottom Quartile",731.16576186131385,"Bottom Quartile","Office Building with Non-Typical Activity (e.g. Industrial Function)"]
["CPF BISHAN BUILDING","3 BISHAN PLACE, SINGAPORE 579838","Commercial Building","Office","Medium",1997,"GoldPlus",2021,"Existing Non-Residental Buildings ENRB: 2017",8060,6500,0.80645161290322576,0,"Water Cooled Chilled Water Plant",2020,0.56599999999999995,"2020-02-27",654.72073449131517,"Bottom Quartile",567.97196401985116,"Bottom Quartile",506.44168734491313,"Bottom Quartile","Office Building with Non-Typical Activity (e.g. Industrial Function)"]
["SUNSHINE PLAZA","10 PRINSEP LINK, SINGAPORE 187948","Commercial Building","Office","Medium",2001,null,null,null,10555,10552,0.99971577451444815,0,"Others","","","",136.52317479867364,"2nd Quartile",397.42179346281387,"Bottom Quartile",398.33542302226431,"Bottom Quartile"]
["NATIONAL ARCHIVES SINGAPORE","1 CANNING RISE, SINGAPORE 179868","Commercial Building","Office","Medium",1997,null,null,null,8214,5679,0.69138056975894813,0,"Air Cooled Chilled Water Plant","","","",440.84401022644266,"Bottom Quartile",422.72503652300952,"Bottom Quartile",397.60390796201608,"Bottom Quartile"]
["NEW WORLD CENTRE","1 JALAN BERSEH, SINGAPORE 209037","Commercial Building","Office","Medium",2000,null,null,null,8724.5300000000007,100,1.1461935485349926E-2,0,"Others","","","",283.80390691532949,"Bottom Quartile",277.37057927475746,"Bottom Quartile",344.07889937910693,"Bottom Quartile"]
["OCBC CENTRE SOUTH","18 CHURCH STREET, SINGAPORE 049479","Commercial Building","Office","Medium",1986,"Gold",2022,"Existing Non-Residential Buildings (RECERT 2017)",11047,8824,0.79876889653299543,0,"Water Cooled Chilled Water Plant",12,0.69599999999999995,"2016-06-07",361.59347334117859,"Bottom Quartile",344.620553091337,"Bottom Quartile",325.84723273286863,"Bottom Quartile","Office Building with Non-Typical Activity (e.g. Industrial Function)"]
["SULTAN-LINK","53 MOHD SULTAN ROAD, SINGAPORE 238993","Commercial Building","Office","Medium",2011,null,null,null,2181,1486,0.68133883539660711,0,"Others","","","",346.56835855112331,"Bottom Quartile",317.69989454378725,"Bottom Quartile",300.71985327831271,"Bottom Quartile"]
["THE CAVENDISH","85 SCIENCE PARK DRIVE, SINGAPORE 118259","Commercial Building","Office","Medium",1992,null,null,null,8760,0,0,0,"Others","","","",430.40304337899533,"Bottom Quartile",277.7588287671233,"Bottom Quartile",290.04740296803652,"Bottom Quartile"]
["GUTHRIE HOUSE","1 FIFTH AVENUE, SINGAPORE 268802","Commercial Building","Office","Medium",1998,null,null,null,8908,8907,0.99988774135608438,0,"Water Cooled Chilled Water Plant",5,"","",265.09362370902562,"Bottom Quartile",273.01206780422092,"Bottom Quartile",277.61321284238886,"Bottom Quartile"]
["CPIB BUILDING","2 LENGKOK BAHRU, SINGAPORE 159047","Commercial Building","Office","Medium",2004,null,null,null,5680,4202,0.73978873239436616,0,"Others","","","",231.49383802816902,"Bottom Quartile",246.97183098591549,"Bottom Quartile",259.96742957746477,"Bottom Quartile"]
["UOB KAY HIAN","8 ANTHONY ROAD, SINGAPORE 229957","Commercial Building","Office","Medium",2009,null,null,null,12875,12763,0.99130097087378644,0,"Air Cooled Chilled Water Plant","","","",273.33120000000002,"Bottom Quartile",266.70848932038831,"Bottom Quartile",259.69975922330099,"Bottom Quartile"]
["NEW BRIDGE CENTRE","336 SMITH STREET, SINGAPORE 050336","Commercial Building","Office","Medium",1986,"Gold",2019,"Existing Building for Non-Residential buildings (version 3)",10678,9000,0.84285446712867573,0,"Water-Cooled Package Units","","","",211.89316913279643,"3rd Quartile",241.12633451957299,"Bottom Quartile",257.26115471061996,"Bottom Quartile"]
["LAND TRANSPORT AUTHORITY","SIN MING OFFICE\n10 SIN MING DRIVE, SINGAPORE 575701","Commercial Building","Office","Medium",1990,"Platinum",2011,"New Building for Non-Residential buildings (version 3)",12890,9670,0.75019394879751744,0,"Water Cooled Chilled Water Plant","",0.7,"2023-01-31",282.87021567106285,"Bottom Quartile",270.53065011636926,"Bottom Quartile",257.17409231962762,"Bottom Quartile","Office Building with Non-Typical Activity (e.g. Industrial Function)"]
["MAYBANK TOWER","2 BATTERY ROAD, SINGAPORE 049907","Commercial Building","Office","Medium",2001,"Certified",2020,"Existing Non-Residental Buildings ENRB: 2017",14989,14873,0.99226099139368873,0,"Water Cooled Chilled Water Plant",1,"","",315.97618253385815,"Bottom Quartile",276.77396757622256,"Bottom Quartile",256.37247314697447,"Bottom Quartile"]
["TAN CHONG TOWER","15 QUEEN STREET, SINGAPORE 188537","Commercial Building","Office","Medium",1980,null,null,null,10471,7202,0.68780441218603761,0,"Others","","","",227.94052144016806,"Bottom Quartile",242.90866201890938,"Bottom Quartile",250.43400821316015,"2nd Quartile"]
["THE CRIMSON","31 SCIENCE PARK ROAD, SINGAPORE 117611","Commercial Building","Office","Medium",1997,null,null,null,11291,10627,0.94119209990257724,0,"Water Cooled Chilled Water Plant",2,0.7,"2017-06-03",256.61915950757242,"Bottom Quartile",257.49486759365863,"Bottom Quartile",249.88562571959969,"2nd Quartile","Office Building with Non-Typical Activity (e.g. Industrial Function)"]
["ARC 380","380 JALAN BESAR, SINGAPORE 209000","Commercial Building","Office","Medium",2018,null,null,null,11658,11559,0.99150797735460627,0,"Water Cooled Chilled Water Plant",5,"","",141.96703980099502,"2nd Quartile",224.15980528392518,"Bottom Quartile",234.92660319094182,"2nd Quartile"]
["BEA BUILDING","60 ROBINSON ROAD, SINGAPORE 068892","Commercial Building","Office","Medium",2009,null,null,null,7783,5867,0.75382243350892975,0,"Air Cooled Chilled Water Plant","","","",262.95053064371064,"Bottom Quartile",249.72294616471797,"Bottom Quartile",233.00322369266351,"2nd Quartile"]
["1CBP","1 CHANGI BUSINESS PARK AVENUE 1, SINGAPORE 486058","Commercial Building","Office","Medium",45149,"Certified",2022,"Existing Non-Residential Buildings (RECERT 2017)",10180,11695,1.1488212180746562,0,"District Cooling System (DCS)","","","","",null,"",null,230.99279469548134]
["223 @MOUNTBATTEN","223 MOUNTBATTEN RD, #01-05, SINGAPORE 398008, SINGAPORE 398008","Commercial Building","Office","Medium",2012,null,null,null,3809,1000,0.26253609871357314,0,"District Cooling System (DCS)","","","",205.89045943817277,null,182.05873457600418,null,226.41768443160933]
["INCOME CENTRE","75 BRAS BASAH ROAD, SINGAPORE 189557","Commercial Building","Office","Medium",1990,"GoldPlus",2022,"GM:2021 In Operation",8790,6539,0.7439135381114903,0,"Others","","","",229.55747440273038,"Bottom Quartile",212.09093060295791,"3rd Quartile",225.31584072810011,"2nd Quartile"]
["OCBC TAMPINES CENTRE TWO","31 TAMPINES AVENUE 4, SINGAPORE 529680","Commercial Building","Office","Medium",1998,"Gold",2022,"Existing Non-Residential Buildings (RECERT 2017)",7600,7419,0.97618421052631577,0,"Water Cooled Chilled Water Plant",10,0.79700000000000004,"2022-08-31",314.06721710526318,"Bottom Quartile",301.07987236842104,"Bottom Quartile",224.50304605263156,"2nd Quartile"]
["SINGAPORE POOLS BUILDING","210 MIDDLE ROAD, SINGAPORE 188994","Commercial Building","Office","Medium",2013,"GoldPlus",2022,"Existing Non-Residential Buildings (RECERT 2017)",13121,12587,0.95930188247846959,0,"Water Cooled Chilled Water Plant",10,0.67,"2016-09-23",227.25874552244494,"Bottom Quartile",224.25443944821279,"Bottom Quartile",222.12190381830652,"2nd Quartile"]
["AIA ALEXANDRA","371 ALEXANDRA ROAD, AIA ALEXANDRA #01-01. SINGAPORE 159963, SINGAPORE 159963","Commercial Building","Office","Medium",1995,null,null,null,14801,17642,1.19194649010202,0,"Air Cooled Chilled Water Plant","","","",234.11232349165596,"Bottom Quartile",234.8556516451591,"Bottom Quartile",221.12451861360719,"2nd Quartile"]
["HPL HOUSE","50 CUSCADEN ROAD, SINGAPORE 249724","Commercial Building","Office","Medium",1980,null,null,null,7372,7163,0.97164948453608246,0,"Others","","","",216.26585322843189,"3rd Quartile",212.43017498643516,"3rd Quartile",220.36118149755831,"2nd Quartile"]
["IOB BUILDING","IOB BUILDING @ 64 CECIL STREET, SINGAPORE 049711","Commercial Building","Office","Medium",1984,null,null,null,5111,2100,0.41087849735863824,0,"Water Cooled Chilled Water Plant",30,"","",242.3744864018783,"Bottom Quartile",237.84151829387596,"Bottom Quartile",220.08530620230874,"2nd Quartile"]
["3RD SCDF DIVISION HQ / YISHUN FIRE STATION","533 YISHUN INDUSTRIAL PARK A, SINGAPORE 768774","Commercial Building","Office","Medium",2005,null,null,null,13098,9195,0.70201557489693078,0,"Air Cooled Chilled Water Plant","",2,"2019-11-01",214.44621392579018,"3rd Quartile",203.4183005038937,"3rd Quartile",220.01164223545581,"2nd Quartile"]
["RHB BANK BUILDING","90 CECIL STREET, SINGAPORE 069531","Commercial Building","Office","Medium",1974,null,null,null,5711,5711,1,0,"Water-Cooled Package Units","","","",222.4462405883383,"3rd Quartile",208.86382419891439,"3rd Quartile",216.73091227455788,"2nd Quartile"]
["SULTAN PLAZA","100 JALAN SULTAN, SINGAPORE 199001","Commercial Building","Office","Medium",1980,"Gold",2017,"Existing Building for Non-Residential buildings (version 3)",14787,18000,1.2172854534388313,0,"Water Cooled Chilled Water Plant",6,0.77,"2023-03-13",202.54317846757283,"3rd Quartile",201.73386352877526,"3rd Quartile",215.06336849935752,"2nd Quartile"]
["OCBC TAMPINES CENTRE ONE","11 TAMPINES CENTRAL 1, SINGAPORE 529542","Commercial Building","Office","Medium",1998,"Gold",2022,"Existing Non-Residential Buildings (RECERT 2017)",10577,9171,0.86707005767230783,0,"Water Cooled Chilled Water Plant",3,0.68,"2022-07-25",236.91848350193814,"Bottom Quartile",240.97801834168479,"Bottom Quartile",214.7826226718351,"2nd Quartile"]
["SEMBCORP HQ BUILDING","30 HILL STREET, SINGAPORE 179360","Commercial Building","Office","Medium",2000,"Gold",2020,"Existing Building for Non-Residential buildings (version 3)",9811,9809,0.99979614718173482,0,"Water Cooled Chilled Water Plant",7,"","",188.51090612577718,"3rd Quartile",207.91122209764549,"3rd Quartile",210.97344817042097,"2nd Quartile"]
["BURLINGTON SQUARE","175 BENCOOLEN STREET, SINGAPORE 189649","Commercial Building","Office","Medium",1998,null,null,null,11080,11080,1,0,"Others","","","",239.15601353790612,"Bottom Quartile",224.4811489169675,"Bottom Quartile",207.78184476534295,"2nd Quartile"]
["CHOA CHU KANG CENTRE","309 CHOA CHU KANG AVE 4, SINGAPORE 680309","Commercial Building","Office","Medium",2021,"GoldPlus",2022,"Existing Non-Residential Buildings (RECERT 2017)",11015,7800,0.70812528370403993,0,"Others","","","","",null,199.39217703132093,"3rd Quartile",207.1978765320018,"2nd Quartile"]
["ST JAMES POWER STATION","3 SENTOSA GATEWAY, SINGAPORE 098544","Commercial Building","Office","Medium",2021,null,null,null,13032,8650,0.66375076734192762,0,"Water Cooled Chilled Water Plant",1,0.65600000000000003,"2022-11-16","",null,52.536740331491714,"Top Quartile",205.71665131982812,"2nd Quartile"]
["50 SCOTTS ROAD","50 SCOTTS ROAD, SINGAPORE 228242","Commercial Building","Office","Medium",2008,"Gold",2020,"Existing Building for Non-Residential buildings (version 2.1)",13553,11791,0.86999188371578251,0,"Others","",0.85,"2020-11-10",202.68195233527632,"3rd Quartile",199.96352468088244,"3rd Quartile",204.106493027374,"2nd Quartile"]
["TAMPINES PLAZA 2","5 TAMPINES CENTRAL 1, SINGAPORE 529541","Commercial Building","Office","Medium",1999,null,null,null,10417,8463,0.81242200249592011,0,"Water Cooled Chilled Water Plant",6,0.63800000000000001,"2022-04-25",189.6582989344341,"3rd Quartile",196.07641355476625,"3rd Quartile",201.60631659786887,"2nd Quartile"]
["JURONG REGIONAL LIBRARY","21 JURONG EAST CENTAL 1, SINGAPORE 609732","Commercial Building","Office","Medium",1988,null,null,null,12021,12021,1,0,"Water Cooled Chilled Water Plant",20,"","",168.53292987272275,"3rd Quartile",201.38285500374343,"3rd Quartile",200.79274436402963,"2nd Quartile"]
["137 TELOK AYER","137 TELOK AYER STREET SINGAPORE 068602, SINGAPORE 068602","Commercial Building","Office","Medium",2021,null,null,null,9233,9233,1,0,"Others","","","","",null,190.27352214881404,"3rd Quartile",200.57217914004116,"2nd Quartile"]
["SIF BUILDING","96 ROBINSON ROAD, SINGAPORE 068899","Commercial Building","Office","Medium",2007,null,null,null,7844,5473,0.69773074961754211,0,"Others","","","",222.86959204487508,"3rd Quartile",206.67533911269763,"3rd Quartile",199.04083758286589,"2nd Quartile"]
["RAFFLES FINANCIAL CENTRE PTE LTD","25 NORTH BRIDGE\n25 NORTH BRIDGE ROAD, SINGAPORE 179104","Commercial Building","Office","Medium",2009,null,null,null,6521,5800,0.88943413586873177,0,"Others","","","",198.62418187394573,"3rd Quartile",141.33872258856005,"2nd Quartile",197.39390430915503,"2nd Quartile"]
["SENTOSA DEVELOPMENT CORPORATION","33 ARTILLERY AVENUE SENTOSA, SINGAPORE 099958","Commercial Building","Office","Medium",2014,"Gold",2021,"Existing Building for Non-Residential buildings (version 3)",5494,5200,0.94648707681106659,0,"Others","","","",202.93681288678559,"3rd Quartile",194.10442300691662,"3rd Quartile",197.25412267928647,"2nd Quartile"]
["2ND SCDF DIVISION HQ / TAMPINES FIRE STATION","1 TAMPINES INDUSTRIAL AVENUE 3, SINGAPORE 528777","Commercial Building","Office","Medium",2006,null,null,null,14629,10960,0.74919680087497431,0,"Air Cooled Chilled Water Plant","",1.44,"2019-11-01",170.55528060701349,"3rd Quartile",174.3173648232962,"3rd Quartile",192.59160844897124,"2nd Quartile"]
["KEBUN BARU COMMUNITY CLUB","216 ANG MO KIO AVENUE 4, SINGAPORE 569897","Commercial Building","Office","Medium",2018,null,null,null,5790.26,2290,0.39549173957646117,0,"Water-Cooled Package Units",null,"","",176.90104244023584,"3rd Quartile",205.67220642941768,"3rd Quartile",190.47221022890164,"2nd Quartile"]
["ORCHARD BUILDING","1 GRANGE ROAD, SINGAPORE 239693","Commercial Building","Office","Medium",1997,"Gold",2022,"Existing Building for Non-Residential buildings (version 3)",13889,10279,0.74008207934336523,0,"Water Cooled Chilled Water Plant",5,0.62,"2022-02-17",186.4623083015336,"3rd Quartile",188.43703650370796,"3rd Quartile",190.4671322629419,"2nd Quartile"]
["MAXWELL CHAMBERS PTE LTD","32 MAXWELL ROAD, SINGAPORE 069115","Commercial Building","Office","Medium",2009,null,null,null,7016,6694,0.95410490307867735,0,"Others","","","",180.60005131128847,"3rd Quartile",190.08262257696691,"3rd Quartile",185.95952109464082,"2nd Quartile"]
["TAMPINES PLAZA 1","3 TAMPINES CENTRAL 1, SINGAPORE 529540","Commercial Building","Office","Medium",1999,null,null,null,10416,8436,0.80990783410138245,0,"Water Cooled Chilled Water Plant",6,0.65300000000000002,"2022-04-25",129.775633640553,"2nd Quartile",161.03677035330261,"3rd Quartile",181.91436251920123,"2nd Quartile"]
["NATIONAL DESIGN CENTRE","111 MIDDLE ROAD, SINGAPORE 188969, SINGAPORE 188969","Commercial Building","Office","Medium",1900,"Platinum",2022,"Existing Non-Residential Buildings (RECERT 2017)",8292,5981,0.72129763627592858,0,"Others",null,null,null,148.40462011577426,"3rd Quartile",160.47621804148577,"3rd Quartile",181.569825132658,"2nd Quartile"]
["INCOME AT TAMPINES POINT","2 TAMPINES CENTRAL 6, SINGAPORE 529483","Commercial Building","Office","Medium",1998,"GoldPlus",2022,"Existing Non-Residental Buildings ENRB: 2017",10638,8697,0.8175408911449521,0,"Others","","","",175.07399229178415,"3rd Quartile",177.15365200225608,"3rd Quartile",180.87973115247229,"2nd Quartile"]
["BHARAT BUILDING","3 RAFFLES PLACE, SINGAPORE 048817, SINGAPORE 048617","Commercial Building","Office","Medium",1987,null,null,null,7272,5417,0.74491199119911988,0,"District Cooling System (DCS)","","","",177.51607673267327,null,177.49898652365235,null,179.43916941694167]
["TECHQUEST BUILDING","7 INTERNATIONAL BUSINESS PARK, SINGAPORE 609919","Commercial Building","Office","Medium",1997,null,null,null,9381,6944,0.74021959279394522,0,"Air Cooled Chilled Water Plant","","","",89.911425221191763,"Top Quartile",27.046402302526381,"Top Quartile",179.11255729666345,"2nd Quartile"]
["4TH SCDF DIVISION HQ / BUKIT BATOK FIRE STATION","80 BUKIT BATOK ROAD, SINGAPORE 658072","Commercial Building","Office","Medium",2005,null,null,null,13060,7671,0.58736600306278719,0,"Air Cooled Chilled Water Plant","",1.56,"2019-11-01",173.82110260336907,"3rd Quartile",167.26818529862175,"3rd Quartile",178.07670750382846,"2nd Quartile"]
["ENABLING VILLAGE","20 LENGKOK BAHRU, SINGAPORE 159053","Commercial Building","Office","Medium",2015,null,null,null,14998,11858,0.79063875183357779,0,"Others","","","",169.0493452460328,"3rd Quartile",171.3109081210828,"3rd Quartile",176.35836244832646,"2nd Quartile"]
["KING'S CENTRE","390 HAVELOCK ROAD, SINGAPORE 169662","Commercial Building","Office","Medium",1998,"Platinum",2021,"Existing Building for Non-Residential buildings (version 3)",10850,8800,0.81105990783410142,0,"Water Cooled Chilled Water Plant",10,0.65,"2012-08-15",167.31504331797234,"3rd Quartile",162.02150967741935,"3rd Quartile",176.18051059907833,"2nd Quartile"]
["ROYAL GROUP BUILDING","3 PHILLIP STREET, SINGAPORE 048693","Commercial Building","Office","Medium",1996,null,null,null,10580,1000,9.4517958412098299E-2,0,"Others","","","",173.08972117202268,"3rd Quartile",171.57270793950852,"3rd Quartile",169.25713610586013,"2nd Quartile"]
["GREAT EASTERN CHANGI","200 CHANGI ROAD, SINGAPORE 419734","Commercial Building","Office","Medium",2005,"GoldPlus",2021,"Existing Non-Residental Buildings ENRB: 2017",10891,9574,0.87907446515471488,0,"Air Cooled Chilled Water Plant","",0.82,"2021-03-31",155.56537508034157,"3rd Quartile",148.53824258562116,"2nd Quartile",165.87560830043154,"2nd Quartile"]
["83 CURIE","83 SCIENCE PAR DRIVE, SINGAPORE 118258","Commercial Building","Office","Medium",1992,"Certified",2022,"Existing Non-Residental Buildings ENRB: 2017",7816,0,0,0,"Others","","","",165.294252814739,"3rd Quartile",162.96750383828049,"3rd Quartile",165.5667400204708,"2nd Quartile"]
["NORTH BRIDGE CENTRE","420 NORTH BRIDGE ROAD, SINGAPORE 188727","Commercial Building","Office","Medium",1993,"Gold",2014,"Existing Building for Non-Residential buildings (version 3)",8797.4639999999999,8797467,1000.0003410073631,0,"Water Cooled Chilled Water Plant",2012,"","",137.50059789957652,"2nd Quartile",149.97630567172538,"2nd Quartile",163.9327776732022,"2nd Quartile"]
["TONG BUILDING","302 ORCHARD ROAD, SINGAPORE 238862","Commercial Building","Office","Medium",1998,null,null,null,14708,14362,0.97647538754419361,0,"Water Cooled Chilled Water Plant",40,"","",146.58366467228717,"3rd Quartile",154.35365379385368,"3rd Quartile",163.78156377481645,"2nd Quartile"]
["SCOTTS SPAZIO PTE LTD","51 SCOTTS ROAD, SINGAPORE 228241","Commercial Building","Office","Medium",2009,null,null,null,14094,10000,0.70952178231871721,0,"Others","","","",150.85209663686678,"3rd Quartile",156.46504895700298,"3rd Quartile",157.26624095359728,"2nd Quartile"]
["TOKIO MARINE CENTRE","20 MCCALLUM STREET, SINGAPORE 069046","Commercial Building","Office","Medium",2010,"GoldPlus",2020,"Existing Building for Non-Residential buildings (version 2.1)",14671,13192,0.89918887601390496,0,"Water Cooled Chilled Water Plant",13,"","",151.95572217299434,"3rd Quartile",147.1908254379388,"2nd Quartile",156.67880853384227,"2nd Quartile"]
["DAS SPEKTRUM@CBP","9 CHANGI BUSINESS PARK VISTA  #01-01, SINGAPORE 486041","Commercial Building","Office","Medium",2015,"Platinum",2020,"New Building for Non-Residential buildings (version 4)",12767,10352,0.8108404480300776,0,"District Cooling System (DCS)","","","",148.65995222056867,null,152.57132450849849,null,156.28293491031565]
["ALFA CENTRE","99 BUKIT TIMAH ROAD, SINGAPORE 229835","Commercial Building","Office","Medium",1994,null,null,null,7526,7526,1,0,"Water Cooled Chilled Water Plant",28,"","",192.21174594738238,"3rd Quartile",178.48479271857562,"3rd Quartile",155.39230799893701,"2nd Quartile"]
["STAMFORD COURT","61 STAMFORD ROAD, SINGAPORE 178892","Commercial Building","Office","Medium",1996,"Platinum",2022,"GM:2021 In Operation",6832,6354,0.93003512880562056,0,"Water Cooled Chilled Water Plant",4,0.52,"2020-02-22",146.6377049180328,"3rd Quartile",148.2336943793911,"2nd Quartile",154.51087529274005,"2nd Quartile"]
["HILLVIEW COMMUNITY CLUB","1 HILLVIEW RISE, SINGAPORE 667970","Commercial Building","Office","Medium",2017,"Gold",2017,"New Building for Non-Residential buildings (version 4.1)",3867.79,2800,0.72392761758006507,0,"Water Cooled Chilled Water Plant",0,"","",117.35596555138723,"2nd Quartile",131.95117625310579,"2nd Quartile",152.49812166637795,"2nd Quartile"]
["ONE FINLAYSON GREEN","1 FINLAYSON GREEN, SINGAPORE 049246","Commercial Building","Office","Medium",1995,null,null,null,10403,8299,0.79775064885129288,0,"Air Cooled Chilled Water Plant","",1.1299999999999999,"2018-02-21",161.27151783139482,"3rd Quartile",141.67391617802556,"2nd Quartile",150.4273219263674,"2nd Quartile"]
["CENTROPOD","80 CHANGI ROAD, #01-44, SINGAPORE 419715","Commercial Building","Office","Medium",2015,null,null,null,5973,3360,0.56253139126067297,0,"Others","","","",132.69070483843964,"2nd Quartile",153.52880462079355,"3rd Quartile",148.81558011049722,"2nd Quartile"]
["FAR EASTERN BANK BUILDING","156 CECIL STREET, SINGAPORE 069544","Commercial Building","Office","Medium",1991,"Platinum",2022,"Existing Non-Residental Buildings ENRB: 2017",11211.7,10239,0.91324241640429193,0,"Water Cooled Chilled Water Plant",1,0.65,"2022-12-21",135.44652728845759,"2nd Quartile",130.83636825815887,"2nd Quartile",148.13671521713923,"2nd Quartile"]
["ABI PLAZA","11 KEPPEL ROAD, SINGAPORE 089057","Commercial Building","Office","Medium",1994,null,null,null,12586,1341,0.1065469569362784,0,"Water Cooled Chilled Water Plant",7,"","",143.55639202288256,"3rd Quartile",134.40050452884157,"2nd Quartile",145.72866677260447,"2nd Quartile"]
["HOUGANG COMMUNITY CLUB","35 HOUGANG AVENUE 3 , SINGAPORE 538840, SINGAPORE 538840","Commercial Building","Office","Medium",2021,null,null,null,4276,3498,0.81805425631431239,0,"Others","","","","",null,151.44246959775492,"3rd Quartile",144.07787652011226,"2nd Quartile"]
["ERA APAC CENTRE","450 LOR 6 TOA PAYOH, SINGAPORE 319394","Commercial Building","Office","Medium",2012,"Certified",2022,"Existing Non-Residental Buildings ENRB: 2017",4121,4121,1,0,"Others","","","",237.15504731861196,"Bottom Quartile",160.75725066731377,"3rd Quartile",141.62402329531668,"2nd Quartile"]
["BEACH CENTRE","NO 15 BEACH ROAD, SINGAPORE 189677","Commercial Building","Office","Medium",1985,"Platinum",2022,"Existing Non-Residential Buildings (RECERT 2017)",7669,7110,0.92710914069630979,0,"Water Cooled Chilled Water Plant",6,"","",125.60511018385709,"2nd Quartile",130.54360151258314,"2nd Quartile",141.58556526274612,"2nd Quartile"]
["ROYAL ONE PHILLIP","1 PHILLIP STREET, SINGAPORE 048692","Commercial Building","Office","Medium",1992,null,null,null,5000,3500,0.7,0,"Water Cooled Chilled Water Plant",6,"","",151.123088,"3rd Quartile",151.487664,"3rd Quartile",141.03904800000001,"2nd Quartile"]
["158 CECIL STREET","158 CECIL STREET, SINGAPORE 069545","Commercial Building","Office","Medium",2009,"Gold",2022,"Existing Building for Non-Residential buildings (version 3)",11977,9975,0.83284628872004673,0,"Others","","","",137.50714118727561,"2nd Quartile",132.94245303498371,"2nd Quartile",140.43137931034482,"2nd Quartile"]
["PHILIPPINES AIRLINES BUILDING","135 CECIL STREET, SINGAPORE 069536","Commercial Building","Office","Medium",2007,null,null,null,9374,604,6.4433539577554932E-2,0,"Air Cooled Chilled Water Plant","","","",167.29440580328568,"3rd Quartile",131.0791423085129,"2nd Quartile",139.63385534457009,"2nd Quartile"]
["AETOS SECURITY","145 WEST COAST ROAD, SINGAPORE 127367","Commercial Building","Office","Medium",2012,null,null,null,3340.4,110071,32.951442940965151,0,"Others","","","",170.08430128128367,"3rd Quartile",146.17518860016764,"2nd Quartile",139.47470362830799,"2nd Quartile"]
["GRACE GLOBAL RAFFLES","137 MARKET STREET, SINGAPORE 048943, SINGAPORE 048943","Commercial Building","Office","Medium",2011,null,null,null,5030,4024,0.8,0,"Others",null,null,null,115.42385685884692,"2nd Quartile",110.518986083499,"Top Quartile",138.86707753479126,"2nd Quartile"]
["ANSON HOUSE","72 ANSON ROAD, SINGAPORE 079911","Commercial Building","Office","Medium",1998,"Certified",2021,"Existing Non-Residental Buildings ENRB: 2017",9673,8369,0.86519177090871502,0,"Air Cooled Chilled Water Plant","",0.96,"2021-05-21",164.91198180502431,"3rd Quartile",140.80622350873566,"2nd Quartile",136.38831799855268,"2nd Quartile"]
["HOUGANG SPORT CENTRE","93 HOUGANG AVENUE 4, SINGAPORE 538832","Commercial Building","Office","Medium",1993,"Gold",2022,"Existing Non-Residental Buildings ENRB: 2017",9471,956,0.10093971069580826,0,"Others","","","",135.60251821349382,"2nd Quartile",137.77605321507761,"2nd Quartile",136.28606271777005,"2nd Quartile"]
["JIT POH BUILDING","19 KEPPEL ROAD, SINGAPORE 089058","Commercial Building","Office","Medium",1975,null,null,null,7200,7200,1,0,"Water Cooled Chilled Water Plant",12,"","",137.19249722222222,"2nd Quartile",137.805575,"2nd Quartile",135.69198611111111,"2nd Quartile"]
["CECIL COURT","138 CECIL STREET, SINGAPORE 069538","Commercial Building","Office","Medium",1986,null,null,null,10926,7985,0.73082555372505953,0,"Water Cooled Chilled Water Plant",36,"","",138.5858154859967,"2nd Quartile",128.84291231923851,"2nd Quartile",134.01545945451215,"2nd Quartile"]
["TUNG ANN ASSOCIATION BUILDING","141 CECIL ST, SINGAPORE 069541","Commercial Building","Office","Medium",1988,null,null,null,6034,800,0.1325820351342393,0,"Air Cooled Chilled Water Plant","","","",144.45477295326484,"3rd Quartile",140.46771461716938,"2nd Quartile",133.79293172025191,"2nd Quartile"]
["HIGH STREET PLAZA","77 HIGH STREET, SINGAPORE 179433","Commercial Building","Office","Medium",1975,null,null,null,10418,10418,1,0,"Water Cooled Chilled Water Plant",39,0.8,"2023-01-03",129.53842580149743,"2nd Quartile",135.02324438471874,"2nd Quartile",133.57248416202725,"2nd Quartile"]
["MAJLIS UGAMA ISLAM SINGAPURA","273 BRADDELL ROAD, SINGAPORE 579702","Commercial Building","Office","Medium",2009,null,null,null,7522,5165,0.68665248604094653,0,"Others","","","",127.54254187716033,"2nd Quartile",107.71536825312417,"Top Quartile",133.2650890720553,"2nd Quartile"]
["MEWAH BUILDING","5 INTERNATIONAL BUSINESS PARK, SINGAPORE 609914","Commercial Building","Office","Medium",1995,null,null,null,7433,5865,0.78904883627068478,0,"Others","","","",111.63808018296784,"2nd Quartile",117.45466164401991,"2nd Quartile",133.15497914704696,"2nd Quartile"]
["991G","991G ALEXANDRA ROAD SINGAPORE 119975, SINGAPORE 119975","Commercial Building","Office","Medium",2009,"Gold",2021,"Existing Non-Residental Buildings ENRB: 2017",5274,4701,0.891353811149033,0,"Others","","","",131.89431740614336,"2nd Quartile",124.7835532802427,"2nd Quartile",130.79071482745545,"2nd Quartile"]
["251 NORTH BRIDGE ROAD","251 NORTH BRIDGE ROAD, SINGAPORE 179102","Commercial Building","Office","Medium",1990,null,null,null,9938,5454,0.54880257597102033,0,"Water Cooled Chilled Water Plant",13,"","",114.20809015898571,"2nd Quartile",129.25135842221775,"2nd Quartile",129.25135842221775,"2nd Quartile"]
["BANGKOK BANK BUILDING","180 CECIL STREET, SINGAPORE 069546","Commercial Building","Office","Medium",1978,null,null,null,12755.95,12992,1.0185050897816312,0,"Water Cooled Chilled Water Plant",35,"","",130.79402161344314,"2nd Quartile",129.01265291883394,"2nd Quartile",128.67045574810186,"2nd Quartile"]
["EXYTE","16 INTERNATIONAL BUSINESS PARK, SINGAPORE 609929","Commercial Building","Office","Medium",2002,null,null,null,6359,5543,0.87167793678251293,0,"Air Cooled Chilled Water Plant","","","",118.81854065104577,"2nd Quartile",142.5506447554647,"2nd Quartile",128.12886145620382,"2nd Quartile"]
["SULTAN LINK","55 MOHD SULTAN ROAD, SINGAPORE 238995","Commercial Building","Office","Medium",2011,null,null,null,757,755,0.99735799207397624,0,"Others","","","",94.929167767503316,"Top Quartile",59.186116248348746,"Top Quartile",126.48895640686922,"2nd Quartile"]
["SULTAN LINK","61 MOHD SULTAN ROAD, SINGAPORE 239001","Commercial Building","Office","Medium",2011,null,null,null,2599,1904,0.73258945748364757,0,"Others","","","",120.33521739130434,"2nd Quartile",114.48308195459794,"2nd Quartile",124.33958830319355,"2nd Quartile"]
["METTA BUILDING","32 SIMEI STREET 1, SINGAPORE 529950","Commercial Building","Office","Medium",2005,null,null,null,5463,3405,0.62328390993959359,0,"Others","","","",108.82635914332785,"Top Quartile",117.59210140948197,"2nd Quartile",121.29372139849899,"2nd Quartile"]
["10 RAEBURN PARK","10 RAEBURN PARK, SINGAPORE 088702","Commercial Building","Office","Medium",2013,null,null,null,14893,10000,0.67145638890754045,0,"Others",null,null,null,112.28723225676492,"2nd Quartile",129.18163902504534,"2nd Quartile",117.99944806284832,"2nd Quartile"]
["THE GLOBE","100 CECIL STREET, SINGAPORE 069532","Commercial Building","Office","Medium",1993,null,null,null,5824,4070,0.69883241758241754,0,"Air Cooled Chilled Water Plant","","","",138.01088942307692,"2nd Quartile",119.05404532967033,"2nd Quartile",117.98011160714286,"2nd Quartile"]
["FAMILY JUSTICE COURTS","3 HAVELOCK SQUAR, SINGAPORE 059725","Commercial Building","Office","Medium",2001,null,null,null,10700,9095,0.85,0,"Others","","","",125.3849308411215,"2nd Quartile",112.96692803738317,"Top Quartile",117.85892523364485,"2nd Quartile"]
["THONG TECK BUILDING","15 SCOTTS ROAD, SINGAPORE 228218, SINGAPORE 228218","Commercial Building","Office","Medium",1973,null,null,null,11481,10000,0.87100426792091279,0,"Water Cooled Chilled Water Plant",1,null,null,89.433233167842516,"Top Quartile",95.582127863426521,"Top Quartile",117.35444908980054,"2nd Quartile"]
["CIVIL SERVICE COLLEGE","31 NORTH BUONA VISTA ROAD, SINGAPORE 275983","Commercial Building","Office","Medium",1999,"Platinum",2021,"Existing Non-Residental Buildings ENRB: 2017",12709,9578,0.75363915335588949,0,"Water Cooled Chilled Water Plant",21,0.55200000000000005,"2019-12-01",122.17760642064678,"2nd Quartile",97.501455661342362,"Top Quartile",117.33556377370367,"2nd Quartile"]
["PIXEL","10 CENTRAL EXCHANGE GREEN, SINGAPORE 138649, SINGAPORE 138649","Commercial Building","Office","Medium",2009,null,null,null,5111,3967,0.77616904715319901,0,"Others","","","",109.79854627274506,"Top Quartile",102.13342594404226,"Top Quartile",115.78262570925455,"2nd Quartile"]
["150 CECIL STREET","150 CECIL STREET, SINGAPORE 069543","Commercial Building","Office","Medium",1995,null,null,null,10943,7432,0.67915562460020107,0,"Water Cooled Chilled Water Plant",26,null,null,129.97086265192362,"2nd Quartile",120.15827835145755,"2nd Quartile",114.1044274878918,"2nd Quartile"]
["TAMPINES CONCOURSE","11 TAMPINES CONCOURSE, SINGAPORE 528729","Commercial Building","Office","Medium",2009,"GoldPlus",2021,"Existing Building for Non-Residential buildings (version 2.1)",11520,10260,0.890625,0,"Others","","","",147.07425781250001,"3rd Quartile",136.88418663194446,"2nd Quartile",111.7706640625,"2nd Quartile"]
["BOON SIEW BUILDING","75 BUKIT TIMAH ROAD, SINGAPORE 229833","Commercial Building","Office","Medium",1984,null,null,null,11950,18945,1.5853556485355649,0,"Water Cooled Chilled Water Plant",38,"","",117.47417824267784,"2nd Quartile",105.40931548117155,"Top Quartile",111.02458158995816,"2nd Quartile"]
["PEC LTD.","14 INTERNATIONAL BUSINESS PARK, SINGAPORE 609922","Commercial Building","Office","Medium",1999,null,null,null,10121,6471,0.63936369923920566,0,"Air Cooled Chilled Water Plant","",0.9,"2023-03-10",114.68669103843494,"2nd Quartile",111.1259262918684,"Top Quartile",109.77467641537397,"2nd Quartile"]
["KEMBANGAN-CHAI CHEE COMMUNITY HUB","11 JALAN UBI, SINGAPORE 409074","Commercial Building","Office","Medium",2014,null,null,null,7853.6,852,0.10848528063563206,0,"Others","","","",117.98298359987774,"2nd Quartile",125.66494983192419,"2nd Quartile",109.33907507385148,"2nd Quartile"]
["FAR EAST FINANCE BUILDING","14 ROBINSON ROAD, SINGAPORE 048545","Commercial Building","Office","Medium",1985,null,null,null,6268,4765,0.7602105934907466,0,"Water-Cooled Package Units","","","",103.46575781748564,"Top Quartile",104.02469208679005,"Top Quartile",109.17107370772177,"2nd Quartile"]
["EASTGATE","46 EAST COAST ROAD #B1-01, SINGAPORE 428766","Commercial Building","Office","Medium",1998,null,null,null,7386,6950,0.94096940157053888,0,"Air Cooled Chilled Water Plant","","","",58.329647982669918,"Top Quartile",86.57671405361495,"Top Quartile",108.76219740048741,"Top Quartile"]
["GENTING CENTRE","3 LIM TECK LIM ROAD, SINGAPORE 088934","Commercial Building","Office","Medium",1986,null,null,null,12948,10762,0.83117083719493356,0,"Water Cooled Chilled Water Plant",4,0.54900000000000004,"2020-07-20",140.57826691380907,"2nd Quartile",134.37455514365152,"2nd Quartile",108.00736329935125,"Top Quartile"]
["ROBINSON 112","112 ROBINSON ROAD, SINGAPORE 068902","Commercial Building","Office","Medium",2003,"Platinum",2023,"GM:2021 In Operation",10720,8988,0.83843283582089556,0,"Water-Cooled Package Units","",1.63,"2022-05-10",133.90452425373135,"2nd Quartile",106.49783115671642,"Top Quartile",106.56548507462686,"Top Quartile"]
["TAHIR BUILDING","140 ROBINSON ROAD, SINGAPORE 068907","Commercial Building","Office","Medium",2016,null,null,null,9453,629,6.653972283931027E-2,0,"Others","","","",105.16824711731725,"Top Quartile",116.39131281074792,"2nd Quartile",106.45288797207236,"Top Quartile"]
["MACDONALD HOUSE","40A ORCHARD ROAD, SINGAPORE 238838, SINGAPORE 238838","Commercial Building","Office","Medium",1999,null,null,null,9000,8200,0.91111111111111109,0,"District Cooling System (DCS)","","","",132.92385888888887,null,95.731499999999997,null,105.88695]
["PEOPLE'S ASSOCIATION HEADQUARTERS","9 KING GEORGE AVENUE SINGAPORE 208581, SINGAPORE 208581","Commercial Building","Office","Medium",2009,"GoldPlus",2007,"New Building (version 1)",14624,12774,0.87349562363238509,0,"Water-Cooled Package Units",null,"","",114.86032070568929,"2nd Quartile",98.402026121444194,"Top Quartile",104.43766411378556,"Top Quartile"]
["ISEAS - YUSOF ISHAK INSTITUTE","30 HENG MUI KENG TERRACE, SINGAPORE 119614","Commercial Building","Office","Medium",1998,"Platinum",2022,"Existing Non-Residential Buildings (RECERT 2017)",9882.18,5739,0.5807423058474952,0,"Water Cooled Chilled Water Plant",4,0.89,"2023-02-27",100.55605139756612,"Top Quartile",101.71753600926111,"Top Quartile",103.91138392540917,"Top Quartile"]
["THE OXLEY","9 OXLEY RISE, SINGAPORE 238697","Commercial Building","Office","Medium",1996,null,null,null,7387,3667,0.49641261675917153,0,"Others","","","",106.09061594693381,"Top Quartile",113.07850683633413,"2nd Quartile",103.484005685664,"Top Quartile"]
["PEK CHUAN BUILDING","116 LAVENDER STREET, SINGAPORE 338730","Commercial Building","Office","Medium",1983,null,null,null,5976,4621,0.77325970548862111,0,"Water-Cooled Package Units","","","",101.73197289156627,"Top Quartile",107.37929384203481,"Top Quartile",103.13032128514057,"Top Quartile"]
["FAMILY LINK @ LENGKOK BAHRU","8 LENGKOK BAHRU, SINGAPORE 159052, SINGAPORE 159052","Commercial Building","Office","Medium",2009,"Gold",2023,"GM:2021 In Operation",6898,1275,0.18483618440127572,0,"Others","","","",109.78212960278341,"Top Quartile",109.06811829515802,"Top Quartile",103.06209915917657,"Top Quartile"]
["ANSON CENTRE","51 ANSON ROAD, SINGAPORE 079904","Commercial Building","Office","Medium",1974,null,null,null,8675,6960,0.80230547550432274,0,"Water Cooled Chilled Water Plant",20,"","",119.98643919308358,"2nd Quartile",119.11958155619595,"2nd Quartile",99.40051873198847,"Top Quartile"]
["MAXWELL CHAMBER SUITES","28 MAXWELL RD, SINGAPORE 069120","Commercial Building","Office","Medium",2020,null,null,null,10685,7000,0.65512400561534867,0,"Others","","","",94.705872718764624,"Top Quartile",93.170467945718286,"Top Quartile",98.491965372016836,"Top Quartile"]
["CES CENTRE","171 CHIN SWEE ROAD, SINGAPORE 169877","Commercial Building","Office","Medium",2015,null,null,null,12253,11184,0.91275605974047169,0,"Water Cooled Chilled Water Plant",7.5,0.68559999999999999,"2019-04-14",94.672356157675665,"Top Quartile",92.973072716885667,"Top Quartile",97.614995511303363,"Top Quartile"]
["SULTAN LINK","63 MOHD SULTAN ROAD, SINGAPORE 239002","Commercial Building","Office","Medium",2011,null,null,null,1063,887,0.83443085606773282,0,"Others","","","",119.96989651928504,"2nd Quartile",91.565380997177797,"Top Quartile",95.458137347130759,"Top Quartile"]
["THE KINGSMEN EXPERIENCE","22 CHANGI BUSINESS PARK 2, SINGAPORE 486032","Commercial Building","Office","Medium",2018,null,null,null,14291,10245,0.71688475264152263,0,"Others","","","",85.557023301378479,"Top Quartile",94.024853404240432,"Top Quartile",93.435769365334835,"Top Quartile"]
["TEMPCO TECHNOMINIUM","16 AYER RAJAH CRESCENT, SINGAPORE 139965","Commercial Building","Office","Medium",1999,null,null,null,11470,4500,0.39232781168265041,0,"Air Cooled Chilled Water Plant","","","",135.84196948561464,"2nd Quartile",154.89880122057542,"3rd Quartile",92.429634699215342,"Top Quartile"]
["SENJA CASHEW COMMUNITY CLUB","101 BUKIT PANJANG ROAD, SINGAPORE 679910","Commercial Building","Office","Medium",2019,"Gold",2019,"Existing Building for Non-Residential buildings (version 3)",13855,1200,8.6611331649224105E-2,0,"Others","","","",62.693162757127389,"Top Quartile",100.03952002887044,"Top Quartile",91.780203536629372,"Top Quartile"]
["REGISTRY OF MARRIAGES","7 CANNING RISE, SINGAPORE 179869, SINGAPORE 179869","Commercial Building","Office","Medium",1983,"Gold",2012,"New Building for Non-Residential buildings (version 3)",5055,4044,0.8,0,"Others","","","",84.562081107814052,"Top Quartile",86.971501483679532,"Top Quartile",91.01416221562809,"Top Quartile"]
["36 ARMENIAN STREET","36 ARMENIAN STREET, SINGAPORE 179934","Commercial Building","Office","Medium",2010,"Certified",2009,"New Building for A/C buildings (version 2)",5901,297,5.0330452465683781E-2,0,"Others","","","",82.203665480427034,"Top Quartile",82.730893068971355,"Top Quartile",84.467149635654977,"Top Quartile"]
["N/A","10 SCIENCE CENTRE ROAD, SINGAPORE 609079","Commercial Building","Office","Medium",2014,null,null,null,7043,5200,0.73832173789578304,0,"Others","","","",82.839123952860987,"Top Quartile",81.819771404231162,"Top Quartile",83.397422973164851,"Top Quartile"]
["CREATIVE INNOVATIVE DEVELOPMENT CENTRE","90 EU TONG SEN STREET, SINGAPORE 059811","Commercial Building","Office","Medium",1930,null,null,null,8900,4000,0.449438202247191,0,"Others","","","",75.121058426966286,"Top Quartile",86.210120224719105,"Top Quartile",82.960017977528096,"Top Quartile"]
["120 ROBINSON ROAD","120 ROBINSON ROAD, SINGAPORE 068913","Commercial Building","Office","Medium",2006,null,null,null,11390,5900,0.51799824407374895,0,"Others","","","",92.240517998244073,"Top Quartile",83.747124670763824,"Top Quartile",78.924363476733973,"Top Quartile"]
["ICON @ CHANGI","228 CHANGI ROAD, SINGAPORE 419741","Commercial Building","Office","Medium",2012,null,null,null,2508.1999999999998,2513,1.0019137229885975,0,"Others","","","",66.238601387449179,"Top Quartile",76.838724982058864,"Top Quartile",76.702352284506816,"Top Quartile"]
["NATIONAL COMMUNITY LEADERSHIP INSTITUTE","70 SOUTH BUONA VISTA ROAD, SINGAPORE 118176","Commercial Building","Office","Medium",2000,"Gold",2020,"Existing Non-Residental Buildings ENRB: 2017",6327,5400,0.8534850640113798,33,"Others","","","",87.274351193298557,"Top Quartile",79.954074600916698,"Top Quartile",75.691778093883357,"Top Quartile"]
["JTC LAUNCHPAD@JURONG INNOVATION DISTRICT","2 CLEANTECH LOOP, SINGAPORE 637144","Commercial Building","Office","Medium",2017,"Platinum",2022,"New Building for Non-Residential buildings (version 4.1)",5382,3438,0.6387959866220736,0,"Water Cooled Chilled Water Plant",11,"","",62.034559643255292,"Top Quartile",69.81605351170569,"Top Quartile",73.938127090301009,"Top Quartile"]
["LENG KEE COMMUNITY CENTRE","400 LENGKOK BAHRU, SINGAPORE 159049, SINGAPORE 159049","Commercial Building","Office","Medium",2017,null,null,null,5594,5594,1,0,"Water Cooled Chilled Water Plant",1,null,null,64.54537003932785,"Top Quartile",67.557509831962818,"Top Quartile",70.283212370396853,"Top Quartile"]
["ICB ENTERPRISE HOUSE","116 MIDDLE ROAD, SINGAPORE 188972, SINGAPORE 188972","Commercial Building","Office","Medium",1979,null,null,null,6421,5821,0.90655661111976327,0,"Water-Cooled Package Units",null,null,null,52.954921351814356,"Top Quartile",55.098012770596476,"Top Quartile",69.362904532004364,"Top Quartile"]
["UNITED HOUSE","20 KRAMAT LAME, SINGAPORE 228773","Commercial Building","Office","Medium",1976,null,null,null,5099,3570,0.70013728181996471,0,"Others","","","",56.068978231025689,"Top Quartile",62.16589919592078,"Top Quartile",64.110462835850171,"Top Quartile"]
["UPPER THOMSON COMMUNITY HUB","600 UPPER THOMSON ROAD, SINGAPORE 574421","Commercial Building","Office","Medium",2017,null,null,null,6493,4142,0.63791775758509162,0,"Others","","","",53.705720006160476,"Top Quartile",66.243935006930542,"Top Quartile",63.733143385184043,"Top Quartile"]
["YUHUA COMMUNITY CLUB","90 BOON LAY WAY, SINGAPORE 609958","Commercial Building","Office","Medium",1989,null,null,null,4552.8500000000004,4118,0.90448839737746678,0,"District Cooling System (DCS)","","","",53.72459009192044,null,86.529316801563851,null,54.206705689842622]
["55 MARKET STREET","55 MARKET STREET, SINGAPORE 048941","Commercial Building","Office","Medium",2020,"Gold",2022,"Existing Non-Residential Buildings (RECERT 2017)",7958,7724,0.97059562704197033,0,"Water-Cooled Package Units",null,"","",25.077632570997736,"Top Quartile",45.811158582558434,"Top Quartile",51.954888162854992,"Top Quartile"]
["108RR","108 ROBINSON ROAD, SINGAPORE 068900","Commercial Building","Office","Medium",2023,"Platinum",2022,"Existing Non-Residential Buildings (ENRB: 2017)",5568.53,4900,0.87994497650187753,0,"Others","","","","",null,"",null,48.793561316900508,"Top Quartile"]
["SULTAN LINK","57 MOHD SULTAN ROAD, SINGAPORE 238997","Commercial Building","Office","Medium",2011,null,null,null,2853,2125,0.74483000350508233,0,"Others","","","",41.083785488958995,"Top Quartile",30.980785138450752,"Top Quartile",47.333683841570277,"Top Quartile"]
["BISHAN FIRE STATION","1 MARYMOUNT LANE, SINGAPORE 574029","Commercial Building","Office","Medium",2001,null,null,null,6092,3802,0.62409717662508213,0,"Others","",0.99,"2019-11-01",51.216135915955356,"Top Quartile",45.793933026920556,"Top Quartile",44.482042022324357,"Top Quartile"]
["DIOCESAN CENTRE BUILDING","1 FRANCIS THOMAS DRIVE, SINGAPORE 359340","Commercial Building","Office","Medium",2009,null,null,null,6691,3316,0.49559109251233002,0,"Others","","","",45.211046181437752,"Top Quartile",47.812983111642502,"Top Quartile",43.761345090419965,"Top Quartile"]
["SOOKEE HQ","7 CHANGI BUSINESS PARK VISTA, SINGAPORE 486042","Commercial Building","Office","Medium",2014,null,null,null,13000,6000,0.46153846153846156,0,"Air Cooled Chilled Water Plant","","","",46.217094615384617,"Top Quartile",39.48430384615385,"Top Quartile",42.64066230769231,"Top Quartile"]
["MOE EVANS ROAD","21 EVANS ROAD, SINGAPORE 259366","Commercial Building","Office","Medium",1984,null,null,null,7597,2170,0.2856390680531789,0,"Others","","","",2.0021139923654072,"Top Quartile",29.856390680531788,"Top Quartile",41.776490720021059,"Top Quartile"]
["THE CHADWICK","81 SCIENCE PARK DRIVE, SINGAPORE 118257","Commercial Building","Office","Medium",1992,null,null,null,14406,0,0,0,"Others","","","",50.116790226294604,"Top Quartile",41.236849229487717,"Top Quartile",41.413343051506317,"Top Quartile"]
["SINGAPORE BOYS' HOSTEL","149 COMPASSVALE BOW, SINGAPORE 544690, SINGAPORE 544690","Commercial Building","Office","Medium",2016,null,null,null,5530,689,0.12459312839059675,0,"Others","","","",38.824394213381552,"Top Quartile",43.074390596745026,"Top Quartile",40.094115732368898,"Top Quartile"]
["SENGKANG FIRE STATION","50 BUANGKOK DRIVE, SINGAPORE 545064","Commercial Building","Office","Medium",2001,null,null,null,7304,2658,0.36391018619934284,0,"Others","",1.1100000000000001,"2019-11-01",55.195208105147863,"Top Quartile",48.824746714129247,"Top Quartile",39.158064074479739,"Top Quartile"]
["HUB SYNERGY POINT","70 ANSON ROAD, SINGAPORE 079905","Commercial Building","Office","Medium",2022,null,null,null,14673,11262,0.76753220200368022,0,"Water Cooled Chilled Water Plant",1,"","","",null,"",null,35.264772030259664,"Top Quartile"]
["SULTAN LINK","59 MOHD SULTAN ROAD, SINGAPORE 238999","Commercial Building","Office","Medium",2011,null,null,null,2673,1980,0.7407407407407407,0,"Others","","","",27.177702955480733,"Top Quartile",29.617283950617285,"Top Quartile",33.548447437336328,"Top Quartile"]
["450 ALEXANDRA","450 ALEXANDRA, SINGAPORE 119960","Commercial Building","Office","Medium",1976,"Certified",2022,"Existing Non-Residental Buildings ENRB: 2017",14486,10888,0.75162225597128263,0,"Water Cooled Chilled Water Plant",6,0.67,"2022-12-01",4.9812922822035066,"Top Quartile",9.3262460306502835,"Top Quartile",10.780753831285379,"Top Quartile"]
["UNILEVER ASIA PTE LTD","18 NEPAL PARK, SINGAPORE 139407","Commercial Building","Office","Medium",2013,"Platinum",2022,"Existing Non-Residental Buildings ENRB: 2017",9606,6077,0.6326254424318134,0,"Water Cooled Chilled Water Plant",11,"","",0,null,0,null,0]
["MAPLETREE BUSINESS CITY","20 PASIR PANJANG ROAD, SINGAPORE 117439","Commercial Building","Office",null,2017,"Platinum",2022,"Existing Building for Non-Residential buildings (version 3)",128557,110438,0.85905862769044083,0,"Water Cooled Chilled Water Plant",13,0.61,"2022-11-24",null,""]
["NOVENA SQUARE","238A THOMSON ROAD, SINGAPORE 307684","Commercial Building","Office",null,2000,"GoldPlus",2022,"Existing Building for Non-Residential buildings (version 3)",33837,32589,0.96311729763276888,0,"Water Cooled Chilled Water Plant",4,0.65,"2021-11-10",null,""]
["NOVENA SQUARE","238B THOMSON ROAD, SINGAPORE 307685","Commercial Building","Office",null,2000,"GoldPlus",2022,"Existing Building for Non-Residential buildings (version 3)",13951,11465,0.82180488853845601,0,"Water Cooled Chilled Water Plant",4,0.65,"2021-11-10",null,""]
["DNV TECHNOLOGY CENTRE","16 SCIENCE PARK DRIVE, SINGAPORE 118227","Commercial Building","Office",null,2013,"Platinum",2021,"Existing Building for Non-Residential buildings (version 3)",7251,7251,1,0,"Water Cooled Chilled Water Plant",10,0.65,"2021-02-22",null,"",null,null,null,""]
["CENTRAL PLAZA","298 TIONG BAHRU ROAD, SINGAPORE 168730","Commercial Building","Office",null,1996,"Platinum",2021,"Existing Building for Non-Residential buildings (version 3)",18784,18784,1,0,"Water Cooled Chilled Water Plant",6,0.57899999999999996,"2021-11-11",null,"",null,"",null,""]
["ROYAL MERUKH S.E.A","21 MERCHANT ROAD S058267, SINGAPORE 058267","Commercial Building","Office",null,2010,null,null,null,4605,4134,0.89771986970684037,0,"Others","","","",null,"",null,"",null,""]
["AMNIOS","1 BIOPOLIS DRIVE, SINGAPORE 138622","Commercial Building","Office",null,2011,"Gold",2011,"New Building for Non-Residential buildings (version 3)",9518,7660,0.80479092246270223,0,"District Cooling System (DCS)","","",""]
["HAW PAR GLASS TOWER","178 CLEMENCEAU AVENUE, SINGAPORE 239926","Commercial Building","Office",null,2001,null,null,null,4228,3580,0.84673604541154213,0,"Water-Cooled Package Units","","","",null,"",null,"",null,""]
["HARBOURFRONT TOWER TWO","3 HARBOURFRONT PLACE, SINGAPORE 099254, SINGAPORE 099254","Commercial Building","Office",null,2002,"Gold",2022,"Existing Building for Non-Residential buildings (version 2.1)",19190,14313,0.74585721730067744,0,"Water Cooled Chilled Water Plant",9,0.80900000000000005,"2022-10-01",null,"",null,"",null,""]
["NANKIN ROW","3 PICKERING STREET, SINGAPORE 048660","Commercial Building","Office",null,2002,"Platinum",2019,"Existing Building for Non-Residential buildings (version 3)",16986,14936,0.879312374896974,0,"Water Cooled Chilled Water Plant",2,"","",null,"",null,"",null,""]
["CENTROS","20 BIOPOLIS WAY, SINGAPORE 138668","Commercial Building","Office",null,2008,"GoldPlus",2022,"Existing Building for Non-Residential buildings (version 3)",21087,17180,0.81471996964954707,0,"District Cooling System (DCS)","",0.05,"2010-08-01"]
["CHROMOS","10 BIOPOLIS ROAD, SINGAPORE 138670","Commercial Building","Office",null,2008,"GoldPlus",2022,"Existing Building for Non-Residential buildings (version 3)",15141,13134,0.86744600752922529,0,"District Cooling System (DCS)","",0.05,"2010-08-01"]
["GENOME","60 BIOPOLIS STREET, SINGAPORE 138672","Commercial Building","Office",null,2008,"GoldPlus",2022,"Existing Building for Non-Residential buildings (version 3)",17652,11887,0.67340811239519605,0,"District Cooling System (DCS)","",0.05,"2010-08-01"]
["MATRIX","30 BIOPOLIS STREET, SINGAPORE 138671","Commercial Building","Office",null,2008,"GoldPlus",2022,"Existing Non-Residential Buildings (RECERT 2017)",27611,26341,0.95400383904965413,0,"District Cooling System (DCS)","",0.05,"2010-08-01"]
["NANOS","31 BIOPOLIS WAY, SINGAPORE 138669","Commercial Building","Office",null,2008,"GoldPlus",2022,"Existing Building for Non-Residential buildings (version 3)",19872,19872,1,0,"District Cooling System (DCS)","",0.05,"2010-08-01"]
["PROTEOS","61 BIOPOLIS DRIVE, SINGAPORE 138673","Commercial Building","Office",null,2008,"GoldPlus",2022,"Existing Building for Non-Residential buildings (version 3)",33486,29813,0.89031236934838442,0,"District Cooling System (DCS)","",0.05,"2010-08-01"]
["CREATE","1 CREATE WAY, SINGAPORE 138602","Commercial Building","Office",null,2011,"Platinum",2020,"Existing Building for Non-Residential buildings (version 3)",61999,53783,0.86748173357634806,0,"District Cooling System (DCS)","","",""]
["MARINA BAY FINANCIAL CENTRE TOWER 3","12 MARINA BOULEVARD, SINGAPORE 018982","Commercial Building","Office",null,2012,"Platinum",2019,"Existing Building for Non-Residential buildings (version 3)",151777,147045,0.96882268064331223,0,"District Cooling System (DCS)","","",""]
["MARINA BAY FINANCIAL CENTRE TOWER 2","10 MARINA BOULEVARD, SINGAPORE 018983","Commercial Building","Office",null,2009,"Platinum",2020,"Existing Building for Non-Residential buildings (version 3)",113150,108000,0.95448519664162612,0,"District Cooling System (DCS)","","",""]
["TAN TECK GUAN BUILDING","16A COLLEGE ROAD, SINGAPORE 169855","Commercial Building","Office",null,1911,null,null,null,599,504,0.84140233722871449,0,"Others","","","",null,"",null,"",null,""]
["MACALISTER HALL","8A COLLEGE ROAD, SINGAPORE 169858","Commercial Building","Office",null,2010,null,null,null,2105,2043,0.97054631828978621,0,"Others","","","",null,"",null,"",null,""]
["KING EDWARD VII HALL","12 COLLEGE ROAD, SINGAPORE 169852","Commercial Building","Office",null,1957,null,null,null,2126,1930,0.90780809031044218,0,"Others","","","",null,"",null,"",null,""]
["HARROWER HALL","14 COLLEGE ROAD, SINGAPORE 169853","Commercial Building","Office",null,1931,null,null,null,1030,1024,0.99417475728155336,0,"Others","","","",null,"",null,"",null,""]
["SUNTEC TOWER ONE","7 TEMASEK BOULEVARD, SINGAPORE 038987","Commercial Building","Office",null,1995,"GoldPlus",2022,"Existing Non-Residental Buildings ENRB: 2017",58854,48484,0.82380127094165223,0,"Water Cooled Chilled Water Plant",9,0.61,"2023-04-08",null,"",null,"",null,""]
["SUNTEC TOWER TWO","9 TEMASEK BOULEVARD, SINGAPORE 038989","Commercial Building","Office",null,1995,"GoldPlus",2022,"Existing Non-Residental Buildings ENRB: 2017",58854,48484,0.82380127094165223,0,"Water Cooled Chilled Water Plant",9,0.61,"2023-04-08",null,"",null,"",null,""]
["SUNTEC TOWER THREE","8 TEMASEK BOULEVARD, SINGAPORE 038988","Commercial Building","Office",null,1997,"GoldPlus",2022,"Existing Non-Residental Buildings ENRB: 2017",58854,48484,0.82380127094165223,0,"Water Cooled Chilled Water Plant",9,0.61,"2022-04-08",null,"",null,"",null,""]
["SUNTEC TOWER FOUR","6 TEMASEK BOULEVARD, SINGAPORE 038986","Commercial Building","Office",null,1997,"GoldPlus",2022,"Existing Non-Residental Buildings ENRB: 2017",58854,48484,0.82380127094165223,0,"Water Cooled Chilled Water Plant",9,0.61,"2022-04-08",null,"",null,"",null,""]
["SUNTEC TOWER FIVE","5 TEMASEK BOULEVARD, SINGAPORE 038985","Commercial Building","Office",null,1994,"GoldPlus",2022,"Existing Non-Residental Buildings ENRB: 2017",48792,37672,0.77209378586653554,0,"Water Cooled Chilled Water Plant",9,0.61,"2022-04-08",null,"",null,"",null,""]
["DSO NATIONAL LABORATORIES","27 MEDICAL DRIVE, SINGAPORE 117510","Commercial Building","Office",null,2003,null,null,null,16180,13980,0.8640296662546354,0,"Water Cooled Chilled Water Plant",1,"","",null,"",null,"",null,""]
["MSF BUILDING","MCST 1334 ,514 THOMSON ROAD,SLF BUILDING ANNEXE SINGAPORE 298179, SINGAPORE 298179","Commercial Building","Office",null,1986,null,null,null,4316.07,44615,10.336950049466298,0,"Water Cooled Chilled Water Plant",16,-3.32,"2011-01-31",null,"",null,"",null,""]
["MILLENIA TOWER","1 TEMASEK AVENUE SINGAPORE 039192, SINGAPORE 039192","Commercial Building","Office",null,1998,"Gold",2022,"Existing Building for Non-Residential buildings (version 3)",73019,62802,0.86007751407167998,0,"District Cooling System (DCS)","",0.67,"2013-03-20"]
["CINTECH III","77 SCIENCE PARK DRIVE, SINGAPORE SCIENCE PARK 1, SINGAPORE 118256","Commercial Building","Office",null,1994,"GoldPlus",2022,"Existing Non-Residential Buildings (RECERT 2017)",8394,10962,1.3059328091493925,0,"Water Cooled Chilled Water Plant",9,0.6,"2017-02-01",null,"",null,""]
["CINTECH I","73 SCIENCE PARK DRIVE, 118254, SINGAPORE 118254","Commercial Building","Office",null,1988,"Certified",2022,"Existing Non-Residential Buildings (RECERT 2017)",15192,14693,0.96715376513954709,0,"Water Cooled Chilled Water Plant",8,0.59,"2019-03-01",null,"",null,""]
["CINTECH IV","79 SCIENCE PARK DRIVE, SCIENCE PARK 1, SINGAPORE 118264","Commercial Building","Office",null,2009,"GoldPlus",2022,"Existing Non-Residential Buildings (RECERT 2017)",12110,10380,0.8571428571428571,0,"Water Cooled Chilled Water Plant",8,0.63,"2022-10-01",null,"",null,""]
["IMMUNOS","8A BIOMEDICAL GROVE, SINGAPORE 138648, SINGAPORE 138648","Commercial Building","Office",null,2006,null,null,null,22604,20000,0.88479915059281544,0,"District Cooling System (DCS)","","",""]
["DSO NATIONAL LABORATORIES","14 SCIENCE PARK DRIVE, SINGAPORE 118226","Commercial Building","Office",null,2013,"GoldPlus",2013,"New Building for Non-Residential buildings (version 4)",23379,14451,0.61811882458616707,0,"Water Cooled Chilled Water Plant",10,0.65,"2020-10-20",null,"",null,""]
["SOUTH BEACH COMPLEX (MCST NO. 4622)","38 BEACH ROAD, SINGAPORE 189767","Commercial Building","Office",null,2015,"Platinum",2021,"New Building for Non-Residential buildings (version 3)",71830.399999999994,67523,0.94003374615761581,0,"Water Cooled Chilled Water Plant",7,0.85,"2023-06-30",null,"",null,""]
["MND BUILDING ANNEXE A","9 MAXWELL ROAD, SINGAPORE 069112","Commercial Building","Office",null,1970,"Platinum",2022,"Existing Non-Residental Buildings ENRB: 2017",28366,4695,0.16551505323274343,0,"Water Cooled Chilled Water Plant",2,0.57999999999999996,"2020-12-17",null,"",null,""]
["MND BUILDING ANNEXE B","7 MAXWELL ROAD, SINGAPORE 069111","Commercial Building","Office",null,1983,"Platinum",2022,"Existing Non-Residental Buildings ENRB: 2017",12176,5383,0.44209921156373194,0,"Others","",0.57999999999999996,"2020-12-17",null,"",null,""]
["THE CENTRAL","8 EU TONG SEN STREET, SINGAPORE 059818","Commercial Building","Office",null,2008,null,null,null,31412,29843,0.95005093594804535,0,"Water Cooled Chilled Water Plant",13,"","",null,"",null,""]
["THE CENTRAL","12 EU TONG SEN STREET, SINGAPORE 059819, SINGAPORE 059819","Commercial Building","Office",null,2008,null,null,null,4292,3523,0.82082945013979491,0,"Others","","","",null,"",null,""]
["RAFFLES CITY TOWER","250 NORTH BRIDGE ROAD, SINGAPORE 179101, SINGAPORE 179101","Commercial Building","Office",null,1986,null,null,null,44934,41000,0.91244937018738592,0,"Water Cooled Chilled Water Plant",15,0.75,"2016-12-09"]
["SYMBIOSIS","3 FUSIONOPOLIS WAY, SINGAPORE 138633, SINGAPORE 138633","Commercial Building","Office",null,2008,null,null,null,1,1,1,0,"District Cooling System (DCS)"]
["THE CAPITOL KEMPINSKI HOTEL SINGAPORE","15 STAMFORD ROAD, SINGAPORE 178906","Commercial Building","Hotel",null,2015,null,null,null,12621,12210,0.96743522700261464,157,"District Cooling System (DCS)",null,null,null,509.62366294271453,null,527.93962443546468,null,603.4870454005229]
["VALUE HOTEL THOMSON","592 BALESTIER ROAD, SINGAPORE 329901","Commercial Building","Hotel",null,2009,null,null,null,6400,6310,0.98593750000000002,366,"Others","","","",523.02237500000001,"Bottom Quartile",575.52592968750002,"Bottom Quartile",529.61853125000005,"Bottom Quartile"]
["THE SINGAPORE RESORT & SPA","2 BUKIT MANIS ROAD, SINGAPORE 099891","Commercial Building","Hotel",null,1990,null,null,null,13752,12790,0.93004653868528209,215,"Water Cooled Chilled Water Plant",11,"","",363.3336060209424,"Bottom Quartile",410.12418266433974,"Bottom Quartile",445.96515052356023,"Bottom Quartile"]
["OASIA RESORT SENTOSA","23 BEACH VIEW, SINGAPORE 098679","Commercial Building","Hotel",null,2011,null,null,null,10453,6998,0.66947287859944515,191,"District Cooling System (DCS)","","","",305.92673873529128,null,214.34177748014926,null,431.69406868841475]
["STUDIO M HOTEL REPUBLIC ICONIC HOTEL PTE LTD","3 NANSON ROAD, SINGAPORE 238910","Commercial Building","Hotel",null,2010,"Gold",2021,"Existing Building for Non-Residential buildings (version 3)",8103,8103,1,360,"Others","",1,"2022-01-12",364.82681475996549,"Bottom Quartile",298.75243490065407,"Bottom Quartile",421.55671973343209,"Bottom Quartile"]
["THE ST REGIS HOTEL SINGAPORE","29 TANGLIN ROAD, SINGAPORE 247911","Commercial Building","Hotel",null,2006,"GoldPlus",2006,"New Building (version 1)",27089,6940,0.25619255048174538,298,"Water Cooled Chilled Water Plant",16,0.3,"2013-08-02",340.02834250064598,"Bottom Quartile",358.50493595186242,"Bottom Quartile",406.1484399571782,"Bottom Quartile"]
["HOTEL 81 DICKSON","3 DICKSON ROAD, SINGAPORE 209530","Commercial Building","Hotel",null,2008,null,null,null,5020,5021,1.0001992031872511,235,"Others","","","",334.49351593625499,"Bottom Quartile",373.7397609561753,"Bottom Quartile",386.95610557768924,"Bottom Quartile"]
["HILTON GARDEN INN SINGAPORE","3 BELILIOS ROAD, SINGAPORE 219924, SINGAPORE 219924","Commercial Building","Hotel",null,2015,null,null,null,10803,8964,0.82976950846986952,328,"Others","","","",323.81933907247986,"Bottom Quartile",313.3960122188281,"Bottom Quartile",385.23185041192261,"Bottom Quartile"]
["INTERCONTINENTAL SINGAPORE ROBERTSON QUAY","1 NANSON ROAD, SINGAPORE 238909","Commercial Building","Hotel",null,2017,null,null,null,14284,12367,0.86579389526743211,225,"Water Cooled Chilled Water Plant",7,0.68200000000000005,"2022-10-01",377.75658078969474,"Bottom Quartile",363.16985788294596,"Bottom Quartile",380.74760221226546,"Bottom Quartile"]
["W SINGAPORE SENTOSA COVE HOTEL","21 OCEAN WAY, SINGAPORE 098374","Commercial Building","Hotel",null,2012,null,null,null,23800,13296,0.55865546218487394,240,"Water Cooled Chilled Water Plant",10,"","",335.26718487394959,"Bottom Quartile",348.08420168067227,"Bottom Quartile",369.72537815126049,"Bottom Quartile"]
["IBIS SINGAPORE ON BENCOOLEN","170 BENCOOLEN STREET, SINGAPORE 189657","Commercial Building","Hotel",null,2017,null,null,null,15022,12568,0.83663959526028486,537,"Air Cooled Chilled Water Plant","",1.55,"2022-07-01",323.80303887631476,"Bottom Quartile",315.73921581680202,"Bottom Quartile",364.58609905471974,"Bottom Quartile"]
["V HOTEL BENCOOLEN","48 BENCOOLEN STREET, SINGAPORE 189627","Commercial Building","Hotel",null,2013,"GoldPlus",2015,"New Building for Non-Residential buildings (version 4)",5261,5000,0.95038965976050183,273,"Air Cooled Chilled Water Plant","","","",289.22777038585821,"Bottom Quartile",323.32874928720776,"Bottom Quartile",348.91471203193311,"Bottom Quartile"]
["V HOTEL LAVENDER","70 JELLICOE ROAD, SINGAPORE 208767","Commercial Building","Hotel",null,2011,"GoldPlus",2012,"New Building for Non-Residential buildings (version 3)",18986,18000,0.94806699673443595,888,"Water Cooled Chilled Water Plant",11,0.7,"2015-12-10",330.75861160855368,"Bottom Quartile",311.46460549878856,"Bottom Quartile",346.72111029179393,"Bottom Quartile"]
["ALOFT SINGAPORE NOVENA ( WEST WING)","WEST WING 16 AH HOOD ROAD, SINGAPORE 329982","Commercial Building","Hotel",null,2012,"Gold",2022,"Existing Non-Residential Buildings (RECERT 2017)",14304,13715,0.95882270693512306,382,"Others","",0.95,"2023-01-20",321.82263055172086,"Bottom Quartile",318.06867948778978,"Bottom Quartile",344.06095587185223,"Bottom Quartile"]
["HOTEL RE! PTE LTD","175A CHIN SWEE ROAD,\nSINGAPORE 169879, SINGAPORE 169879","Commercial Building","Hotel",null,2008,"Certified",2018,"Existing Building for Non-Residential buildings (version 2.1)",6086,5400,0.88728228721656255,140,"Water-Cooled Package Units","","","",271.89157574761748,"Bottom Quartile",323.28019224449554,"Bottom Quartile",343.22393197502464,"Bottom Quartile"]
["HOTEL G SINGAPORE","200 MIDDLE ROAD, SINGAPORE 188980","Commercial Building","Hotel",null,2013,null,null,null,8784,8702,0.99066484517304187,306,"Others","","","",327.08294171220399,"Bottom Quartile",312.64549180327867,"Bottom Quartile",338.33960837887071,"Bottom Quartile"]
["CARLTON CITY HOTEL SINGAPORE","1 GOPENG STREET, SINGAPORE 078862","Commercial Building","Hotel",null,2014,"Platinum",2023,"GM:2021 In Operation",15237,15237,1,386,"Water Cooled Chilled Water Plant",10,0.622,"2017-06-27",295.67560543414061,"Bottom Quartile",313.24268556802519,"Bottom Quartile",338.15073833431779,"Bottom Quartile"]
["VILLAGE HOTEL BUGIS","390 VICTORIA STREET, SINGAPORE 188061","Commercial Building","Hotel",null,1983,"GoldPlus",2021,"Existing Building for Non-Residential buildings (version 3)",19301,11520,0.59686026630744526,393,"Water Cooled Chilled Water Plant",4,0.60299999999999998,"2021-05-01",308.29312988964301,"Bottom Quartile",317.23007098077818,"Bottom Quartile",329.91605305424588,"Bottom Quartile"]
["SHANGRI-LA SINGAPORE","22 ORANGE GROVE ROAD, SINGAPORE 258350","Commercial Building","Hotel",null,1971,"Gold",2022,"Existing Non-Residential Buildings (RECERT 2017)",79709,67101,0.84182463711751498,792,"Water Cooled Chilled Water Plant",25,0.7,"2022-12-02",264.73595202549274,"3rd Quartile",285.47155277321258,"Bottom Quartile",326.30209888469307,"Bottom Quartile"]
["M SOCIAL SINGAPORE NOVEL DEVELOPMENT PTE LTD","90 ROBERTSON QUAY 238259, SINGAPORE 238259","Commercial Building","Hotel",null,2016,"Goldplus",2023,"Existing Non-Residential Buildings Re-Cert (GM:2021 In Operation)",7999.8,7669,0.95864896622415563,293,"Water Cooled Chilled Water Plant","","","",326.72907447686191,"Bottom Quartile",303.10207755193881,"Bottom Quartile",310.07947073676843,"Bottom Quartile"]
["PARKROYAL COLLECTION PICKERING","3 UPPER PICKERING STREET, SINGAPORE 058289, SINGAPORE 058289","Commercial Building","Hotel",null,2012,"Platinum",2021,"New Building for Non-Residential buildings (version 3)",29811,22438,0.75267518701150582,367,"Water Cooled Chilled Water Plant",11,0.64600000000000002,"2020-11-02",264.79581362584281,"3rd Quartile",280.52664284995473,"Bottom Quartile",308.9318707859515,"Bottom Quartile"]
["TRAVELODGE HARBOURFRONT SINGAPORE","50 TELOK BLANGAH ROAD, SINGAPORE 098828","Commercial Building","Hotel",null,2023,null,null,null,7323,7017,0.95821384678410493,328,"Others","","","","","Bottom Quartile","","Bottom Quartile",307.99111020073741,"Bottom Quartile"]
["HOTEL FORT CANNING","11 CANNING  WALK, SINGAPORE 178881","Commercial Building","Hotel",null,2012,"GoldPlus",2015,"Existing Building for Non-Residential buildings (version 3)",8922,8922,1,86,"Water Cooled Chilled Water Plant",8,0.65,"2015-03-31",246.82689979825153,"3rd Quartile",258.58760143465594,"3rd Quartile",300.9817753866846,"Bottom Quartile"]
["HOTEL TELEGRAPH SINGAPORE","35 ROBINSON ROAD, SINGAPORE 068876","Commercial Building","Hotel",null,2014,"Platinum",2022,"Existing Non-Residential Buildings (RECERT 2017)",7450,7450,1,134,"Water Cooled Chilled Water Plant",2014,"","",281.89373154362414,"Bottom Quartile",286.00008053691278,"Bottom Quartile",298.52590604026847,"Bottom Quartile"]
["HOTEL TRAVELTINE","700 BEACH ROAD, SINGAPORE 199598","Commercial Building","Hotel",null,2016,null,null,null,7093,7093,1,300,"Others","","","",254.89115747920485,"3rd Quartile",276.46253207387565,"Bottom Quartile",290.9781418299732,"Bottom Quartile"]
["HILTON SINGAPORE ORCHARD","333 ORCHARD ROAD SINGAPORE 238867, SINGAPORE 238867","Commercial Building","Hotel",null,1970,"Gold",2020,"Existing Building for Non-Residential buildings (version 2.1)",67268,67169,0.99852827495986207,1080,"Water Cooled Chilled Water Plant",15,"","",268.65041277859632,"3rd Quartile",248.94010617647746,"3rd Quartile",287.30011927313552,"Bottom Quartile"]
["PARK REGIS INVESTMENTS PTE LTD","23 MERCHANT ROAD, SINGAPORE 058268","Commercial Building","Hotel",null,2010,null,null,null,7432,6890,0.92707212055974164,202,"Others","","","",240.22021516989284,"3rd Quartile",220.7880310708648,"3rd Quartile",284.57792639361969,"Bottom Quartile"]
["MERCURE SINGAPORE BUGIS","122 MIDDLE ROAD, SINGAPORE 188973","Commercial Building","Hotel",null,2016,null,null,null,11897,11526,0.96881566781541562,395,"Others","","","",335.74257207699418,"Bottom Quartile",313.68045557703624,"Bottom Quartile",283.79880221904682,"3rd Quartile"]
["FOUR SEASONS HOTEL","190 ORCHARD BOULEVARD, SINGAPORE 248646","Commercial Building","Hotel",null,1994,"Certified",2019,"Existing Non-Residental Buildings ENRB: 2017",35243,34020,0.96529807337627327,259,"Water Cooled Chilled Water Plant",9,"","",221.95150810089947,"3rd Quartile",242.34035127543058,"3rd Quartile",283.66479868342651,"3rd Quartile"]
["MARINA BAY SANDS","1 BAYFRONT AVENUE, SINGAPORE 018971","Commercial Building","Hotel",null,2010,"Platinum",2021,"Existing Building for Non-Residential buildings (version 3)",260570,260570,1,2561,"District Cooling System (DCS)","","","",243.10061169485434,null,260.80238840318469,null,283.27218976231552]
["HOTEL GRAND CENTRAL","22 CAVENAGH ROAD, SINGAPORE 229617","Commercial Building","Hotel",null,2015,null,null,null,8140,7815,0.96007371007371012,263,"Others","","","",266.64503071253068,"3rd Quartile",259.63511056511055,"3rd Quartile",282.95531941031936,"3rd Quartile"]
["HOTEL CHANCELLOR @ ORCHARD","28 CAVENAGH ROAD, SINGAPORE 229635","Commercial Building","Hotel",null,2015,null,null,null,13742,12690,0.92344636879639064,488,"Others","","","",228.42455610537039,"3rd Quartile",265.29837359918497,"3rd Quartile",282.93319749672537,"3rd Quartile"]
["BEACH ROAD HOTEL 1886(LTD)","1 BEACH ROAD, SINGAPORE 189673","Commercial Building","Hotel",null,2022,null,null,null,43360,17612,0.4061808118081181,128,"Water Cooled Chilled Water Plant",12,"","","","Bottom Quartile","","Bottom Quartile",280.93410977859776,"3rd Quartile"]
["THE MANAGEMENT CORPORATION STRATA TITLE PLAN NO. 3837","8 SINARAN DRIVE, SINGAPORE 307470","Commercial Building","Hotel",null,2011,null,null,null,24313,8397,0.3453707892896804,428,"Others","","","",293.06410562250647,"Bottom Quartile",293.32781639452145,"Bottom Quartile",279.4985234236828,"3rd Quartile"]
["IBIS NOVENA HOTEL","6 IRRAWADDY ROAD, SINGAPORE 329543","Commercial Building","Hotel",null,2011,"Platinum",2015,"Existing Building for Non-Residential buildings (version 3)",5740,17,2.961672473867596E-3,251,"Water-Cooled Package Units","","","",294.16178745644601,"Bottom Quartile",308.10326655052268,"Bottom Quartile",277.39837108013938,"3rd Quartile"]
["ORCHID HOTEL","1 TRAS LINK, SINGAPORE 078867","Commercial Building","Hotel",null,2012,null,null,null,12549,12147,0.96796557494621083,272,"Others","","","",391.19030121922066,"Bottom Quartile",256.35176667463543,"3rd Quartile",275.8865455414774,"3rd Quartile"]
["PS100","100 PECK SEAH STREET, SINGAPORE 079333","Commercial Building","Hotel",null,2017,null,null,null,17198,15478,0.89998837074078386,314,"Water Cooled Chilled Water Plant",6,"","",276.1335568089313,"Bottom Quartile",263.75459879055705,"3rd Quartile",271.81892661937439,"3rd Quartile"]
["PAN PACIFIC SERVICED SUITES ORCHARD","96 SOMERSET ROAD, SINGAPORE 238163","Commercial Building","Hotel",null,2008,null,null,null,11441,9152,0.79993007604230404,126,"Water Cooled Chilled Water Plant",15,"","",249.67204964600995,"3rd Quartile",256.64860763919239,"3rd Quartile",269.44637706494188,"3rd Quartile"]
["AM HOTEL","51 JOO CHIAT ROAD, SINGAPORE 427373","Commercial Building","Hotel",null,2016,null,null,null,2049,1954,0.95363591996095654,70,"Others","","","",244.90137628111273,"3rd Quartile",183.03132259638849,"Top Quartile",266.86573938506592,"3rd Quartile"]
["THE ROBERTSON HOUSE BY THE CREST COLLECTION","1 UNITY STREET, SINGAPORE 237983","Commercial Building","Hotel",null,2009,null,null,null,11146,2950,0.26466893952987619,336,"Water Cooled Chilled Water Plant","","","",240.67544410550869,"3rd Quartile",257.39312309348645,"3rd Quartile",257.39083527722948,"3rd Quartile"]
["ORCHARD HOTEL SINGAPORE","442 ORCHARD ROAD, SINGAPORE 238879","Commercial Building","Hotel",null,1996,"GoldPlus",2022,"Existing Non-Residential Buildings (RECERT 2017)",49940.92,49832,0.99781902295752667,656,"Water Cooled Chilled Water Plant",2019,0.61799999999999999,"2022-12-05",244.56313580126277,"3rd Quartile",224.97020479398458,"3rd Quartile",257.09150932742131,"3rd Quartile"]
["FOUR POINTS BY SHERATON SINGAPORE, RIVERVIEW","382 HAVELOCK ROAD, SINGAPORE 169629","Commercial Building","Hotel",null,1985,"Gold",2021,"Existing Building for Non-Residential buildings (version 2.1)",21089,17815,0.84475318886623363,476,"Water Cooled Chilled Water Plant",0,0.87,"2016-12-26",218.93830907107971,"2nd Quartile",219.42211579496421,"3rd Quartile",255.98985252975484,"3rd Quartile"]
["GOODWOOD PARK HOTEL","22 SCOTTS ROAD, SINGAPORE 228221","Commercial Building","Hotel",null,1900,"Gold",2022,"GM:2021 In Operation",29615.64,26654,0.89999743378836317,233,"Water Cooled Chilled Water Plant",7,"","",203.07229558436015,"2nd Quartile",218.09992963177564,"2nd Quartile",254.89862788715692,"3rd Quartile"]
["CAPELLA HOTEL SINGAPORE","1 THE KNOLLS, SINGAPORE 098297","Commercial Building","Hotel",null,2009,"Gold",2022,"Existing Non-Residental Buildings ENRB: 2017",47527,38020,0.7999663349254108,110,"Water Cooled Chilled Water Plant",14,0.75,"2022-09-26",243.9234119553096,"3rd Quartile",250.70760830685717,"3rd Quartile",253.6218412691733,"3rd Quartile"]
["ROBERTSON WALK","11 UNITY STREET, SINGAPORE 237995","Commercial Building","Hotel",null,1999,null,null,null,30663,22118,0.72132537586015721,160,"Water Cooled Chilled Water Plant",23,"","",230.93982976225419,"3rd Quartile",234.46838208916284,"3rd Quartile",245.49721162312886,"3rd Quartile"]
["HOTEL JEN BY SHANGRI-LA","1A CUSCADEN ROAD, SINGAPORE 249716","Commercial Building","Hotel",null,1995,"Platinum",2021,"Existing Building for Non-Residential buildings (version 3)",26383,21108,0.80006064511238295,565,"Water Cooled Chilled Water Plant",2012,0.61,"2022-06-01",211.12115756358261,"2nd Quartile",204.96704317173939,"2nd Quartile",244.63847932380699,"3rd Quartile"]
["DORSETT SINGAPORE","333 NEW BRIDGE ROAD, SINGAPORE 088765","Commercial Building","Hotel",null,2012,null,null,null,11584,10227,0.88285566298342544,285,"Water Cooled Chilled Water Plant",10,0.8,"2022-06-15",230.83429730662982,"3rd Quartile",234.44617575966851,"3rd Quartile",243.96382941988949,"3rd Quartile"]
["SHANGRI-LA'S RASA SENTOSA RESORT & SPA","101 SILOSO ROAD, SINGAPORE 098970, SINGAPORE 098970","Commercial Building","Hotel",null,1993,null,null,null,42009,36000,0.85695922302363781,454,"Water Cooled Chilled Water Plant",10,0.73,"2017-07-31",200.17809278964032,"2nd Quartile",220.85445975862316,"3rd Quartile",243.5667833083387,"3rd Quartile"]
["HOLIDAY INN EXPRESS CLARKE QUAY","2 MAGAZINE ROAD, SINGAPORE 059573","Commercial Building","Hotel",null,2014,"Platinum",2021,"New Building for Non-Residential buildings (version 4)",11783,9351,0.79360095052193835,442,"Water Cooled Chilled Water Plant",10,0.55000000000000004,"2021-06-18",228.91327335992531,"3rd Quartile",213.78857676313331,"2nd Quartile",239.16642620724772,"3rd Quartile"]
["SHERATON TOWERS SINGAPORE HOTEL","39 SCOTTS ROAD, SINGAPORE 228230","Commercial Building","Hotel",null,1985,"Platinum",2022,"GM:2021 In Operation",31224,25000,0.80066615424032794,417,"Water Cooled Chilled Water Plant",5,0.60299999999999998,"2022-07-20",206.18938957212401,"2nd Quartile",229.55204330002562,"3rd Quartile",236.43934153215474,"3rd Quartile"]
["FONTAINE INVESTMENT PTE LTD","10 ARTILLERY AVENUE, SINGAPORE 099951","Commercial Building","Hotel",null,2020,"Gold",2022,"New Non-Residential Buildings (NRB: 2015) (R3)",35642,25000,0.70141967341900002,839,"Water Cooled Chilled Water Plant",4,0.67,"2020-09-21",202.06616912631168,"2nd Quartile",222.32848886145558,"3rd Quartile",234.05425060322091,"3rd Quartile"]
["HOTEL MI","41 BENCOOLEN STREET, SINGAPORE 189623","Commercial Building","Hotel",null,2017,"GoldPlus",2018,"New Building for Non-Residential buildings (version 4.1)",6665,6666,1.0001500375093773,342,"Water Cooled Chilled Water Plant",6,0.64,"2020-08-20",215.38915228807201,"2nd Quartile",222.14285671417852,"3rd Quartile",233.9048912228057,"3rd Quartile"]
["SILOSO BEACH RESORT","51 IMBIAH WALK, SINGAPORE 099538","Commercial Building","Hotel",null,2006,null,null,null,8651,6728,0.77771355912611262,194,"Water Cooled Chilled Water Plant",8,1.05,"2019-01-11",217.24846260547912,"2nd Quartile",203.83139521442607,"2nd Quartile",231.66502138481101,"2nd Quartile"]
["VILLAGE HOTEL KATONG","25 MARINE PARADE, SINGAPORE 449536","Commercial Building","Hotel",null,2013,null,null,null,22540,21363,0.94778172138420591,229,"Water Cooled Chilled Water Plant",9,0.65,"2020-11-30",199.27502218278616,"2nd Quartile",197.63984250221827,"2nd Quartile",230.51456965394854,"2nd Quartile"]
["ORCHARD RENDEZVOUS HOTEL","1 TANGLIN ROAD, SINGAPORE 247905","Commercial Building","Hotel",null,1977,"Gold",2022,"Existing Non-Residential Buildings (RECERT 2017)",26657,26307,0.98687024046216754,388,"Water Cooled Chilled Water Plant",11,0.78400000000000003,"2022-10-13",219.60178564729713,"3rd Quartile",195.77146715684435,"2nd Quartile",227.10169936602017,"2nd Quartile"]
["PULLMAN SINGAPORE ORCHARD","270 ORCHARD ROAD, SINGAPORE 238857","Commercial Building","Hotel",null,2010,null,null,null,22606,22058,0.97575864814650981,308,"Water-Cooled Package Units","","","",269.51972927541362,"3rd Quartile",243.99946916747766,"3rd Quartile",225.09271874723524,"2nd Quartile"]
["COPTHORNE KINGS HOTEL SINGAPORE","403 HAVELOCK ROAD, SINGAPORE 169632","Commercial Building","Hotel",null,2022,"Platinum",2022,"Existing Non-Residential Buildings (RECERT 2017)",16366.3,10222,0.62457611066643048,311,"Water Cooled Chilled Water Plant",2012,-0.53,"2021-05-20","","Bottom Quartile","","Bottom Quartile",219.51471621563826,"2nd Quartile"]
["VIBE HOTEL SINGAPORE ORCHARD","24 MOUNT ELIZABETH, SINGAPORE 228518, SINGAPORE 228518","Commercial Building","Hotel",null,1993,null,null,null,12052,12052,1,256,"Water Cooled Chilled Water Plant",15,"","",224.07443542172959,"3rd Quartile",239.58914112974927,"3rd Quartile",218.89130460553613,"2nd Quartile"]
["CAPRI BY FRASER CHANGI CITY","3 CHANGI BUSINESS PARK CENTRAL 1, SINGAPORE 486037","Commercial Building","Hotel",null,2012,"GoldPlus",2022,"Existing Non-Residential Buildings (RECERT 2017)",18973,16224,0.85510989300585039,313,"Water Cooled Chilled Water Plant",11,0.69699999999999995,"2022-11-03",244.10290307278763,"3rd Quartile",241.29452379697466,"3rd Quartile",217.47361408317082,"2nd Quartile"]
["HOTEL ROYAL","36 NEWTON ROAD, SINGAPORE 307964","Commercial Building","Hotel",null,1971,null,null,null,23500,23354,0.9937872340425532,362,"Water Cooled Chilled Water Plant",25,"","",221.09124297872341,"3rd Quartile",209.78268297872339,"2nd Quartile",217.09955957446809,"2nd Quartile"]
["HOLIDAY INN SINGAPORE ORCHARD CITY CENTER","11 CAVANAGH ROAD, SINGAPORE 229616","Commercial Building","Hotel",null,1985,"Gold",2020,"Existing Building for Non-Residential buildings (version 3)",24576,24000,0.9765625,324,"Water Cooled Chilled Water Plant",4,0.65,"2019-05-05",194.44439697265625,"2nd Quartile",205.02693684895834,"2nd Quartile",215.60577392578125,"2nd Quartile"]
["CONRAD SINGAPORE ORCHARD (FORMERLY REGENT SINGAPORE)","1 CUSCADEN ROAD, SINGAPORE 249715","Commercial Building","Hotel",null,1982,"GoldPlus",2020,"Existing Building for Non-Residential buildings (version 2.1)",40883,37160,0.90893525426216271,440,"Water Cooled Chilled Water Plant",1,0.55800000000000005,"2023-05-09",237.73025462906344,"3rd Quartile",229.69331996184232,"3rd Quartile",215.18237409192085,"2nd Quartile"]
["GRAND COPTHORNE WATERFRONT HOTEL SINGAPORE","392 HAVELOCK ROAD, SINGAPORE 169663","Commercial Building","Hotel",null,1999,"Platinum",2021,"Existing Building for Non-Residential buildings (version 3)",51726,38713,0.74842439005529138,574,"Water Cooled Chilled Water Plant",4,0.6,"2021-01-01",179.0201755403472,"Top Quartile",190.03264895797085,"2nd Quartile",215.0158914279086,"2nd Quartile"]
["RENDEZVOUS HOTEL SINGAPORE","9 BRAS BASAH ROAD, SINGAPORE 189559","Commercial Building","Hotel",null,1998,"GoldPlus",2017,"Existing Building for Non-Residential buildings (version 2.1)",19720,12584,0.63813387423935086,298,"Water Cooled Chilled Water Plant",20,"","",245.60192697768764,"3rd Quartile",241.09355983772821,"3rd Quartile",212.63417849898579,"2nd Quartile"]
["AMARA SANCTUARY RESORT SENTOSA","1LARKHILL ROAD, SINGAPORE 099394","Commercial Building","Hotel",null,2007,"Platinum",2022,"GM:2021 In Operation",15020,11092,0.73848202396804263,140,"Water Cooled Chilled Water Plant",5,"","",209.33640479360852,"2nd Quartile",214.53970705725698,"2nd Quartile",211.51041278295605,"2nd Quartile"]
["CARLTON HOTEL SINGAPORE","76 BRAS BASAH ROAD, SINGAPORE 189558","Commercial Building","Hotel",null,1988,"Gold",2022,"Existing Non-Residential Buildings (Version 2.1)",59329,57735,0.97313286925449616,939,"Water Cooled Chilled Water Plant",23,0.78,"2022-08-29",212.78805980212039,"2nd Quartile",208.60083264508083,"2nd Quartile",208.75222572435067,"2nd Quartile"]
["TRISTAR INN","1 ONAN ROAD, SINGAPORE 424780","Commercial Building","Hotel",null,1999,null,null,null,5368,5316,0.99031296572280181,117,"Others","","","",219.39445789865871,"3rd Quartile",224.07382637853951,"3rd Quartile",208.51942995529063,"2nd Quartile"]
["FURAMA SINGAPORE HOTEL & SHOPPING CENTRE","60 EU TONG SEN STREET, SINGAPORE 059804","Commercial Building","Hotel",null,1987,"Platinum",2021,"Existing Building for Non-Residential buildings (version 3)",25857,25857,1,445,"Water Cooled Chilled Water Plant",12,0.59,"2021-04-26",194.83412615539314,"2nd Quartile",178.50096685617046,"Top Quartile",206.52689793866264,"2nd Quartile"]
["HOTEL ROYAL @ QUEENS","12 QUEEN STREET, SINGAPORE 188553","Commercial Building","Hotel",null,1986,"Gold",2023,"GM:2021 In Operation",12565,11500,0.91524074810982892,236,"Water Cooled Chilled Water Plant",9,1.24,"2022-12-15",192.90708316752884,"2nd Quartile",193.06995622761639,"2nd Quartile",206.09725427775567,"2nd Quartile"]
["LINK HOTEL","50 TIONG BAHRU ROAD, SINGAPORE 168733","Commercial Building","Hotel",null,2016,null,null,null,10194,10194,1,274,"Others","","","",215.11722189523249,"2nd Quartile",202.63402001177164,"2nd Quartile",205.47969393761036,"2nd Quartile"]
["HOTEL BOSS","500 JALAN SULTAN, SINGAPORE 199020","Commercial Building","Hotel",null,2015,"Platinum",2016,"New Building for Non-Residential buildings (version 4.1)",32600,29200,0.89570552147239269,1500,"Water Cooled Chilled Water Plant",7,0.62,"2020-07-20",185.49586656441718,"Top Quartile",218.96962423312883,"2nd Quartile",204.53888036809815,"2nd Quartile"]
["NOVOTEL & MERCURE","28 STEVENS ROAD, SINGAPORE 257878, SINGAPORE 257878","Commercial Building","Hotel",null,2017,"GoldPlus",2022,"Existing Non-Residental Buildings ENRB: 2017",29553,26700,0.90346157750482181,772,"Water Cooled Chilled Water Plant",7,0.68100000000000005,"2023-07-20",215.38729063039284,"2nd Quartile",197.97600243630089,"2nd Quartile",200.59729976652116,"2nd Quartile"]
["FURAMA RIVERFRONT","405 HAVELOCK ROAD, SINGAPORE 169633","Commercial Building","Hotel",null,1973,"Platinum",2021,"Existing Building for Non-Residential buildings (version 3)",37570,26873,0.71527814745807827,663,"Water Cooled Chilled Water Plant",12,0.54800000000000004,"2021-01-24",209.12587170614853,"2nd Quartile",205.94141602342293,"2nd Quartile",199.93269896193772,"2nd Quartile"]
["ASCOTT RAFFLES PLACE SINGAPORE","2 FINLAYSON GREEN, SINGAPORE 049247","Commercial Building","Hotel",null,2016,"Certified",2007,"New Building for A/C buildings (version 2)",15694,10338,0.65872307888364978,146,"Others","","","",181.58843379635528,"Top Quartile",195.26631833821844,"2nd Quartile",199.47249776984833,"2nd Quartile"]
["KATONG SQUARE","86, 88 EAST COAST ROAD, SINGAPORE 428788","Commercial Building","Hotel",null,2016,"Platinum",2023,"GM:2021 In Operation",25200,23604,0.93666666666666665,582,"Water Cooled Chilled Water Plant",6,0.65,"2020-10-20",187.05124603174605,"2nd Quartile",189.55533333333335,"2nd Quartile",198.54680952380951,"Top Quartile"]
["TANG PLAZA","320 ORCHARD ROAD, SINGAPORE 238865","Commercial Building","Hotel",null,1982,"Gold",2021,"Existing Building for Non-Residential buildings (version 3)",58999,54035,0.91586298072848693,403,"Water Cooled Chilled Water Plant","",0.68,"2021-08-27",200.65847537383667,"2nd Quartile",205.83225713688174,"2nd Quartile",198.53267802990695,"Top Quartile"]
["CONCORDE SHOPPING CENTRE","317 OUTRAM ROAD, SINGAPORE 169075","Commercial Building","Hotel",null,1986,"GoldPlus",2022,"Existing Building for Non-Residential buildings (version 3)",54042,42053,0.7781540283483217,515,"Water Cooled Chilled Water Plant",1,0,"2022-09-15",169.19411309722071,"Top Quartile",183.78944265571224,"Top Quartile",196.91373468783542,"Top Quartile"]
["8 ON CLAYMORE","8 CLAYMORE HILL, SINGAPORE 229572","Commercial Building","Hotel",null,2011,"Gold",2012,"Existing Building for Non-Residential buildings (version 2.1)",13539,13128,0.96964325282517172,85,"Water Cooled Chilled Water Plant",10,"","",215.22106211684763,"2nd Quartile",202.52669768816014,"2nd Quartile",196.09764015067583,"Top Quartile"]
["HOLIDAY INN EXPRESS SINGAPORE ORCHARD ROAD","20 BIDEFORD ROAD, SINGAPORE 229921","Commercial Building","Hotel",null,2013,"Platinum",2018,"New Building for Non-Residential buildings (version 3)",7221,4747,0.65738817338318789,221,"Water Cooled Chilled Water Plant",10,0.55000000000000004,"2023-01-06",172.75411300373909,"Top Quartile",180.001454092231,"Top Quartile",194.66768868577759,"Top Quartile"]
["CROWNE PLAZA CHANGI AIRPORT","75 AIRPORT BOULEVARD, SINGAPORE 819664","Commercial Building","Hotel",null,2008,"Gold",2023,"GM:2021 In Operation",41999,41999,1,563,"Water Cooled Chilled Water Plant",15,0.65800000000000003,"2020-02-03",193.43793899854759,"2nd Quartile",176.64706302531013,"Top Quartile",192.13076501821473,"Top Quartile"]
["VILLAGE HOTEL ALBERT COURT","180 ALBERT STREET, SINGAPORE 189971","Commercial Building","Hotel",null,1993,"Gold",2023,"GM:2021 In Operation",11426,8761,0.76676002100472607,210,"Water Cooled Chilled Water Plant",9,0.65,"2014-03-01",179.93439348853491,"Top Quartile",188.94620864694556,"Top Quartile",183.62515315946087,"Top Quartile"]
["PARADOX SINGAPORE MERCHANT COURT AT CLARKE QUAY","20 MERCHANT ROAD, SINGAPORE 058281","Commercial Building","Hotel",null,1997,"Platinum",2021,"Existing Building for Non-Residential buildings (version 3)",38054,38054,1,476,"Water Cooled Chilled Water Plant",5,0.62,"2017-12-28",159.57061018552582,"Top Quartile",165.58566773532348,"Top Quartile",181.0940374205077,"Top Quartile"]
["MERCURE SINGAPORE TYRWHITT","165 TYRWHITT ROAD, SINGAPORE 207569","Commercial Building","Hotel",null,2014,null,null,null,6962,6000,0.86182131571387532,270,"Others","",6.42,"2022-12-09",213.44375179546105,"2nd Quartile",227.02459063487504,"3rd Quartile",177.77014507325481,"Top Quartile"]
["HOTEL GRAND PACIFIC","101 VICTOR STREET, SINGAPORE 188018","Commercial Building","Hotel",null,1971,null,null,null,14950,13000,0.86956521739130432,240,"Water Cooled Chilled Water Plant",8,0.83,"2022-06-21",181.03785953177257,"Top Quartile",161.70140468227424,"Top Quartile",174.23958193979934,"Top Quartile"]
["PARK AVENUE ROCHESTER","31 ROCHESTER DRIVE, SINGAPORE 138637, SINGAPORE 138637","Commercial Building","Hotel",null,2011,"Gold",2009,"New Building for A/C buildings (version 2)",18881,18881,1,351,"District Cooling System (DCS)","","","",153.16625178751124,null,152.83862083576082,null,170.76023515703616]
["M HOTEL SINGAPORE","81 ANSON ROAD, SINGAPORE 079908","Commercial Building","Hotel",null,1985,"GoldPlus",2021,"Existing Building for Non-Residential buildings (version 3)",32379,31033,0.95842984650545104,415,"Water Cooled Chilled Water Plant",13,0.67,"2022-07-11",154.52998486673462,"Top Quartile",161.97514592791623,"Top Quartile",170.75650915716977,"Top Quartile"]
["HOTEL MIRAMAR (S) LTD","401 HAVELOCK ROAD, SINGAPORE 169631","Commercial Building","Hotel",null,1971,"Gold",2019,"Existing Building for Non-Residential buildings (version 3)",23554,21262,0.90269168718688975,342,"Water Cooled Chilled Water Plant",6,0.68,"2018-12-11",164.65800118875774,"Top Quartile",154.12203235119301,"Top Quartile",163.61631145453001,"Top Quartile"]
["GENTING HOTEL JURONG","2 TOWN HALL LINK, SINGAPORE 608516","Commercial Building","Hotel",null,2015,"Platinum",2020,"New Building for Non-Residential buildings (version 4.1)",19147,15755,0.82284430981354784,557,"Water Cooled Chilled Water Plant",7,0.62,"2019-05-30",202.57873296077713,"2nd Quartile",187.76013213558261,"Top Quartile",162.14246409359168,"Top Quartile"]
["GRAND PARK CITY HALL","10  COLEMAN STREET , SINGAPORE 179809, SINGAPORE 179809","Commercial Building","Hotel",null,2018,"Platinum",2017,"New Building for Non-Residential buildings (version 4.1)",21170,19800,0.93528578176665089,343,"Water Cooled Chilled Water Plant",2018,0.61,"2021-03-15",148.19918564005667,"Top Quartile",146.75225555030704,"Top Quartile",162.12335852621635,"Top Quartile"]
["CAPRI BY FRASER CHINA SQUARE, SINGAPORE","181 SOUTH BRIDGE ROAD, SINGAPORE 058743","Commercial Building","Hotel",null,2019,"GoldPlus",2022,"Existing Non-Residental Buildings ENRB: 2017",15996,15326,0.95811452863215807,304,"Water Cooled Chilled Water Plant",4,0.61,"2020-08-14",174.31764816204051,"Top Quartile",149.93752188047011,"Top Quartile",146.30482620655164,"Top Quartile"]
["PARKROYAL KITCHENER HOTEL PTE LTD","181 KITCHENER ROAD, SINGAPORE 208533","Commercial Building","Hotel",null,1988,"Platinum",2019,"Existing Building for Non-Residential buildings (version 3)",37721,29829,0.79077967180085362,540,"Water Cooled Chilled Water Plant",2014,0.64600000000000002,"2023-01-13",159.73232655549958,"Top Quartile",163.16034649134434,"Top Quartile",144.77700829776518,"Top Quartile"]
["METRO-Y STEVENS","60 STEVENS ROAD, SINGAPORE 257854","Commercial Building","Hotel",null,1980,null,null,null,8211,7800,0.94994519546949219,98,"Water Cooled Chilled Water Plant",5,"","",140.64235172329802,"Top Quartile",135.91046522957009,"Top Quartile",139.48870539520155,"Top Quartile"]
["VILLAGE HOTEL CHANGI","1 NETHERAVON ROAD, SINGAPORE 508502","Commercial Building","Hotel",null,2004,"Certified",2020,"Existing Building for Non-Residential buildings (version 2.1)",22826,22826,1,380,"Water Cooled Chilled Water Plant",2003,0.95,"2020-04-01",175.53351441338825,"Top Quartile",161.09594322264084,"Top Quartile",138.42512923858757,"Top Quartile"]
["30 BENCOOLEN","30 BENCOOLEN STREET, SINGAPORE 189621","Commercial Building","Hotel",null,1988,"Gold",2022,"Existing Non-Residental Buildings ENRB: 2017",7141,6765,0.94734631004061054,130,"Water Cooled Chilled Water Plant",5,0.65,"2022-12-13",147.88518694860664,"Top Quartile",145.39675395602856,"Top Quartile",135.34958969332027,"Top Quartile"]
["YORK HOTEL","21 MOUNT ELIZABETH SINGAPORE 228516, SINGAPORE 228516","Commercial Building","Hotel",null,1971,"Gold",2022,"Existing Non-Residential Buildings (RECERT 2017)",31184,27181,0.87163288866085176,407,"Water Cooled Chilled Water Plant",7,"","",117.67603899435608,"Top Quartile",112.73057978450487,"Top Quartile",127.70464340687532,"Top Quartile"]
["GRAND HYATT SINGAPORE","10 SCOTTS ROAD, SINGAPORE 228211","Commercial Building","Hotel",null,1971,"Platinum",2022,"Existing Non-Residental Buildings ENRB: 2017",84404,70830,0.83917823799819913,677,"Water Cooled Chilled Water Plant",22,"","",159.26518529927492,"Top Quartile",163.41495367518127,"Top Quartile",100.37686069380599,"Top Quartile"]
["SEAMEO REGIONAL LANGUAGE CENTRE BUILDING","30 ORANGE GROVE ROAD, SINGAPORE 258352","Commercial Building","Hotel",null,1972,"GoldPlus",2020,"Existing Building for Non-Residential buildings (version 3)",21466,19767,0.92085157924159133,151,"Water Cooled Chilled Water Plant",7,0.6,"2019-09-11",79.563560980154662,"Top Quartile",78.201273176185595,"Top Quartile",88.62695238982576,"Top Quartile"]
["MOMENTUS HOTEL ALEXANDRA","323 ALEXANDRA ROAD SINGAPORE 159972, SINGAPORE 159972","Commercial Building","Hotel",null,2014,null,null,null,13578,12000,0.88378258948298716,442,"Water Cooled Chilled Water Plant",8,"","",99.796771247606429,"Top Quartile",86.64202091618796,"Top Quartile",73.028727353071147,"Top Quartile"]
["CHANGI COVE HOTEL","351 CRANWELL ROAD, SINGAPORE 509866","Commercial Building","Hotel",null,2012,"Platinum",2022,"Existing Non-Residental Buildings ENRB: 2017",45000,3100,6.8888888888888888E-2,140,"Others","","","",36.365433333333335,"Top Quartile",35.092941777777774,"Top Quartile",38.977075111111105,"Top Quartile"]
["QUALITY HOTEL MARLOW","201 BALESTIER ROAD, SINGAPORE 329926, SINGAPORE 329926","Commercial Building","Hotel",null,1997,null,null,null,10136,9977,0.9843133385951065,240,"Air Cooled Chilled Water Plant",null,null,null,207.50963891081295,"2nd Quartile",171.87321921862667,"Top Quartile",30.728324782951855,"Top Quartile"]
["YOTEL SINGAPORE ORCHARD ROAD","366 ORCHARD ROAD, SINGAPORE 238904","Commercial Building","Hotel",null,2017,"Gold",2016,"New Building for Non-Residential buildings (version 4.1)",14835,14273,0.96211661611054933,610,"Air Cooled Chilled Water Plant","",0.876,"2022-05-31"]
["JW MARRIOTT SINGAPORE SOUTH BEACH","30 BEACH ROAD, SINGAPORE 189763","Commercial Building","Hotel",null,2015,"Platinum",2021,"New Building for Non-Residential buildings (version 3)",44927,40554,0.90266432212255432,634,"Water Cooled Chilled Water Plant","","",""]
["RC HOTEL (PTE) LTD","80 BREAS BASAH ROAD, SINGAPORE 189560","Commercial Building","Hotel",null,1986,null,null,null,54696,54696,1,769,"District Cooling System (DCS)","",0.79500000000000004,"2022-08-05"]
["RC HOTEL (PTE} LTD","2 STAMFORD ROAD, SINGAPORE 178882","Commercial Building","Hotel",null,1986,null,null,null,82044,82044,1,1261,"District Cooling System (DCS)","",0.79500000000000004,"2022-08-05"]
["THE FULLERTON HOTEL","1 FULLERTON SQUARE, SINGAPORE 049178","Commercial Building","Hotel",null,1999,"Gold",2022,"Existing Non-Residental Buildings ENRB: 2017",50804,49142,0.96728604046925437,396,"Water Cooled Chilled Water Plant",2,0.56999999999999995,"2023-02-23"]
["THE PAN PACIFIC HOTEL SINGAPORE","7 RAFFLES BOULEVARD, SINGAPORE 039595","Commercial Building","Hotel",null,1986,"Gold",2023,"GM:2021 In Operation",83384,60000,0.71956250599635418,790,"District Cooling System (DCS)","","",""]
["THE RITZ-CARLTON, MILENIA SINGAPORE","7 RAFFLES AVENUE, SINGAPORE 039799","Commercial Building","Hotel",null,1996,"Gold",2022,"Existing Non-Residential Buildings (RECERT 2017)",76760,76000,0.99009900990099009,608,"District Cooling System (DCS)","",0.627,"2022-06-01"]
["INTERCONTINENTAL SINGAPORE","80 MIDDLE ROAD, SINGAPORE 188966","Commercial Building","Hotel",null,1995,"Platinum",2021,"Existing Building for Non-Residential buildings (version 2.1)",36836,36836,1,403,"Water Cooled Chilled Water Plant",3,0.55700000000000005,"2023-01-31"]
["CLIFFORD PIER","80 COLLYER QUAY SINGAPORE 049326, SINGAPORE 049326","Commercial Building","Hotel",null,2016,null,null,null,10438,9746,0.93370377466947696,98,"Water Cooled Chilled Water Plant",4,"",""]
["ARANDA COUNTRY CLUB","63 PASIR RIS DRIVE 3, SINGAPORE 519497","Commercial Building","Hotel",null,1995,null,null,null,12050,9500,0.78838174273858919,31,"District Cooling System (DCS)","","",""]
["MANDARIN ORIENTAL, SINGAPORE","5 RAFFLES AVENUE, SINGAPORE 039797","Commercial Building","Hotel",null,1987,"Gold",2022,"Existing Non-Residential Buildings (RECERT 2017)",55585,53119,0.95563551317801565,527,"District Cooling System (DCS)","","",""]
["CONRAD CENTENNIAL SINGAPORE","TWO TEMASEK BOULEVARD, SINGAPORE 038982","Commercial Building","Hotel",null,1996,"Gold",2022,"Existing Non-Residential Buildings (RECERT 2017)",40567,34322,0.84605714003993393,512,"District Cooling System (DCS)","","",""]
["PENINSULA.EXCELSIOR HOTEL","5 COLEMAN STREET, SINGAPORE 179805","Commercial Building","Hotel",null,1985,"Gold",2022,"Existing Non-Residental Buildings ENRB: 2017",42237,42150,0.99794019461609484,591,"Water Cooled Chilled Water Plant",1,0.6,"2022-09-15"]
["ALOFT SINGAPORE NOVENA ( EAST WING )","EAST WING 1 JALAN RAJAH, SINGAPORE 329133","Commercial Building","Hotel",null,2012,null,null,null,12916,12916,1,405,"Others","",0.95,"2023-01-20"]
["QUINCY HOTEL SINGAPORE","22 MOUNT ELIZABETH, SINGAPORE 228517","Commercial Building","Hotel",null,2008,null,null,null,4819,4700,0.97530608009960573,106,"Water Cooled Chilled Water Plant",16,"",""]
["GREAT WORLD SERVICED APARTMENTS","2 KIM SENG WALK, SINGAPORE 239404","Commercial Building","Hotel",null,1997,"Platinum",2016,"Existing Building for Non-Residential buildings (version 3)",41453,33518,0.80857838998383713,0,"Water Cooled Chilled Water Plant",11,"",""]
["THE SOUTH BEACH","32 BEACH ROAD, SINGAPORE 189764, SINGAPORE 189764","Commercial Building","Hotel",null,2013,null,null,null,3006,1572,0.52295409181636732,0,"Others"]
["THE SOUTH BEACH","34 BEACH ROAD, SINGAPORE 189765, SINGAPORE 189765","Commercial Building","Hotel",null,2015,null,null,null,2585,2084,0.80618955512572532,0,"Others"]
["NORTHPOINT CITY (SOUTH WING)","1 NORTHPOINT DRIVE, SINGAPORE 768019","Commercial Building","Retail","Large",2017,"Gold",2023,"GM:2021 In Operation",44016,40499,0.92009723736822968,0,"Water Cooled Chilled Water Plant",6,0.56000000000000005,"2020-10-31",856.38521673936759,"Bottom Quartile",873.20133587786256,"Bottom Quartile",887.71316112322791,"Bottom Quartile"]
["PLQ MALL","10 PAYA LEBAR ROAD PLQ MALL\n PAYA LEBAR QUARTER\n SINGAPORE 409057, SINGAPORE 409057","Commercial Building","Retail","Large",2022,"Platinum",2022,"Existing Non-Residential Buildings (RECERT 2017)",39021,27500,0.70474872504548836,0,"Water Cooled Chilled Water Plant",2019,0.56000000000000005,"2022-10-03","","Bottom Quartile","","Bottom Quartile",850.64653391763409,"Bottom Quartile"]
["HILLION MALL","17 PETIR ROAD B1-67, SINGAPORE 678278","Commercial Building","Retail","Large",2017,null,null,null,20645.79,20000,0.96872049943354066,0,"Water Cooled Chilled Water Plant","","","",680.90791391368407,"Bottom Quartile",732.97153560120489,"Bottom Quartile",761.12625382705141,"Bottom Quartile"]
["SUN PLAZA","30 SEMBAWANG DRIVE, SINGAPORE 757713","Commercial Building","Retail","Large",1998,null,null,null,20000,1999,9.9949999999999997E-2,0,"Water Cooled Chilled Water Plant","","","",643.42039899999997,"Bottom Quartile",651.35654599999998,"Bottom Quartile",724.88798899999995,"Bottom Quartile"]
["THOMSON PLAZA","301 UPPER THOMSON ROAD, SINGAPORE 574408","Commercial Building","Retail","Large",1959,"Gold",2022,"Existing Non-Residental Buildings ENRB: 2017",22080.7,32601,1.4764477575439183,0,"Water Cooled Chilled Water Plant",2008,"","",588.74054491026095,"Bottom Quartile",674.38984814793025,"Bottom Quartile",710.04135602585063,"Bottom Quartile"]
["JUNCTION 8","9 BISHAN PLACE, SINGAPORE 579837","Commercial Building","Retail","Large",1993,"Platinum",2021,"Existing Building for Non-Residential buildings (version 3)",30731.252,37761,1.2287491573724363,0,"Water Cooled Chilled Water Plant",3,0.65200000000000002,"2023-03-07",636.19796551080969,"Bottom Quartile",668.0889538766595,"Bottom Quartile",650.72448073381452,"Bottom Quartile"]
["WATERWAY POINT","83 PUNGGOL CENTRAL, SINGAPORE 828761","Commercial Building","Retail","Large",2015,"GoldPlus",2015,"New Building for Non-Residential buildings (version 4.1)",50399,4448,8.8255719359511098E-2,0,"Water Cooled Chilled Water Plant",7,0.63800000000000001,"2019-12-12",529.90182344887796,"Bottom Quartile",564.72007381098831,"Bottom Quartile",627.78858707514041,"Bottom Quartile"]
["THE CLEMENTI MALL","3155 COMMONWEALTH AVENUE WEST, SINGAPORE 129588","Commercial Building","Retail","Large",2012,"Gold",2021,"Existing Building for Non-Residential buildings (version 3)",26974,16724,0.6200044487284051,0,"Water Cooled Chilled Water Plant",4,0.68,"2021-03-29",549.74849855416323,"Bottom Quartile",622.71014680803739,"Bottom Quartile",575.57153184548088,"Bottom Quartile"]
["BUKIT PANJANG PLAZA","1 JELEBU ROAD, SINGAPORE 677743","Commercial Building","Retail","Large",1997,"GoldPlus",2020,"Existing Building for Non-Residential buildings (version 3)",22998,22825,0.9924776067484129,0,"Water Cooled Chilled Water Plant",8,0.7,"2022-12-15",546.17929819984352,"Bottom Quartile",568.60836811896684,"Bottom Quartile",568.08420297417172,"Bottom Quartile"]
["COMPASS ONE","1 SENGKANG SQUARE, SINGAPORE 545078","Commercial Building","Retail","Large",2017,"GoldPlus",2022,"Existing Non-Residental Buildings ENRB: 2017",38621,38620,0.99997410735092307,0,"Water Cooled Chilled Water Plant",2,0.59,"2019-12-23",518.74441495559415,"Bottom Quartile",535.31580927474693,"Bottom Quartile",554.06097382253176,"Bottom Quartile"]
["NORTHPOINT CITY","930 YISHUN AVENUE 2 SINGAPORE 769098, SINGAPORE 769098","Commercial Building","Retail","Large",1992,"Gold",2023,"GM:2021 In Operation",34985,30318,0.86659997141632128,0,"Water Cooled Chilled Water Plant",14,0.71,"2020-07-24",532.75742461054733,"Bottom Quartile",551.61566385593824,"Bottom Quartile",551.2897670430184,"Bottom Quartile"]
["HOUGANG MALL","90 HOUGANG AVE 10, SINGAPORE 538766","Commercial Building","Retail","Large",1996,"Platinum",2022,"Existing Non-Residental Buildings ENRB: 2017",21614,18372,0.85000462663088738,0,"Water Cooled Chilled Water Plant",10,0.83899999999999997,"2022-05-09",542.36018321458312,"Bottom Quartile",568.51411122420654,"Bottom Quartile",549.57296196909408,"Bottom Quartile"]
["BEDOK MALL","311 NEW UPPER CHANGI ROAD, SINGAPORE 467360","Commercial Building","Retail","Large",2013,"Platinum",2021,"New Building for Non-Residential buildings (version 3)",35352.21,30507,0.86294463627592166,0,"Water Cooled Chilled Water Plant",9,0.6,"2022-08-22",520.1561090523054,"Bottom Quartile",536.95657584066169,"Bottom Quartile",542.73304978670353,"Bottom Quartile"]
["WHITE SANDS","1 PASIR RIS CENTRAL STREET 3, SINGAPORE 518457","Commercial Building","Retail","Large",1996,"Gold",2023,"GM:2021 In Operation",22805.82,17658,0.77427604006345752,0,"Water Cooled Chilled Water Plant",8,0.60799999999999998,"2021-06-21",505.6474399955801,"Bottom Quartile",505.73244022797689,"3rd Quartile",523.79133922831977,"Bottom Quartile"]
["LOT ONE SHOPPERS' MALL","21 CHOA CHU KANG AVE 4, SINGAPORE 689812","Commercial Building","Retail","Large",1996,"Gold",2020,"Existing Building for Non-Residential buildings (version 2.1)",30963,30963,1,0,"Water Cooled Chilled Water Plant",1,0.71,"2021-08-31",472.14114426896617,"Bottom Quartile",509.66161224687528,"Bottom Quartile",515.51584148822792,"Bottom Quartile"]
["TAMPINES MALL","4 TAMPINES CENTRAL 5, SINGAPORE 529510","Commercial Building","Retail","Large",1995,"Gold",2022,"Existing Non-Residential Buildings (RECERT 2017)",47128,32094,0.68099643524019693,0,"Water Cooled Chilled Water Plant",13,"","",459.84792480054318,"3rd Quartile",491.49732643014767,"3rd Quartile",496.49142760142593,"Bottom Quartile"]
["TAMPINES 1","10 TAMPINES CENTRAL 1, SINGAPORE 529536","Commercial Building","Retail","Large",2009,"GoldPlus",2022,"Existing Building for Non-Residential buildings (version 3)",35386,32000,0.90431243994800203,0,"Water Cooled Chilled Water Plant",13,0.68,"2018-12-01",416.06837732436554,"3rd Quartile",441.93389476063976,"3rd Quartile",493.12573334086926,"Bottom Quartile"]
["MUSTAFA CENTRE","145 SYED ALWI ROAD \nSINGAPORE 207704, SINGAPORE 207704","Commercial Building","Retail","Large",1995,null,null,null,23000,22800,0.99130434782608701,0,"Water Cooled Chilled Water Plant",2,"","",730.01497826086961,"Bottom Quartile",467.07152173913045,"3rd Quartile",484.08943478260869,"Bottom Quartile"]
["NEX","23 SERANGOON CENTRAL, SINGAPORE 556083","Commercial Building","Retail","Large",2010,"GoldPlus",2022,"Existing Non-Residental Buildings ENRB: 2017",87523,74448,0.85061069661688926,0,"Water Cooled Chilled Water Plant",13,0.66290000000000004,"2020-12-21",437.22447242439131,"3rd Quartile",468.71770848805454,"3rd Quartile",481.46490065468504,"Bottom Quartile"]
["313@SOMERSET","313 ORCHARD ROAD, SINGAPORE 238895","Commercial Building","Retail","Large",2009,"Platinum",2022,"Existing Non-Residential Buildings (RECERT 2017)",39936,35852,0.89773637820512819,0,"Water Cooled Chilled Water Plant",9,0.64,"2019-08-27",424.65091646634613,"3rd Quartile",458.01844200721155,"3rd Quartile",478.06839693509613,"Bottom Quartile"]
["ORCHARD CENTRAL","181 ORCHARD ROAD, SINGAPORE 238896","Commercial Building","Retail","Large",2009,null,null,null,38262,37687,0.98497203491715013,0,"Water Cooled Chilled Water Plant",13,"","",467.37525482201664,"Bottom Quartile",474.43315169097275,"3rd Quartile",476.19311588521248,"Bottom Quartile"]
["JURONG POINT SHOPPING CENTRE 1","JURONG POINT\n1 JURONG WEST CENTRAL 2\nSINGAPORE 648886, SINGAPORE 648886","Commercial Building","Retail","Large",1996,"Platinum",2023,"GM:2021 In Operation",55537.65,35252,0.63474057688793095,0,"Water Cooled Chilled Water Plant",2009,"","",404.22420196029179,"3rd Quartile",436.42168420882047,"3rd Quartile",473.38728322138223,"Bottom Quartile"]
["AMK HUB","53 ANG MO KIO AVE 3, SINGAPORE 569933","Commercial Building","Retail","Large",2019,"Gold",2023,"GM:2021 In Operation",47873,47399,0.99009880308315756,0,"Water Cooled Chilled Water Plant",3,0.59,"2021-06-30",439.49315898314291,"3rd Quartile",429.61431286946714,"3rd Quartile",471.85225492448768,"3rd Quartile"]
["EASTPOINT MALL","3 SIMEI STREET 6 #06-09, SINGAPORE 528833","Commercial Building","Retail","Large",2014,"Platinum",2022,"Existing Non-Residential Buildings (RECERT 2017)",29000,25040,0.86344827586206896,0,"Water Cooled Chilled Water Plant",9,0.64,"2022-01-20",433.77072413793104,"3rd Quartile",436.48355172413795,"3rd Quartile",464.44396551724139,"3rd Quartile"]
["CAUSEWAY POINT","1 WOODLANDS SQUARE, SINGAPORE 738099","Commercial Building","Retail","Large",1999,"Gold",2023,"GM:2021 In Operation",58450,53733,0.91929854576561165,0,"Water Cooled Chilled Water Plant",10,0.66100000000000003,"2020-10-29",442.79067579127457,"3rd Quartile",458.99952095808385,"3rd Quartile",452.81840889649271,"3rd Quartile"]
["CENTURY SQUARE","2 TAMPINES CENTRAL 5, SINGAPORE 529509","Commercial Building","Retail","Large",1995,"Platinum",2021,"Existing Building for Non-Residential buildings (version 3)",30400,25000,0.82236842105263153,0,"Water Cooled Chilled Water Plant",3,0.59,"2021-01-01",403.35259078947365,"3rd Quartile",418.82021809210528,"3rd Quartile",451.34082269736842,"3rd Quartile"]
["BUGIS+","201 VICTORIA STREET #02-28 BUGIS+, SINGAPORE 188067","Commercial Building","Retail","Large",2009,"Platinum",2020,"Existing Building for Non-Residential buildings (version 2.1)",27715,26329,0.94999097961392742,0,"Water Cooled Chilled Water Plant",12,0.65200000000000002,"2020-02-06",349.90553851704851,"2nd Quartile",364.1945156052679,"2nd Quartile",445.62695291358472,"3rd Quartile"]
["ION ORCHARD","2 ORCHARD TURN, SINGAPORE 238801","Commercial Building","Retail","Large",2009,"Gold",2022,"Existing Non-Residential Buildings (RECERT 2017)",87354,82000,0.93870916042768504,0,"Water Cooled Chilled Water Plant",14,0.72499999999999998,"2017-04-01",403.42171509032215,"3rd Quartile",444.34815234562814,"3rd Quartile",443.54993474826568,"3rd Quartile"]
["SEMBAWANG SHOPPING CENTRE","604 SEMBAWANG ROAD, SINGAPORE 758459","Commercial Building","Retail","Large",2008,"Gold",2016,"Existing Building for Non-Residential buildings (version 2.1)",19146,11950,0.6241512587485637,0,"Water Cooled Chilled Water Plant",15,"","",409.09881959678262,"3rd Quartile",425.49639611407082,"3rd Quartile",439.23958006894389,"3rd Quartile"]
["VIVOCITY","1 HARBOURFRONT WALK, SINGAPORE 098585","Commercial Building","Retail","Large",2006,"Platinum",2022,"Existing Building for Non-Residential buildings (version 3)",142850.37,135860,0.95106508999591677,0,"Water Cooled Chilled Water Plant",2,900,"2022-10-21",394.05161113688399,"3rd Quartile",428.30185739105889,"3rd Quartile",438.61620750439778,"3rd Quartile"]
["TANGLIN MALL","163 TANGLIN MALL, SINGAPORE 247933","Commercial Building","Retail","Large",1994,"GoldPlus",2022,"Existing Non-Residental Buildings ENRB: 2017",24285.79,23861,0.98250870159051851,0,"Water Cooled Chilled Water Plant",12,"","",394.66992838198797,"3rd Quartile",384.11192306282811,"2nd Quartile",435.99161279085422,"3rd Quartile"]
["CHANGI CITY POINT","5 CHANGI BUSINESS PARK CENTRAL 1, SINGAPORE 486038","Commercial Building","Retail","Large",2011,"Gold",2023,"GM:2021 In Operation",28463,23676,0.83181674454555032,0,"Water Cooled Chilled Water Plant",2011,0.61799999999999999,"2020-11-23",408.59585251027647,"3rd Quartile",412.42079190528057,"3rd Quartile",420.79613884692407,"3rd Quartile"]
["I12 KATONG","112 EAST COAST ROAD, I12 KATONG\n#11-248, SINGAPORE 428802","Commercial Building","Retail","Large",2021,"Platinum",2022,"Existing Non-Residental Buildings ENRB: 2017",27138,27000,0.99491487950475344,0,"Water Cooled Chilled Water Plant",11,0.92,"2019-06-27","","Bottom Quartile",38.533569165008473,"Top Quartile",405.40780455449925,"3rd Quartile"]
["WEST MALL","1 BUKIT BATOK CENTRAL LINK, SINGAPORE 658713","Commercial Building","Retail","Large",1999,"GoldPlus",2022,"GM:2021 In Operation",26299,17007,0.64667858093463626,0,"Water Cooled Chilled Water Plant",1999,"","",391.88254306247387,"3rd Quartile",397.4416897980912,"3rd Quartile",397.84056428001065,"3rd Quartile"]
["CUSTOMS HOUSE","70 COLLYER QUAY SINGAPORE 049323, SINGAPORE 049323","Commercial Building","Retail","Large",2010,null,null,null,954,911,0.95492662473794554,0,"Water Cooled Chilled Water Plant",0,"","",522.24207382854638,"Bottom Quartile",379.98108944792756,"2nd Quartile",395.24320361481574,"3rd Quartile"]
["KINEX","11 TANJONG KATONG ROAD, SINGAPORE 437157","Commercial Building","Retail","Large",2014,"Gold",2021,"New Building for Non-Residential buildings (version 4)",28938,28938,1,0,"Water Cooled Chilled Water Plant",8,-1.35,"2019-03-18",360.78557605916097,"2nd Quartile",365.50120948234155,"2nd Quartile",384.37880986937591,"3rd Quartile"]
["CATHAY CINELEISURE ORCHARD","8 GRANGE ROAD, SINGAPORE 239695","Commercial Building","Retail","Large",1996,null,null,null,16675.7,26200,1.5711484375468496,0,"Water Cooled Chilled Water Plant",8,"","",380.05379084536179,"2nd Quartile",416.99688768687372,"3rd Quartile",376.39127592844676,"3rd Quartile"]
["CONNEXION","1 FARRER PARK STATION ROAD, SINGAPORE 217562","Commercial Building","Retail","Large",2014,"Platinum",2020,"New Building for Non-Residential buildings (version 3)",58369,49572,0.84928643629323786,235,"Water Cooled Chilled Water Plant",8,"","",374.96145214069111,"2nd Quartile",363.82248282478713,"2nd Quartile",374.51648135140226,"3rd Quartile"]
["CITY SQUARE MALL","180 KITCHENER ROAD #B2-29 CITY SQUARE MALL\nB, SINGAPORE 208539","Commercial Building","Retail","Large",2009,"Platinum",2021,"Existing Building for Non-Residential buildings (version 3)",65640,40727,0.62046008531383301,0,"Water Cooled Chilled Water Plant",14,0.58199999999999996,"2021-11-02",342.28062157221206,"2nd Quartile",351.86881170018285,"2nd Quartile",371.54138939670935,"3rd Quartile"]
["WEST COAST PLAZA","154 WEST COAST ROAD, SINGAPORE 127371","Commercial Building","Retail","Large",2008,null,null,null,20712.73,17617,0.85053974053637549,0,"Water Cooled Chilled Water Plant",14,"","",390.29871967625706,"3rd Quartile",367.57863400913351,"2nd Quartile",371.26960086864455,"3rd Quartile"]
["PLAZA SINGAPURA","68 ORCHARD ROAD, SINGAPORE 238839","Commercial Building","Retail","Large",1998,"Gold",2022,"Existing Non-Residential Buildings (RECERT 2017)",70347,46162,0.65620424467283611,0,"Water Cooled Chilled Water Plant",17,0.67300000000000004,"2022-10-31",331.66838102548792,"2nd Quartile",346.45278235034903,"2nd Quartile",368.53428191678393,"3rd Quartile"]
["THE STAR","1 VISTA EXCHANGE GREEN, SINGAPORE 138617","Commercial Building","Retail","Large",2012,"Gold",2023,"GM:2021 In Operation",62000,48097,0.77575806451612905,0,"Water Cooled Chilled Water Plant",12,"","",308.63545161290324,"2nd Quartile",329.59983870967744,"2nd Quartile",367.44566129032256,"3rd Quartile"]
["TIONG BAHRU PLAZA","302 TIONG BAHRU ROAD, SINGAPORE 168732","Commercial Building","Retail","Large",1996,"Platinum",2021,"Existing Building for Non-Residential buildings (version 3)",29450,26202,0.8897113752122241,0,"Water Cooled Chilled Water Plant",6,0.57899999999999996,"2021-11-11",348.83202201766392,"2nd Quartile",355.07095098892898,"2nd Quartile",354.53933947008335,"2nd Quartile"]
["JEM","52 JURONG GATEWAY ROAD, SINGAPORE 608549","Commercial Building","Retail","Large",2013,"Platinum",2022,"Existing Non-Residential Buildings (RECERT 2017)",108169,94786,0.87627693701522613,0,"Water Cooled Chilled Water Plant",9,0.55000000000000004,"2019-08-27",312.17482365557601,"2nd Quartile",332.25913154415775,"2nd Quartile",349.12188334920359,"2nd Quartile"]
["BUKIT TIMAH PLAZA","1 JALAN ANAK BUKIT, SINGAPORE 588996","Commercial Building","Retail","Large",1980,"Gold",2022,"Existing Non-Residential Buildings (RECERT 2017)",25772,23879,0.92654819183610115,0,"Water Cooled Chilled Water Plant",5,0.68,"2016-01-22",339.11801878007134,"2nd Quartile",341.45705339127721,"2nd Quartile",342.8671449635263,"2nd Quartile"]
["LEISURE PARK KALLANG","5 STADIUM WALK, SINGAPORE 397693","Commercial Building","Retail","Large",2009,null,null,null,25642,25642,1,0,"Water Cooled Chilled Water Plant",13,"","",358.97795491771308,"2nd Quartile",354.97631619998435,"2nd Quartile",340.9273718898682,"2nd Quartile"]
["WISMA ATRIA","435 ORCHARD ROAD SINGAPORE 238877, SINGAPORE 238877","Commercial Building","Retail","Large",1986,null,null,null,40063.660000000003,38000,0.94849047740520953,0,"Water Cooled Chilled Water Plant",17,0.82,"2012-12-15",301.03409274140205,"2nd Quartile",311.9121295957483,"2nd Quartile",340.43878167895792,"2nd Quartile"]
["THE PARAGON","290 ORCHARD ROAD, SINGAPORE 238859","Commercial Building","Retail","Large",2005,"Certified",2021,"Existing Building for Non-Residential buildings (version 3)",94391,79687,0.84422243646110329,0,"Water Cooled Chilled Water Plant",7,0.68,"2018-04-11",321.01136231208483,"2nd Quartile",340.81127967708784,"2nd Quartile",329.87432594209196,"2nd Quartile"]
["THE GALEN","61 SCIENCE PARK ROAD, SINGAPORE 117525","Commercial Building","Retail","Large",2002,"Platinum",2022,"Existing Non-Residential Buildings (RECERT 2017)",30686,27046,0.88137913054813266,0,"Water Cooled Chilled Water Plant",2009,0.44,"2022-12-06",215.23601968324317,"2nd Quartile",283.09750374763735,"2nd Quartile",329.57924134784594,"2nd Quartile"]
["RESORTS WORLD SENTOSA","8 SENTOSA GATEWAY, SINGAPORE 098269","Commercial Building","Retail","Large",2010,"Platinum",2020,"New Building for Non-Residential buildings (version 3)",343000,230000,0.67055393586005829,1612,"District Cooling System (DCS)","","","",333.65013411078718,null,338.560193877551,null,328.87674052478133]
["CG @ CLARKE QUAY","3A RIVER VALLEY ROAD, SINGAPORE 179020","Commercial Building","Retail","Large",2005,"Certified",2019,"Existing Non-Residental Buildings ENRB: 2017",34058,24671,0.72438193669622408,0,"Water Cooled Chilled Water Plant",2005,0.64800000000000002,"2022-06-07",529.65504433613251,"Bottom Quartile",330.26092254389573,"2nd Quartile",314.02900933701335,"2nd Quartile"]
["FAR EAST PLAZA","14 SCOTTS ROAD, SINGAPORE 228213","Commercial Building","Retail","Large",1982,"GoldPlus",2014,"Existing Building for Non-Residential buildings (version 3)",40749,38547,0.94596186409482441,0,"Water Cooled Chilled Water Plant",8,0.62,"2023-01-15",292.08533951753412,"2nd Quartile",275.6541066038431,"2nd Quartile",300.63401752190236,"2nd Quartile"]
["MARINA SQUARE SHOPPING MALL (EXCLUDING MANDARIN ORIENTAL, PARKROYAL COLLECTION AND PAN PACIFIC SINGAPORE)","6 RAFFLES BOULEVARD, SINGAPORE 039594","Commercial Building","Retail","Large",1986,"Gold",2022,"GM:2021 In Operation",122022,103485,0.84808477159856421,0,"Water Cooled Chilled Water Plant",15,0.64500000000000002,"2022-10-09",255.52121624883617,"2nd Quartile",269.42127410523733,"2nd Quartile",297.74319708342432,"2nd Quartile"]
["LUCKY PLAZA","304 ORCHARD ROAD #06-50, SINGAPORE 238863","Commercial Building","Retail","Large",1979,"Platinum",2022,"Existing Building for Non-Residential buildings (version 3)",46816,43903,0.93777768284347229,0,"Water Cooled Chilled Water Plant",8,0.56999999999999995,"2016-09-02",286.59232548701317,"2nd Quartile",272.0842188568011,"2nd Quartile",296.80462448735477,"2nd Quartile"]
["FAR EAST SQUARE","92 TELOK AYER STREET, SINGAPORE 048472","Commercial Building","Retail","Large",1998,null,null,null,29132,29179,1.0016133461485652,324,"Water Cooled Chilled Water Plant",4,0.75,"2023-01-01",360.6765755869834,"2nd Quartile",266.56672387752297,"2nd Quartile",293.45061101194563,"2nd Quartile"]
["THE CENTRAL","6 EU TONG SEN STREET, SINGAPORE 059817","Commercial Building","Retail","Large",2008,null,null,null,30768,27690,0.8999609984399376,0,"Water Cooled Chilled Water Plant",13,"","",282.60610181730652,"2nd Quartile",270.45122758454687,"2nd Quartile",288.75424238777231,"2nd Quartile"]
["SIM LIM SQUARE","1 ROCHOR CANAL ROAD, SINGAPORE 188504","Commercial Building","Retail","Large",1987,"Gold",2022,"GM:2021 In Operation",36325,28453,0.78328974535443907,0,"Water Cooled Chilled Water Plant",8,0.64,"2022-06-01",259.90542849277358,"2nd Quartile",287.21469015829319,"2nd Quartile",276.59927763248453,"2nd Quartile"]
["MILLENIA WALK","9 RAFFLES BOULEVARD SINGAPORE 039596, SINGAPORE 039596","Commercial Building","Retail","Large",1996,"Gold",2022,"Existing Non-Residential Buildings (RECERT 2017)",38276,28985,0.75726303688995711,0,"District Cooling System (DCS)","",0.67,"2013-03-20",241.57569153449799,null,262.26515711523825,null,275.57195064342017]
["THE CENTREPOINT","176 ORCHARD ROAD, SINGAPORE 238843","Commercial Building","Retail","Large",1983,"GoldPlus",2022,"Existing Non-Residental Buildings ENRB: 2017",55022,43000,0.78150557958634725,0,"Water Cooled Chilled Water Plant",16,"","",240.19704427319988,"2nd Quartile",271.20217076805636,"2nd Quartile",261.21072152956998,"2nd Quartile"]
["SUNTEC CITY MALL","3 TEMASEK BOULEVARD, SINGAPORE 038983","Commercial Building","Retail","Large",1995,"Gold",2022,"GM:2021 In Operation",142032,138405,0.97446350118283209,0,"Water Cooled Chilled Water Plant",9,0.61,"2022-04-08",222.40847037185185,"2nd Quartile",216.24076793489922,"2nd Quartile",232.20557225812436,"2nd Quartile"]
["PEOPLE'S PARK COMPLEX","1 PARK ROAD, SINGAPORE 059108, SINGAPORE 059108","Commercial Building","Retail","Large",1968,null,null,null,44900,20276,0.45158129175946549,0,"Water Cooled Chilled Water Plant",1,null,null,214.07487505567931,"2nd Quartile",225.51983674832965,"2nd Quartile",224.38559643652559,"2nd Quartile"]
["BUGIS JUNCTION","230 VICTORIA STREET, SINGAPORE 188024","Commercial Building","Retail","Large",1994,"Platinum",2021,"Existing Building for Non-Residential buildings (version 3)",82269,62958,0.76527002880793493,0,"Water Cooled Chilled Water Plant",7,0.59699999999999998,"2022-03-22",220.48799156978092,"2nd Quartile",225.7675089165779,"2nd Quartile",223.28352401686044,"2nd Quartile"]
["ESPLANADE MALL","8 RAFFLES AVENUE, SINGAPORE 039802, SINGAPORE 039802","Commercial Building","Retail","Large",2002,null,null,null,11035,9985,0.90484821024014495,0,"Water Cooled Chilled Water Plant",3,0.57999999999999996,"2018-10-31",228.82981029047511,"2nd Quartile",196.7271166403963,"2nd Quartile",221.72100878180589,"2nd Quartile"]
["BUKIT TIMAH SHOPPING CENTRE","170 UPPER BUKIT TIMAH ROAD, SINGAPORE 588179","Commercial Building","Retail","Large",1991,"Gold",2014,"Existing Building for Non-Residential buildings (version 3)",16597.48,49998,3.012385012664573,0,"Water Cooled Chilled Water Plant",1991,0.65,"2023-04-05",221.25465853852506,"2nd Quartile",210.75883266616381,"2nd Quartile",219.54111588024205,"2nd Quartile"]
["HAVELOCK 2","2 HAVELOCK ROAD, SINGAPORE 059763","Commercial Building","Retail","Large",2016,null,null,null,19970,16646,0.83355032548823238,0,"Others","","","",186.64757135703556,"Top Quartile",196.22864296444666,"2nd Quartile",216.93720580871306,"2nd Quartile"]
["SUB MC 1 OF MCST NO. 4622","26 BEACH ROAD, SINGAPORE 189768","Commercial Building","Retail","Large",2015,"Platinum",2012,"New Building for Non-Residential buildings (version 3)",11892.97,29991,2.5217418357231205,0,"Water Cooled Chilled Water Plant",7,0.84,"2023-06-30",180.1741315705483,"Top Quartile",193.50629559236651,"Top Quartile",212.94531802434719,"2nd Quartile"]
["KATONG SHOPPING CENTRE","865 MOUNTBATTEN ROAD, SINGAPORE 437844","Commercial Building","Retail","Large",1981,null,null,null,23076,21202,0.91879008493673076,0,"Water Cooled Chilled Water Plant","","","",183.79834330039864,"Top Quartile",192.34934910729763,"Top Quartile",200.34215808632345,"2nd Quartile"]
["FU LU SHOU COMPLEX","149 ROCHOR ROAD, SINGAPORE 188425","Commercial Building","Retail","Large",1983,"Gold",2020,"Existing Building for Non-Residential buildings (version 3)",16747,14500,0.86582671523257893,0,"Water Cooled Chilled Water Plant",3,0.61,"2022-07-08",190.03987221591925,"2nd Quartile",193.33151489819079,"Top Quartile",190.79320833582133,"2nd Quartile"]
["JOO CHIAT COMPLEX BLK 1 & 2","1 JOO CHIAT ROAD, SINGAPORE 420001","Commercial Building","Retail","Large",1982,"Platinum",2021,"Existing Building for Non-Residential buildings (version 3)",25347,24535,0.96796465064899195,0,"Water Cooled Chilled Water Plant","","","",190.24797648636931,"2nd Quartile",191.67915848029352,"Top Quartile",189.25778948198996,"2nd Quartile"]
["ORCHARD PLAZA","150 ORCHARD ROAD, SINGAPORE 238841","Commercial Building","Retail","Large",1982,"GoldPlus",2021,"Existing Building for Non-Residential buildings (version 3)",22331,79421,3.5565357574671981,0,"Water Cooled Chilled Water Plant",7,0.53,"2021-03-23",152.56850342573108,"Top Quartile",149.60898661054139,"Top Quartile",188.28017957099996,"Top Quartile"]
["PARKLANE SHOPPING MALL","35 SELEGIE ROAD, SINGAPORE 188307","Commercial Building","Retail","Large",1981,"Gold",2022,"Existing Non-Residental Buildings ENRB: 2017",21003.54,21000,0.99983145698296572,0,"Water Cooled Chilled Water Plant",3,0.74,"2022-02-01",206.02332083067898,"2nd Quartile",174.78867752769295,"Top Quartile",187.4948532485476,"Top Quartile"]
["THE GRANDSTAND SHOPPING MALL","200 TURF CLUB ROAD, SINGAPORE 287994","Commercial Building","Retail","Large",2012,null,null,null,75000,20000,0.26666666666666666,0,"Others","","","",160.70071813333334,"Top Quartile",192.11924440000001,"Top Quartile",186.85195253333333,"Top Quartile"]
["HOUGANG GREEN SHOPPING MALL","21 HOUGANG GREEN MCST2463, SINGAPORE 538719","Commercial Building","Retail","Large",2008,null,null,null,22912.7,0,0,0,"Others","","","",169.06902809359005,"Top Quartile",172.19353808150063,"Top Quartile",178.90607174187241,"Top Quartile"]
["TANJONG KATONG COMPLEX","845 GEYLANG ROAD, SINGAPORE 400845","Commercial Building","Retail","Large",1983,null,null,null,18841,13352,0.70866726819170955,0,"Water Cooled Chilled Water Plant",19,"","",144.89773472745611,"Top Quartile",167.59115280505279,"Top Quartile",163.15972612918634,"Top Quartile"]
["CATHAY BUILDING 2002 PTE LTD","2 HANDY ROAD UNIT #04-01, SINGAPORE 229233, SINGAPORE 229233","Commercial Building","Retail","Large",2002,null,null,null,34684,25164,0.72552185445738671,0,"Water Cooled Chilled Water Plant",21,0.89,"2012-11-11",166.31268740629687,"Top Quartile",153.28149925037485,"Top Quartile",155.26020816514819,"Top Quartile"]
["CITY PLAZA","810 GEYLANG ROAD\n#07-00 CITY PLAZA, SINGAPORE 409286","Commercial Building","Retail","Large",1983,null,null,null,33781,24602,0.7282792102069211,0,"Water Cooled Chilled Water Plant",16,"","",141.81612622480097,"Top Quartile",153.09776531186176,"Top Quartile",154.10118794588675,"Top Quartile"]
["PENINSULA SHOPPING COMPLEX","3 COLEMAN STREET, SINGAPORE 179804","Commercial Building","Retail","Large",1990,"GoldPlus",2023,"GM:2021 In Operation",9250,8953,0.96789189189189184,0,"Water Cooled Chilled Water Plant",3,0.62,"2023-03-31",169.7738951580011,"Top Quartile",158.85193349777617,"Top Quartile",150.27471594771495,"Top Quartile"]
["ROXY SQUARE","50 EAST COAST ROAD, SINGAPORE 428769","Commercial Building","Retail","Large",1990,"Gold",2021,"Existing Building for Non-Residential buildings (version 3)",79471,39210,0.49338752500912281,576,"Water Cooled Chilled Water Plant",1.5,"","",126.64284695045995,"Top Quartile",129.82727925910078,"Top Quartile",130.1908598104969,"Top Quartile"]
["268 ORCHARD ROAD","268 ORCHARD ROAD, SINGAPORE 238856","Commercial Building","Retail","Large",2014,null,null,null,16971,16167,0.95262506628955279,0,"Water Cooled Chilled Water Plant",8,0.79,"2017-05-05",111.50924341523775,"Top Quartile",143.21436096871133,"Top Quartile",129.86225561251547,"Top Quartile"]
["BRAS BASAH COMPLEX","231 BAIN STREET, SINGAPORE 180231","Commercial Building","Retail","Large",1980,"Gold",2022,"GM:2021 In Operation",29182,0,0,0,"Others","","","",122.15765643204713,"Top Quartile",129.89587793845521,"Top Quartile",129.00093208142005,"Top Quartile"]
["TEXTILE CENTRE","200 JALAN SULTAN, SINGAPORE 199018","Commercial Building","Retail","Large",1983,null,null,null,47478,22804,0.48030666835165758,0,"Water Cooled Chilled Water Plant",6,"","",124.12184253759639,"Top Quartile",120.21771473103333,"Top Quartile",121.07360946122415,"Top Quartile"]
["SINGAPORE EXPO","1 EXPO DRIVE, #02-01, SINGAPORE 486150","Commercial Building","Retail","Large",1999,"Platinum",2022,"GM:2021 In Operation",161545,119109,0.73731158500727356,0,"Water Cooled Chilled Water Plant",5,0.6,"2023-02-01",109.1991364635241,"Top Quartile",70.282100962580088,"Top Quartile",118.48220464885945,"Top Quartile"]
["THE BENCOOLEN MCST 2576","180 BENCOOLEN STREET, SINGAPORE 189646","Commercial Building","Retail","Large",1999,null,null,null,29798,7800,0.26176253439828179,0,"Others","","","",114.90452177998523,"Top Quartile",117.85875461440367,"Top Quartile",117.52576750117457,"Top Quartile"]
["BEAUTY WORLD CENTRE","144 UPPER BUKIT TIMAH ROAD, SINGAPORE 588177","Commercial Building","Retail","Large",1984,"GoldPlus",2018,"Existing Building for Non-Residential buildings (version 3)",47840,3827,7.9995819397993315E-2,0,"Water Cooled Chilled Water Plant",5,0.56100000000000005,"2022-08-11",109.71788168896323,"Top Quartile",115.52963001672242,"Top Quartile",115.03502675585284,"Top Quartile"]
["OG ORCHARD POINT","160 ORCHARD ROAD, SINGAPORE 238842","Commercial Building","Retail","Large",1990,null,null,null,26671,24094,0.90337820104233058,88,"Water Cooled Chilled Water Plant",19,"","",110.55892167522778,"Top Quartile",115.79929511454388,"Top Quartile",114.80158224288553,"Top Quartile"]
["BUGIS VILLAGE AND BUGIS STREET","62 TO 67 QUEEN STREET/151 TO 166 ROCHOR ROAD/229 TO 253 VICTORIA STREET (ODD NO. ONLY)\n52 QUEEN STREET / 1 TO 5 AND 7 NEW BUGIS STREET, SINGAPORE 188546","Commercial Building","Retail","Large",1991,null,null,null,24985,21237,0.84998999399639785,0,"Others","","","",70.680261356814086,"Top Quartile",107.06485011006602,"Top Quartile",98.310601961176715,"Top Quartile"]
["CHIJMES","30 VICTORIA STREET, SINGAPORE 187996","Commercial Building","Retail","Large",2014,null,null,null,119287,6882,5.7692791335183215E-2,0,"Air Cooled Chilled Water Plant","","","",53.496766621677132,"Top Quartile",56.849534316396593,"Top Quartile",63.483263054649711,"Top Quartile"]
["DEPOT HEIGHTS SHOPPING CENTRE","108 DEPOT RD, SINGAPORE 100108","Commercial Building","Retail","Large",2004,"Gold",2021,"Existing Building for Non-Residential buildings (version 2.1)",38235.919999999998,0,0,0,"Others","","","",37.179162159560953,"Top Quartile",36.251923845431214,"Top Quartile",39.585985115566729,"Top Quartile"]
["CHANGI EXHIBITION CENTRE","9, AVIATION PARK ROAD, SINGAPORE 498760","Commercial Building","Retail","Large",2007,null,null,null,51909,51909,1,0,"Water Cooled Chilled Water Plant",15,"","",30.768456337051379,"Top Quartile",6.9794794736943491,"Top Quartile",13.224134543142807,"Top Quartile"]
["VIIO@BALESTIER","520 BALESTIER ROAD, SINGAPORE 329853","Commercial Building","Retail","Large",2018,null,null,null,614910,202973,0.33008570359890066,0,"Others","","","",1.1060492104535622,"Top Quartile",1.2323720707095347,"Top Quartile",1.3018074514969671,"Top Quartile"]
["THE SELETAR MALL","33 SENGKANG WEST AVENUE, SINGAPORE 797653","Commercial Building","Retail","Medium",2014,"Gold",2023,"GM:2021 In Operation",11590.86,11591,1.0000120784825284,0,"Water Cooled Chilled Water Plant",8,0.63,"2023-01-01",1368.3704660396209,"Bottom Quartile",1475.6650498755052,"Bottom Quartile",1414.9932360497839,"Bottom Quartile"]
["RIVERVALE MALL","11 RIVERVALE CRESCENT\n02-21, SINGAPORE 545082","Commercial Building","Retail","Medium",2000,"GoldPlus",2020,"Existing Non-Residental Buildings ENRB: 2017",10249,7541,0.73577910040003902,0,"Water Cooled Chilled Water Plant","","","",753.13068299346287,"Bottom Quartile",803.26235144892178,"Bottom Quartile",820.68887110937658,"Bottom Quartile"]
["MYVILLAGE AT SERANGOON GARDEN","1 MAJU AVENUE, SINGAPORE 556679, SINGAPORE 556679","Commercial Building","Retail","Medium",2010,null,null,null,5312,2433,0.45801957831325302,0,"Others","","","",735.40950489457828,"Bottom Quartile",741.57609186746993,"Bottom Quartile",723.44072289156634,"Bottom Quartile"]
["YEW TEE SQUARE","623 CHOA CHU KANG STREET 62, SINGAPORE 680623, SINGAPORE 680623","Commercial Building","Retail","Medium",1996,null,null,null,5659,2115,0.37374094362961652,0,"Others",null,null,null,136.2666177769924,"Top Quartile",693.67779289627151,"Bottom Quartile",692.58762325499208,"Bottom Quartile"]
["TAMPINES MART","5 TAMPINES STREET 32, SINGAPORE 529284","Commercial Building","Retail","Medium",1996,null,null,null,9900,99,0.01,0,"Others","","","",512.27944242424246,"Bottom Quartile",662.76753838383843,"Bottom Quartile",675.29959090909097,"Bottom Quartile"]
["HOLLAND PIAZZA","3 LORONG LIPUT, SINGAPORE 277725","Commercial Building","Retail","Medium",2018,null,null,null,2026,1600,0.7897334649555775,0,"Others","","","",577.85401283316878,"Bottom Quartile",697.08098716683128,"Bottom Quartile",660.08662882527153,"Bottom Quartile"]
["HEARTLAND MALL KOVAN","205 HOUGANG STREET 21, SINGAPORE 530205","Commercial Building","Retail","Medium",1984,null,null,null,11402,11302,0.99122960884055433,0,"Others","","","",608.69518768637079,"Bottom Quartile",660.31351692685496,"Bottom Quartile",649.23231187510964,"Bottom Quartile"]
["YEWTEE POINT","21 CHOA CHU KANG NORTH 6, SINGAPORE 689578","Commercial Building","Retail","Medium",2008,"Certified",2020,"Existing Building for Non-Residential buildings (version 3)",10880,7490,0.68841911764705888,0,"Water Cooled Chilled Water Plant",12,"","",599.42878676470593,"Bottom Quartile",594.62014705882359,"Bottom Quartile",593.12832720588233,"Bottom Quartile"]
["YISHUN 10 CINEMA COMPLEX","51 YISHUN CENTRAL 1, SINGAPORE 768794","Commercial Building","Retail","Medium",1992,null,null,null,5574,5017,0.90007176175098669,0,"Others","","","",433.6282274847506,"3rd Quartile",533.00991747398643,"Bottom Quartile",553.22312881234302,"Bottom Quartile"]
["FARRER SQUARE","10 FARRER PARK STATION ROAD, SINGAPORE 217564","Commercial Building","Retail","Medium",2017,"GoldPlus",2022,"Existing Non-Residential Buildings (RECERT 2017)",8657,6047,0.69850987640060069,300,"Water Cooled Chilled Water Plant","","","",441.84723345269725,"Bottom Quartile",479.35318239574912,"3rd Quartile",543.46245812637176,"Bottom Quartile"]
["QUAYSIDE ISLE","31 OCEAN WAY, SINGAPORE 098375, SINGAPORE 098375","Commercial Building","Retail","Medium",2012,null,null,null,5729,3836,0.66957584220631872,0,"Others",null,null,null,434.12614417873976,"Bottom Quartile",493.9200610926863,"3rd Quartile",539.91543026706233,"Bottom Quartile"]
["RAFFLES HOLLAND V","118 HOLLAND AVENUE, SINGAPORE 278997","Commercial Building","Retail","Medium",2018,null,null,null,6011,4900,0.81517218432873062,0,"Water Cooled Chilled Water Plant",7,0.72699999999999998,"2023-06-30",463.57152387289972,"Bottom Quartile",448.18296123773081,"3rd Quartile",514.45595075694564,"Bottom Quartile"]
["JUNCTION 10","1 WOODLANDS RD, SINGAPORE 677899","Commercial Building","Retail","Medium",2014,null,null,null,11263,11259,0.99964485483441357,0,"Others","","","",446.7995365355589,"Bottom Quartile",467.86461511142682,"3rd Quartile",510.87151291840536,"Bottom Quartile"]
["ANCHORPOINT SHOPPING CENTRE","370 ALEXANDRA ROAD, SINGAPORE 159953","Commercial Building","Retail","Medium",1997,null,null,null,9544,8924,0.93503772003352892,0,"Water Cooled Chilled Water Plant","","","",489.05947820620275,"Bottom Quartile",491.62694991617775,"3rd Quartile",503.03119132439235,"Bottom Quartile"]
["KAP","KING ALBERT PARK, SINGAPORE 598332","Commercial Building","Retail","Medium",2016,null,null,null,5535,3000,0.54200542005420049,0,"Others","","","",419.84715989159889,"3rd Quartile",475.72986991869914,"3rd Quartile",483.41340921409216,"Bottom Quartile"]
["CANBERRA PLAZA","133 CANBERRA VIEW, SINGAPORE 750133","Commercial Building","Retail","Medium",2019,null,null,null,11000,9800,0.89090909090909087,0,"Water Cooled Chilled Water Plant",3,0.5,"2023-08-01",19.204727272727272,"Top Quartile",447.13630818181821,"3rd Quartile",480.45750636363641,"Bottom Quartile"]
["ALEXANDRA CENTRAL","321 ALEXANDRA ROAD\n#02-47, SINGAPORE 159971","Commercial Building","Retail","Medium",2014,null,null,null,8677,1758,0.20260458683876917,0,"Water Cooled Chilled Water Plant",8,0.63,"2022-10-21",516.42230263916099,"Bottom Quartile",477.78713841189341,"3rd Quartile",478.49308401521267,"3rd Quartile"]
["VISTA POINT","BLOCK 548 WOODLANDS DRIVE 44, SINGAPORE 730548","Commercial Building","Retail","Medium",1999,"Gold",2011,"Existing Building (version 2)",11260,3000,0.26642984014209592,0,"Others","","","",459.86852309058617,"Bottom Quartile",456.20925399644761,"3rd Quartile",475.62365452930726,"3rd Quartile"]
["DAWSON PLACE","57 DAWSON ROAD, SINGAPORE 142057","Commercial Building","Retail","Medium",2001,"Gold",2022,"Existing Non-Residental Buildings ENRB: 2017",6227,6227,1,0,"Others","",0.88,"2023-02-20",439.09726834751888,"Bottom Quartile",428.25365665649593,"3rd Quartile",434.5128745784487,"3rd Quartile"]
["SCOTTS SQUARE RETAIL","6 SCOTTS ROAD, SINGAPORE 228209","Commercial Building","Retail","Medium",2010,null,null,null,12153.916999999999,11588,0.95343748027899156,0,"Water Cooled Chilled Water Plant","","","",430.71871397509136,"3rd Quartile",433.69281689187119,"3rd Quartile",423.62194838092114,"3rd Quartile"]
["GRID","1 SELEGIE ROAD\n#05-03, SINGAPORE 188306","Commercial Building","Retail","Medium",2024,"Certified",2022,"Existing Non-Residental Buildings ENRB: 2017",9904.5299999999988,18357,1.8533943559159296,0,"Water Cooled Chilled Water Plant","","","","","Bottom Quartile","","Bottom Quartile",416.20269311113202,"3rd Quartile"]
["SEMBAWANG MART","BLOCK 511 CANBERRA ROAD, SINGAPORE 750511","Commercial Building","Retail","Medium",2010,"GoldPlus",2022,"Existing Building for Non-Residential buildings (version 3)",5345,0,0,0,"Others","",5,"2022-10-01",405.70082507015894,"3rd Quartile",397.02455940130966,"3rd Quartile",411.93669597754916,"3rd Quartile"]
["ORCHARD SHOPPING CENTRE","321 ORCHARD ROAD, SINGAPORE 238866","Commercial Building","Retail","Medium",2008,null,null,null,4102,4012,0.97805948317893709,0,"Water Cooled Chilled Water Plant",1,"","",324.97206728425164,"3rd Quartile",389.06113846903952,"3rd Quartile",383.91498049731837,"3rd Quartile"]
["TAMAN JURONG SHOPPING CENTRE","399 YUNG SHENG ROAD, SINGAPORE 610399","Commercial Building","Retail","Medium",1996,"Gold",2013,"Existing Building for Non-Residential buildings (version 2.1)",11820,7656,0.64771573604060917,0,"Others","","","",381.69998561759712,"3rd Quartile",387.4017614213198,"3rd Quartile",375.29742216582065,"3rd Quartile"]
["HOLLAND ROAD SHOPPING CENTRE","211 HOLLAND AVENUE, SINGAPORE 278967, SINGAPORE 278967","Commercial Building","Retail","Medium",1972,null,null,null,7403,7200,0.97257868431716876,0,"Water-Cooled Package Units",null,null,null,380.2342604349588,"3rd Quartile",349.56582196406868,"3rd Quartile",374.36435228961227,"3rd Quartile"]
["GRANDLINK SQUARE","511 GUILLEMARD ROAD, SINGAPORE 399849","Commercial Building","Retail","Medium",2001,null,null,null,9429,5600,0.59391239792130657,0,"Others","","","",362.94146781206911,"3rd Quartile",369.88184749178066,"3rd Quartile",373.36525506416376,"3rd Quartile"]
["THE WOODGROVE","30 WOODGROVE AVENUE 1 SINGAPORE 739065, SINGAPORE 739065","Commercial Building","Retail","Medium",2000,null,null,null,10000,6000,0.6,0,"Others","","","",347.13597899999996,"3rd Quartile",349.91612099999998,"3rd Quartile",359.30265200000002,"3rd Quartile"]
["JUBILEE SQUARE","61 ANG MO KIO AVE 8, SINGAPORE 569814","Commercial Building","Retail","Medium",2011,null,null,null,5096,4777,0.93740188383045531,0,"Water-Cooled Package Units",null,"","",365.78430141287288,"3rd Quartile",362.90958202511774,"3rd Quartile",338.19780612244898,"3rd Quartile"]
["JUNCTION NINE","18 YISHUN AVENUE 9 SINGAPORE 768897, SINGAPORE 768897","Commercial Building","Retail","Medium",2016,null,null,null,9921,7374,0.74327184759600851,0,"Water Cooled Chilled Water Plant",7,0,"2023-07-25",266.74522729563557,"2nd Quartile",311.30549138191719,"2nd Quartile",333.39637032557204,"3rd Quartile"]
["321 CLEMENTI","321 CLEMENTI AVE 3, SINGAPORE 129905","Commercial Building","Retail","Medium",2015,"Platinum",2015,"New Building for Non-Residential buildings (version 4.1)",7564,6564,0.86779481755684817,0,"Water Cooled Chilled Water Plant",7,119,"2019-09-17",249.76407059756741,"2nd Quartile",267.75227128503434,"2nd Quartile",330.62065441565306,"2nd Quartile"]
["THE ORIENTAL PLAZA","291 NEW BRIDGE ROAD, SINGAPORE 088756","Commercial Building","Retail","Medium",1993,null,null,null,5992,3534,0.58978638184245658,0,"Air Cooled Chilled Water Plant","","","",293.9727419893191,"2nd Quartile",305.72114152202943,"2nd Quartile",316.22520527369824,"2nd Quartile"]
["DJIT SUN MALL","5 ANG MO KIO CENTRAL 2, SINGAPORE 569663, SINGAPORE 569663","Commercial Building","Retail","Medium",2013,null,null,null,5103,4500,0.88183421516754845,0,"Water Cooled Chilled Water Plant",6,0.8,"2015-07-09",343.44797961983147,"3rd Quartile",392.85292181069957,"3rd Quartile",315.85197922790513,"2nd Quartile"]
["ORCHARDGATEWAY@EMERALD","218 ORCHARD ROAD, SINGAPORE 238851","Commercial Building","Retail","Medium",2014,"Gold",2022,"New Building for Non-Residential buildings (version 3)",9733,8363,0.85924175485461829,0,"Air Cooled Chilled Water Plant","","","",263.60153601150722,"2nd Quartile",288.4306739956848,"2nd Quartile",315.11512380560976,"2nd Quartile"]
["QUEENSWAY SHOPPING CENTRE","1 QUEENSWAY, SINGAPORE 149053","Commercial Building","Retail","Medium",1974,null,null,null,12977,7925,0.61069584649764974,0,"Water Cooled Chilled Water Plant",24,"","",298.90591893349762,"3rd Quartile",310.42825306311158,"2nd Quartile",310.13556677198119,"2nd Quartile"]
["BUGIS CUBE","470 NORTH BRIDGE ROAD, SINGAPORE 188735, SINGAPORE 188735","Commercial Building","Retail","Medium",1984,null,null,null,6188,4800,0.77569489334195219,0,"Others",null,null,null,248.72013897866842,"2nd Quartile",246.83280219780221,"2nd Quartile",297.45038461538462,"2nd Quartile"]
["BALESTIER POINT","279 BALESTIER ROAD, SINGAPORE 329727","Commercial Building","Retail","Medium",1988,null,null,null,6154,4315,0.70116997075073129,0,"Air Cooled Chilled Water Plant","","","",303.60411114722137,"3rd Quartile",316.38981962950919,"2nd Quartile",291.68561260968477,"2nd Quartile"]
["HOUGANG1","1. HOUGANG STREET 91, SINGAPORE 538692","Commercial Building","Retail","Medium",2012,null,null,null,9821,8500,0.86549231239181346,0,"Air Cooled Chilled Water Plant","","","",889.98511149577428,"Bottom Quartile",796.02719071377658,"Bottom Quartile",285.24186946339478,"2nd Quartile"]
["THE SUBSIDIARY MANAGEMENT CORPORATION NO. 1 STRATA TITLE PLAN NO. 4440","1187 UPPER SERANGOOON ROAD #01-72, SINGAPORE 533971","Commercial Building","Retail","Medium",2016,null,null,null,6359,87,1.3681396445982073E-2,0,"Others","",2,"2023-03-28",228.4735791791162,"2nd Quartile",259.35923572888811,"2nd Quartile",283.07884415788646,"2nd Quartile"]
["230 STADIUM BOULEVARD","230 STADIUM BOULEVARD, SINGAPORE 397799","Commercial Building","Retail","Medium",2018,null,null,null,5300,5000,0.94339622641509435,0,"Others",null,null,null,244.26050943396226,"2nd Quartile",293.11222641509437,"2nd Quartile",282.57639622641506,"2nd Quartile"]
["SINGAPORE FLYER","30 RAFFLES  AVENUE, SINGAPORE 039803","Commercial Building","Retail","Medium",2009,"Certified",2007,"New Building (version 1)",13000,7508,0.57753846153846156,0,"Water Cooled Chilled Water Plant",14,"","",242.54334615384616,"2nd Quartile",253.80134615384614,"2nd Quartile",281.18407692307693,"2nd Quartile"]
["MIDPOINT ORCHARD","220 ORCHARD ROAD #01-11, SINGAPORE 238852","Commercial Building","Retail","Medium",1984,null,null,null,5369,5321,0.99105978766995717,0,"Others","",1.34,"2016-09-23",313.49361519836094,"3rd Quartile",316.08850623952321,"2nd Quartile",275.5082007822686,"2nd Quartile"]
["BALMORAL PLAZA","271 BUKIT TIMAH, SINGAPORE 259708","Commercial Building","Retail","Medium",1990,null,null,null,12349,7732,0.62612357275892783,0,"Water-Cooled Package Units","","","",188.44021135314603,"Top Quartile",202.36249979755448,"Top Quartile",242.7789116527654,"Top Quartile"]
["CUPPAGE PLAZA","5 KOEK ROAD, SINGAPORE 228796","Commercial Building","Retail","Medium",1983,null,null,null,14571,8000,0.54903575595360643,0,"Water Cooled Chilled Water Plant",22,0.65,"2013-07-08",228.95700775512998,"2nd Quartile",212.68065335254957,"Top Quartile",238.18050923066366,"Top Quartile"]
["KATONG PLAZA","1 BROOKE ROAD, SINGAPORE 429979","Commercial Building","Retail","Medium",1980,null,null,null,5411,3589,0.66327850674551836,0,"Water Cooled Chilled Water Plant",34,"","",215.92111439659951,"Top Quartile",226.81536314914064,"Top Quartile",230.27824801330624,"Top Quartile"]
["BALESTIER PLAZA","400 BALESTIER ROAD, SINGAPORE 329802, SINGAPORE 329802","Commercial Building","Retail","Medium",1984,null,null,null,8199,3304,0.40297597267959506,0,"Water-Cooled Package Units",null,null,null,220.36148066837418,"2nd Quartile",214.70191120868395,"Top Quartile",214.14383705329919,"Top Quartile"]
["RUBIKON","3501 JALAN BUKIT MERAH, SINGAPORE 159460, SINGAPORE 159460","Commercial Building","Retail","Medium",2015,null,null,null,5003,4800,0.95942434539276433,0,"Water-Cooled Package Units","","","",165.16148311013393,"Top Quartile",177.84702778333002,"Top Quartile",203.4838896662003,"Top Quartile"]
["OG BUILDING","100 UPPER CROSS STREET, SINGAPORE 058360","Commercial Building","Retail","Medium",2003,null,null,null,12439,11430,0.9188841546748131,0,"Water Cooled Chilled Water Plant",20,"","",179.59110459040116,"Top Quartile",203.77393681164079,"Top Quartile",199.69065037382427,"Top Quartile"]
["THE FLOW","66 EAST COAST ROAD, SINGAPORE 428778","Commercial Building","Retail","Medium",2017,null,null,null,5800,4000,0.68965517241379315,0,"Others","",107,"2018-05-31",121.72271206896552,"Top Quartile",160.99870862068968,"Top Quartile",190.88208103448278,"Top Quartile"]
["LUCKY CHINATOWN","211 NEW BRIDGE ROAD, SINGAPORE 059432","Commercial Building","Retail","Medium",1992,"Gold",2019,"Existing Building for Non-Residential buildings (version 3)",5907,4726,0.80006771626883355,0,"Water Cooled Chilled Water Plant",5,0.67500000000000004,"2021-06-22",215.03436600643303,"Top Quartile",179.46097850008465,"Top Quartile",189.25050787201624,"Top Quartile"]
["*SCAPE","2 ORCHARD LINK, SINGAPORE 237978","Commercial Building","Retail","Medium",2010,"Gold",2021,"Existing Building for Non-Residential buildings (version 3)",13102,8608,0.65699893146084565,0,"Others","","","",232.35354831323463,"2nd Quartile",215.37942985803696,"Top Quartile",175.97515493817738,"Top Quartile"]
["UPPER SERANGOON SHOPPING CENTRE","756 UPPER SERANGOON ROAD #02-39A, SINGAPORE 534626","Commercial Building","Retail","Medium",1982,"Gold",2017,"Existing Building for Non-Residential buildings (version 3)",12969,12000,0.92528336803145961,0,"Water Cooled Chilled Water Plant",2,0.625,"2018-08-29",130.02997763898526,"Top Quartile",147.78077029840387,"Top Quartile",153.81520703215358,"Top Quartile"]
["DELFI ORCHARD","ORCHARD ROAD, SINGAPORE 238876","Commercial Building","Retail","Medium",1984,null,null,null,11608,11608,1,0,"Water-Cooled Package Units","","","",151.6948716402481,"Top Quartile",152.32794796691934,"Top Quartile",149.20697880771883,"Top Quartile"]
["SINGAPORE DISCOVERY CENTRE","510 UPPER JURONG ROAD, SINGAPORE 638365","Commercial Building","Retail","Medium",1996,"Platinum",2022,"Existing Non-Residental Buildings ENRB: 2017",11329,10551,0.93132668373201521,0,"Water Cooled Chilled Water Plant",1,0.6,"2023-01-09",162.34619119074941,"Top Quartile",219.4735660693795,"Top Quartile",147.28881366404801,"Top Quartile"]
["SINGAPORE SHOPPING CENTRE","190 CLEMENCEAU AVENUE, SINGAPORE 239924","Commercial Building","Retail","Medium",1982,"Gold",2016,"Existing Building for Non-Residential buildings (version 3)",11356,11070,0.97481507573089121,0,"Water Cooled Chilled Water Plant","","","",144.91653663261712,"Top Quartile",155.3721239873195,"Top Quartile",140.03907802042974,"Top Quartile"]
["MING ARCADE","MING ARCADE, 21 CUSCADEN ROAD, SINGAPORE 249720","Commercial Building","Retail","Medium",1983,null,null,null,5338,5000,0.93668040464593483,0,"Air Cooled Chilled Water Plant","","","",167.0418902210566,"Top Quartile",137.57496253278379,"Top Quartile",137.92984263769202,"Top Quartile"]
["THE ROCHESTER","35 ROCHESTER DRIVE, SINGAPORE 138639","Commercial Building","Retail","Medium",2011,"Gold",2009,"New Building for A/C buildings (version 2)",8599,6523,0.75857657867193862,0,"District Cooling System (DCS)","","","",103.94673799278986,null,116.3053843470171,null,125.26700779160367]
["TELOK BLANGAH HOUSE","52 TELOK BLANGAH ROAD, SINGAPORE 098829","Commercial Building","Retail","Medium",1984,null,null,null,4305.3999999999996,2310,0.53653551354113449,0,"Others","","","",102.03392716123939,"Top Quartile",100.88074743345567,"Top Quartile",89.957952803456124,"Top Quartile"]
["OASIS","87 SCIENCE PARK DRIVE, SINGAPRE SCIENCE PARK 1, SINGAPORE 118260","Commercial Building","Retail","Medium",1996,"Certified",2019,"Existing Non-Residental Buildings ENRB: 2017",6431,6100,0.94853055512361995,0,"Water Cooled Chilled Water Plant",7,0.65,"2022-12-07",48.755075415953975,"Top Quartile",46.859549059244287,"Top Quartile",40.851811537863476,"Top Quartile"]
["HIAP HOE BUILDING AT ZHONGSHAN PARK","18 AH HOOD ROAD, SINGAPORE 329983","Commercial Building","Retail",null,2013,null,null,null,14794,10826,0.73178315533324323,13,"Air Cooled Chilled Water Plant","","",""]
["THE FULLERTON WATERBOATHOUSE","3 FULLERTON ROAD SINGAPORE 049215, SINGAPORE 049215","Commercial Building","Retail",null,2003,null,null,null,1763,1263,0.71639251276233695,0,"Air Cooled Chilled Water Plant","","",""]
["OUE LINK","62 COLLYER QUAY, SINGAPORE 049325","Commercial Building","Retail",null,2011,"Gold",2019,"Existing Building for Non-Residential buildings (version 3)",277,276,0.99638989169675085,0,"Water Cooled Chilled Water Plant",11,"",""]
["OUE TOWER","60 COLLYER QUAY, SINGAPORE 049322","Commercial Building","Retail",null,2011,"Gold",2019,"Existing Building for Non-Residential buildings (version 3)",1549,1089,0.70303421562298252,0,"Water Cooled Chilled Water Plant",11,"",""]
["MARINA BAY LINK MALL","8A MARINA BOULEVARD, SINGAPORE 018984","Commercial Building","Retail",null,2009,"Platinum",2020,"Existing Building for Non-Residential buildings (version 3)",7700,7700,1,0,"District Cooling System (DCS)","","",""]
["ESPLANADE MALL","1 ESPLANADE DRIVE, SINGAPORE 038981","Commercial Building","Retail",null,2002,"Platinum",2022,"Existing Non-Residental Buildings ENRB: 2017",11135.43,9985,0.89668742024331338,0,"Water Cooled Chilled Water Plant",6,"",""]
["MANDARIN GALLERY","333A ORCHARD RD, SINGAPORE 238897","Commercial Building","Retail",null,2011,"Gold",2020,"Existing Building for Non-Residential buildings (version 2.1)",18250,15000,0.82191780821917804,0,"Water Cooled Chilled Water Plant",13,"",""]
["BUGIS JUNCTION","200 VICTORIA STREET, SINGAPORE 188021","Commercial Building","Retail",null,1994,"Platinum",2021,"Existing Building for Non-Residential buildings (version 3)",53607,43000,0.80213404965769397,0,"Water Cooled Chilled Water Plant",10,0.63700000000000001,"2021-07-19"]
["WESTGATE","3 GATEWAY DRIVE, SINGAPORE 608532","Commercial Building","Retail",null,2013,"Platinum",2022,"New Building for Non-Residential buildings (version 4.1)",55178,35580,0.64482221175106025,0,"Water Cooled Chilled Water Plant",9,0.54,"2016-09-14"]
["MARINA BAY SANDS","2 BAYFRONT AVENUE, SINGAPORE 018972","Commercial Building","Retail",null,2010,"Platinum",2021,"Existing Building for Non-Residential buildings (version 3)",28373,28373,1,0,"District Cooling System (DCS)","","",""]
["MARINA BAY SANDS","8 BAYFRONT AVENUE, SINGAPORE 018955","Commercial Building","Retail",null,2010,"Platinum",2021,"Existing Building for Non-Residential buildings (version 3)",60996,60996,1,0,"District Cooling System (DCS)","","",""]
["MARINA BAY SANDS","10 BAYFRONT AVENUE, SINGAPORE 018956","Commercial Building","Retail",null,2010,"Platinum",2021,"Existing Building for Non-Residential buildings (version 3)",231462,231462,1,0,"District Cooling System (DCS)","","",""]
["SUNTEC SINGAPORE CONVENTION AND EXHIBITION CENTRE","1 RAFFLES BOULEVARD, SINGAPORE 039593","Commercial Building","Retail",null,1991,"Gold",2022,"GM:2021 In Operation",60281.97,58261,0.96647471872601376,0,"Water-Cooled Package Units","","",""]
["C.K. TANG LIMITED","310 ORCHARD ROAD, SINGAPORE 238864","Commercial Building","Retail",null,1982,"Gold",2021,"Existing Building for Non-Residential buildings (version 3)",17505,16423,0.93818908883176233,0,"Water Cooled Chilled Water Plant",10,0.65,"2011-10-01"]
["36 BEACH ROAD","36 BEACH ROAD, SINGAPORE 189766","Commercial Building","Retail",null,2015,null,null,null,1394,643,0.46126255380200859,0,"Water Cooled Chilled Water Plant",2,0.65]
["TRIO MALL","11 SAM LEONG ROAD, SINGAPORE 207903","Commercial Building","Mixed Development",null,2019,null,null,null,317,60,0.1892744479495268,0,"District Cooling System (DCS)","","","",2258.1253627760252,null,2649.7273186119874,null,3370.3713564668769]
["SQUARE 2 / NOVENA MEDICAL CENTER","10 SINARAN DRIVE, SINGAPORE 307506","Commercial Building","Mixed Development",null,2006,null,null,null,31615,30116,0.95258579788075282,0,"Water Cooled Chilled Water Plant",17,"","",521.5617902894196,"Bottom Quartile",526.80142337498023,"Bottom Quartile",533.02910011070696,"Bottom Quartile"]
["PACIFIC PLAZA","9 SCOTTS ROAD, SINGAPORE 228210","Commercial Building","Mixed Development",null,1997,null,null,null,10938,8185,0.74830864874748582,0,"Air Cooled Chilled Water Plant","","","",313.08403547266414,"Bottom Quartile",324.2368038032547,"Bottom Quartile",358.17011885170962,"Bottom Quartile"]
["FORUM THE SHOPPING MALL","583 ORCHARD ROAD, SINGAPORE 238884","Commercial Building","Mixed Development",null,1985,null,null,null,24639,23238,0.94313892609277972,0,"Water Cooled Chilled Water Plant",13,0.97,"2023-01-31",344.65627663460367,"Bottom Quartile",351.91077154105278,"Bottom Quartile",344.52581273590647,"Bottom Quartile"]
["ORCHARDGATEWAY","277 ORCHARD ROAD, SINGAPORE 238858","Commercial Building","Mixed Development",null,2014,"Platinum",2020,"New Building for Non-Residential buildings (version 3)",48324,48324,1,499,"Water Cooled Chilled Water Plant",9,"","",302.62167866898437,"Bottom Quartile",308.80537621057857,"Bottom Quartile",324.17457164142041,"Bottom Quartile"]
["CHINATOWN POINT","133 NEW BRIDGE ROAD, SINGAPORE 059413","Commercial Building","Mixed Development",null,1990,"Gold",2022,"Existing Non-Residental Buildings ENRB: 2017",53610,53610,1,0,"Water Cooled Chilled Water Plant",7,"","",303.2422529378847,"Bottom Quartile",312.86981122924823,"Bottom Quartile",323.71920686439097,"Bottom Quartile"]
["ROYAL SQUARE AT NOVENA","103 IRRAWADDY ROAD, SINGAPORE 329566","Commercial Building","Mixed Development",null,2017,null,null,null,28431,9079,0.31933452921107242,250,"Water Cooled Chilled Water Plant",6,0.66400000000000003,"2022-12-15",273.02289754141606,"3rd Quartile",297.71833561957021,"Bottom Quartile",322.79068622278498,"Bottom Quartile"]
["RIVERSIDE POINT","30 MERCHANT ROAD, RIVERSIDE POINT, SINGAPORE 058282","Commercial Building","Mixed Development",null,1996,null,null,null,13128,8981,0.68411029859841554,0,"Water Cooled Chilled Water Plant",23,1.1000000000000001,"2018-12-28",270.23499390615478,"3rd Quartile",274.91301035953688,"Bottom Quartile",306.915676416819,"Bottom Quartile"]
["AMARA SINGAPORE","165, TANJONG PAGAR, SINGAPORE 088539","Commercial Building","Mixed Development",null,1988,"Gold",2023,"GM:2021 In Operation",52095,42900,0.82349553699971212,384,"Water Cooled Chilled Water Plant",5,"","",288.80742873596313,"3rd Quartile",286.84428448027643,"Bottom Quartile",284.91851425280737,"Bottom Quartile"]
["FUNAN","109 NORTH BRIDGE ROAD, SINGAPORE 179097, SINGAPORE 179097","Commercial Building","Mixed Development",null,2019,"GoldPlus",2022,"New Building for Non-Residential buildings (version 4.1)",83776,75398,0.89999522536287246,400,"Water Cooled Chilled Water Plant",4,0.622,"2022-09-20",352.52331932773109,"Bottom Quartile",272.12122803666921,"Bottom Quartile",279.79917398777695,"Bottom Quartile"]
["INCOME AT PRINSEP","30 PRINSEP STREET, SINGAPORE 188647","Commercial Building","Mixed Development",null,1992,"Gold",2022,"GM:2021 In Operation",4547.99,400,8.7950940965129648E-2,0,"Others","","","",229.78601096308481,"3rd Quartile",243.81828016332494,"3rd Quartile",276.36419605144255,"Bottom Quartile"]
["GREAT WORLD CITY","1 KIM SENG PROMENADE, SINGAPORE 237994","Commercial Building","Mixed Development",null,1997,"GoldPlus",2021,"Existing Building for Non-Residential buildings (version 3)",93730,85731,0.91465912728048648,0,"Water Cooled Chilled Water Plant",13,0.64,"2021-01-05",230.80828210647789,"3rd Quartile",244.67046891990856,"3rd Quartile",258.91440491777814,"3rd Quartile"]
["NGEE ANN CITY","391A ORCHARD ROAD, SINGAPORE 238873","Commercial Building","Mixed Development",null,1993,"Platinum",2022,"Existing Building for Non-Residential buildings (version 3)",182382,174705,0.95790703029904267,0,"Water Cooled Chilled Water Plant",7,0.62,"2022-03-29",4.1898997159807436,"Top Quartile",246.1826784989747,"3rd Quartile",248.2486741016109,"3rd Quartile"]
["MACPHERSON MALL","MACPHERSON ROAD, SINGAPORE 368125","Commercial Building","Mixed Development",null,2016,null,null,null,13284,1000,7.527853056308341E-2,298,"Water Cooled Chilled Water Plant",5,"","",191.17888286660641,"2nd Quartile",227.75632565492319,"3rd Quartile",242.95058115025594,"3rd Quartile"]
["VOCO ORCHARD SINGAPORE","581 ORCHARD ROAD, SINGAPORE 238883","Commercial Building","Mixed Development",null,1969,null,null,null,38986,30308,0.77740727440619706,423,"Water Cooled Chilled Water Plant",6,"","",248.52146924537013,"3rd Quartile",252.44046580823886,"3rd Quartile",240.56068845226491,"3rd Quartile"]
["GOLDHILL PLAZA","1 GOLDHILL PLAZA, SINGAPORE 308899","Commercial Building","Mixed Development",null,1973,null,null,null,12100,12775,1.0557851239669422,0,"Others","","","",219.96922975206604,"3rd Quartile",230.22240247933885,"3rd Quartile",234.93348016528924,"3rd Quartile"]
["LINK@896","896 DUNEARN ROAD, SINGAPORE 589472","Commercial Building","Mixed Development",null,1988,null,null,null,23500,21150,0.9,0,"Water Cooled Chilled Water Plant",1,1.02,"2022-01-05",191.56374468085107,"2nd Quartile",208.39182978723403,"2nd Quartile",232.25570212765956,"3rd Quartile"]
["UNITED SQUARE","101 THOMSON ROAD #33-00, SINGAPORE 307591","Commercial Building","Mixed Development",null,1984,"GoldPlus",2021,"Existing Non-Residental Buildings ENRB: 2017",65947,61563,0.93352237402762828,0,"Water Cooled Chilled Water Plant",2,0.6,"2021-04-13",250.88546863390297,"3rd Quartile",233.43420474017014,"3rd Quartile",230.94317785494411,"3rd Quartile"]
["TEKKA PLACE","2 SERANGOON ROAD, SINGAPORE 218227","Commercial Building","Mixed Development",null,2019,"GoldPlus",2019,"Non-Residential Buildings NRB: 2015",22162,10476,0.47270101976355927,318,"Water Cooled Chilled Water Plant",3,0.65,"2021-02-21",170.31964624131396,"2nd Quartile",208.90479198628282,"2nd Quartile",226.82736215143038,"3rd Quartile"]
["WHEELOCK PLACE","501 ORCHARD ROAD, SINGAPORE 238880","Commercial Building","Mixed Development",null,1993,"Gold",2022,"Existing Non-Residential Buildings (RECERT 2017)",43280,39800,0.91959334565619222,0,"Water Cooled Chilled Water Plant",13,0.69099999999999995,"2022-06-22",233.38170055452866,"3rd Quartile",241.96520332717191,"3rd Quartile",225.62213493530498,"2nd Quartile"]
["THE RIVERWALK","20 UPPER CIRCULAR ROAD, SINGAPORE 058416","Commercial Building","Mixed Development",null,1988,"Certified",2019,"Existing Building for Non-Residential buildings (version 3)",19096,19094,0.99989526602429823,0,"Water Cooled Chilled Water Plant",5,0.69799999999999995,"2022-09-30",225.73647203602854,"3rd Quartile",224.3908457268538,"3rd Quartile",217.21349811478842,"2nd Quartile"]
["SEACARE BUILDING","52 CHIN SWEE ROAD, SINGAPORE 169875","Commercial Building","Mixed Development",null,1968,null,null,null,6508,5881,0.90365703749231718,101,"Others","","","",192.12835740626923,"2nd Quartile",194.3156422864167,"2nd Quartile",212.82861094038108,"2nd Quartile"]
["IMM BUILDING","2 JURONG EAST STREET 21, SINGAPORE 609601","Commercial Building","Mixed Development",null,1990,"GoldPlus",2022,"Existing Non-Residential Buildings (RECERT 2017)",132527,88287,0.66618123099443882,0,"Water Cooled Chilled Water Plant",9,"","",203.30241007492813,"3rd Quartile",202.61785447493716,"2nd Quartile",209.67801580055385,"2nd Quartile"]
["HEXACUBE","160 CHANGI ROAD, SINGAPORE 419728","Commercial Building","Mixed Development",null,2017,null,null,null,5036,4800,0.95313741064336777,0,"Air Cooled Chilled Water Plant","","","",152.58275218427323,"Top Quartile",181.49788721207307,"2nd Quartile",209.56688840349486,"2nd Quartile"]
["FAR EAST SHOPPING CENTRE","545 ORCHARD ROAD, SINGAPORE 238882","Commercial Building","Mixed Development",null,1974,"GoldPlus",2018,"Existing Building for Non-Residential buildings (version 3)",17592,14909,0.847487494315598,0,"Water Cooled Chilled Water Plant",5,0.61299999999999999,"2017-12-25",202.59705320600276,"3rd Quartile",209.30123522055482,"2nd Quartile",208.96897851296043,"2nd Quartile"]
["DUO TOWER","3 FRASER STREET DUO TOWER, SINGAPORE 189352","Commercial Building","Mixed Development",null,2017,"Platinum",2022,"Existing Non-Residential Buildings (RECERT 2017)",100047,44614,0.44593041270602818,347,"Water Cooled Chilled Water Plant",6,0.48,"2022-10-01",183.12750007496476,"2nd Quartile",184.50424300578729,"2nd Quartile",204.63402200965547,"2nd Quartile"]
["ROYAL PLAZA ON SCOTTS","25 SCOTTS ROAD, SINGAPORE 228220","Commercial Building","Mixed Development",null,1974,"Gold",2013,"Existing Building for Non-Residential buildings (version 2.1)",47107,47107,1,511,"Water Cooled Chilled Water Plant",11,0.77,"2010-12-10",200.14660241577684,"3rd Quartile",204.09790476999171,"2nd Quartile",203.1409556966056,"2nd Quartile"]
["PALAIS RENAISSANCE","390 ORCHARD ROAD, SINGAPORE 238871","Commercial Building","Mixed Development",null,1991,"Platinum",2020,"Existing Building for Non-Residential buildings (version 3)",16480,14669,0.89010922330097086,0,"Water Cooled Chilled Water Plant",5,0.59,"2023-03-01",155.05150485436891,"Top Quartile",152.79101941747572,"Top Quartile",197.07651699029125,"2nd Quartile"]
["WILKIE EDGE","8 WILKIE ROAD, SINGAPORE 228095","Commercial Building","Mixed Development",null,2008,null,null,null,28907,19536,0.67582246514685029,154,"Water Cooled Chilled Water Plant",12,0.87,"2015-09-10",224.62330923305774,"3rd Quartile",200.04498045456117,"2nd Quartile",195.7425018161691,"2nd Quartile"]
["LIAT TOWERS","541 ORCHARD ROAD, SINGAPORE 238881","Commercial Building","Mixed Development",null,1979,"Gold",2022,"Existing Building for Non-Residential buildings (version 3)",19569,18089,0.92437017732127347,0,"Water Cooled Chilled Water Plant",4,0.57999999999999996,"2020-06-01",184.28565588430681,"2nd Quartile",203.28861975573611,"2nd Quartile",192.59520159435843,"2nd Quartile"]
["RB CAPITAL BUILDING","22 MALACCA STREET, SINGAPORE 048980","Commercial Building","Mixed Development",null,1975,null,null,null,7811,6300,0.80655485853283826,0,"Water-Cooled Package Units","","","",182.81054922545127,"2nd Quartile",183.07381001152223,"2nd Quartile",185.95593649980796,"2nd Quartile"]
["THE MANAGEMENT CORPORATION STRATA TITLE PLAN NO. 703","19 TANGLIN ROAD, SINGAPORE 247909","Commercial Building","Mixed Development",null,1970,null,null,null,24377,22470,0.92177052139311644,0,"Water Cooled Chilled Water Plant",4,"","",189.70314353694053,"2nd Quartile",176.99326004020185,"Top Quartile",179.61418755384173,"Top Quartile"]
["MCST393, PEOPLE'S PARK CENTRE","101 UPPER CROSS STREET #07-09, SINGAPORE 058357","Commercial Building","Mixed Development",null,1978,"Gold",2020,"Existing Building for Non-Residential buildings (version 3)",49701,49701,1,0,"Water Cooled Chilled Water Plant",1978,"","",172.04181485281987,"2nd Quartile",171.08156495845157,"Top Quartile",165.1799297800849,"Top Quartile"]
["THE HEEREN","260 ORCHARD ROAD, SINGAPORE 238855","Commercial Building","Mixed Development",null,1996,"Platinum",2018,"Existing Building for Non-Residential buildings (version 3)",37285,33399,0.89577578114523271,0,"Water Cooled Chilled Water Plant",13,0.55000000000000004,"2023-02-20",198.72061150596755,"2nd Quartile",115.29824326136516,"Top Quartile",161.53437039023737,"Top Quartile"]
["PENINSULA PLAZA","111 NORTH BRIDGE ROAD, SINGAPORE 179098","Commercial Building","Mixed Development",null,1980,"Gold",2019,"Existing Building for Non-Residential buildings (version 3)",48055,45000,0.93642701071688694,0,"Water Cooled Chilled Water Plant",4,63,"2022-10-01",140.80123920507751,"Top Quartile",147.97754552075747,"Top Quartile",158.25104796587243,"Top Quartile"]
["OG ALBERT COMPLEX","60 ALBERT STREET, SINGAPORE 189969","Commercial Building","Mixed Development",null,1984,"Gold",2015,"Existing Building for Non-Residential buildings (version 3)",25724,23153,0.90005442388431034,0,"Water Cooled Chilled Water Plant",5,0.63039999999999996,"2023-03-07",139.45896439122998,"Top Quartile",143.28853988493236,"Top Quartile",144.18314414554501,"Top Quartile"]
["CONCORDE HOTEL AND SHOPPING MALL","100 ORCHARD ROAD #01-100B, SINGAPORE 238840","Commercial Building","Mixed Development",null,1984,null,null,null,62543,60000,0.95933997409782068,421,"Water Cooled Chilled Water Plant",5,"","",133.48424188158546,"Top Quartile",124.43180275970134,"Top Quartile",135.99185280526996,"Top Quartile"]
["THE ADELPHI","1 COLEMAN STREET, SINGAPORE 179803","Commercial Building","Mixed Development",null,2008,"Platinum",2017,"Existing Building for Non-Residential buildings (version 3)",43347,41158,0.94950054213671076,0,"Water Cooled Chilled Water Plant",5,"","",121.16859298221328,"Top Quartile",131.06736683046117,"Top Quartile",133.14188640505685,"Top Quartile"]
["CECIL BUILDING","137 CECIL STREET, SINGAPORE 069537","Commercial Building","Mixed Development",null,2017,null,null,null,7071,7071,1,0,"Others","","","",111.40881063498797,"Top Quartile",116.53551548578702,"Top Quartile",125.88194314806958,"Top Quartile"]
["SIM LIM TOWER","10 JALAN BESAR, SINGAPORE 208787","Commercial Building","Mixed Development",null,1981,"GoldPlus",2018,"Existing Building for Non-Residential buildings (version 3)",22772,19356,0.84999121728438432,0,"Water Cooled Chilled Water Plant",7,0.62,"2022-12-15",105.02778895134375,"Top Quartile",115.34919813806432,"Top Quartile",107.68265545406641,"Top Quartile"]
["ORCHARD TOWERS AND ONE CLAYMORE","400 ORCHARD ROAD\nAND\n1 CLAYMORE DRIVE, SINGAPORE 238875","Commercial Building","Mixed Development",null,1975,"Gold",2022,"Existing Non-Residental Buildings ENRB: 2017",42809,37624,0.87888060921768785,0,"Water Cooled Chilled Water Plant",9,0.61,"2018-06-30",123.41636735265949,"Top Quartile",102.70934219439835,"Top Quartile",106.87767969352238,"Top Quartile"]
["KITCHENER COMPLEX","809 FRENCH ROAD, SINGAPORE 200809","Commercial Building","Mixed Development",null,1986,"Gold",2019,"Existing Building for Non-Residential buildings (version 2.1)",26881.279999999999,9874,0.36731881815151662,0,"Others","","","",104.01396771284701,"Top Quartile",87.56307288938622,"Top Quartile",94.210106066377804,"Top Quartile"]
["PUBLIC MANSION","432 BALESTIER ROAD, SINGAPORE 329813","Commercial Building","Mixed Development",null,1974,null,null,null,11880,7600,0.63973063973063971,0,"Others","","","",56.606476430976414,"Top Quartile",64.209974747474746,"Top Quartile",63.831016835016833,"Top Quartile"]
["DOWNTOWN EAST","1 PASIR RIS CLOSE, SINGAPORE 519599","Commercial Building","Mixed Development",null,2009,"Gold",2015,"New Building for Non-Residential buildings (version 4.1)",97108,30523,0.31432013840260331,387,"District Cooling System (DCS)","",0.69,"2019-11-22"]
["PAN PACIFIC SERVICED SUITES SINGAPORE, ORCHARD","96 SOMERSET ROAD, SINGAPORE 199592","Commercial Building","Mixed Development",null,2013,null,null,null,11794.1,10436,0.8848492042631485,126,"Water Cooled Chilled Water Plant",2013,"",""]
["PARKROYAL ON BEACH ROAD","7500C BEACH ROAD, SINGAPORE 199591","Commercial Building","Mixed Development",null,1971,"Gold",2022,"Existing Non-Residential Buildings (RECERT 2017)",21045,18941,0.90002375861249706,346,"Water Cooled Chilled Water Plant",0,1.1259999999999999,"2023-03-23"]
["SINGAPORE GENERAL HOSPITAL","10 HOSPITAL BOULEVARD #19-01 SINGAPORE 168582, SINGAPORE 169608","Healthcare Facility","Hospital",null,1981,null,null,null,172666.55,164580,0.95316666719755516,0,"Water Cooled Chilled Water Plant",23,1.48,"2022-08-24",639.8813059043573,17,618.64994986000477,17,594.8096055663359,17]
["GLENEAGLES HOSPITAL","6A NAPIER ROAD, SINGAPORE 258500, SINGAPORE 258500","Healthcare Facility","Hospital",null,1993,null,null,null,42243,42243,1,0,"Water Cooled Chilled Water Plant",11,"","",392.12378382217173,16,416.20137064128966,16,406.84988045356624,16]
["PARKWAY EAST HOSPITAL","321 JOO CHIAT PLACE, SINGAPORE 427990","Healthcare Facility","Hospital",null,1979,null,null,null,10994,10763,0.97898853920320172,0,"Water Cooled Chilled Water Plant",10,"","",386.47030653083499,15,402.94108149899944,15,396.12744042204838,15]
["KK WOMEN'S AND CHILDREN'S HOSPITAL","100 BUKIT TIMAH ROAD, SINGAPORE 229899","Healthcare Facility","Hospital",null,1997,null,null,null,124686,81768,0.65579134786583904,0,"Water Cooled Chilled Water Plant",12,0.99,"2014-01-31",331.64862935694464,11,355.33990985355211,12,365.48181030749242,14]
["TAN TOCK SENG HOSPITAL","11 JALAN TAN TOCK SENG, SINGAPORE 308433","Healthcare Facility","Hospital",null,1999,"Platinum",2006,"Existing Building (version 1)",179917,148371,0.82466359487986129,1200,"Water Cooled Chilled Water Plant",24,0.8,"2021-04-27",329.71364880190612,10,357.94541670568407,14,361.78129709398507,13]
["MOUNT ELIZABETH NOVENA HOSPITAL","38 IRRAWADDY ROAD, SINGAPORE 329563","Healthcare Facility","Hospital",null,2012,"Platinum",2019,"New Building for Non-Residential buildings (version 3)",72334,70000,0.96773301628556418,333,"Water Cooled Chilled Water Plant",10,"","",361.12973152321177,14,357.8181353167252,13,348.80325987778912,12]
["MOUNT ELIZABETH HOSPITAL","3 MOUNT ELIZABETH, SINGAPORE 228510","Healthcare Facility","Hospital",null,1979,null,null,null,55097,54958,0.99747717661578672,284,"Water Cooled Chilled Water Plant",4,"","",350.1219667132512,12,346.93264606058403,10,344.02119897635077,11]
["CHANGI GENERAL HOSPITAL","2 SIMEI STREET 3, SINGAPORE 529889","Healthcare Facility","Hospital",null,1998,null,null,null,112947,74061,0.65571462721453422,0,"Water Cooled Chilled Water Plant",12,"","",351.10389828857785,13,350.9192541634572,11,343.78124252968206,10]
["KHOO TECK PUAT HOSPITAL","90 YISHUN CENTRAL, SINGAPORE 768828, SINGAPORE 768828","Healthcare Facility","Hospital",null,2010,null,null,null,103534,63491,0.61323816330867154,0,"Water Cooled Chilled Water Plant",10,null,null,328.29224216199509,9,327.19683389031621,9,320.16185504278786,9]
["THOMSON MEDICAL CENTRE","339 THOMSON ROAD SINGAPORE 307677, SINGAPORE 307677","Healthcare Facility","Hospital",null,1975,"Certified",2020,"Existing Building for Non-Residential buildings (version 3)",12515,12515,1,0,"Water Cooled Chilled Water Plant",4,0.75,"2020-09-10",323.29373551737916,8,314.7662924490611,6,319.64751338393927,8]
["ALEXANDRA HOSPITAL","378 ALEXANDRA ROAD, SINGAPORE 159964","Healthcare Facility","Hospital",null,1940,"Platinum",2022,"New Non-Residential Buildings (NRB: 2015) (R3)",42293,33778,0.79866644598396896,0,"Air Cooled Chilled Water Plant","","","",306.49823847918094,6,322.78457427943158,8,310.39888397607172,7]
["SENGKANG GENERAL HOSPITAL","110 SENGKANG EAST WAY, SINGAPORE 544886, SINGAPORE 544886","Healthcare Facility","Hospital",null,2017,"Platinum",2023,"GM:2021 In Operation",288000,158344,0.54980555555555555,0,"Water Cooled Chilled Water Plant",6,0.6159,"2022-08-01",276.04893333333331,5,279.39196666666669,5,282.35132222222222,6]
["RAFFLES HOSPITAL","585 NORTH BRIDGE ROAD, SINGAPORE 188770","Healthcare Facility","Hospital",null,2001,"Certified",2019,"Existing Building for Non-Residential buildings (version 3)",49272,39371,0.79905422958272443,0,"Water Cooled Chilled Water Plant",6,0.65,"2022-04-20",269.88431563565513,4,275.19337554797858,4,266.54437408670242,5]
["1 JURONG EAST STREET 21","1 JURONG EAST STREET 21, SINGAPORE 609606","Healthcare Facility","Hospital",null,2015,null,null,null,186357,130612,0.70086983585269136,0,"Water Cooled Chilled Water Plant",4,null,null,263.58511888472128,3,256.94238477760427,3,249.97985318501586,4]
["ANG MO KIO-THYE HUA KWAN HOSPITAL","17 ANG MO KIO AVE 9, SINGAPORE 569766","Healthcare Facility","Hospital",null,1993,"Gold",2017,"New Building for Non-Residential buildings (version 4.1)",20321.52,17199,0.84634417110531102,0,"Water Cooled Chilled Water Plant",7,"","",247.15569996732526,2,234.17989894456713,2,234.91129108452517,3]
["BRIGHT VISION COMMUNITY HOSPITAL","5 LORING NAPIRI, SINGAPORE 547530","Healthcare Facility","Hospital",null,2001,null,null,null,10847,3210,0.29593435973080112,0,"Air Cooled Chilled Water Plant","","","",226.01704710979996,1,158.85044251866876,1,151.29403521711072,2]
["MOUNT ALVERNIA HOSPITAL","820 THOMSON ROAD, SINGAPORE 574623","Healthcare Facility","Hospital",null,1961,"Certified",2021,"Healthcare Facilities (Version 1.0)",39485,34863,0.88294288970495127,0,"Water Cooled Chilled Water Plant",6,"","",316.21929846777255,7,320.17870077244521,7,50.346941876662022,1]
["MAIN BUILDING","5 LOWER KENT RIDGE ROAD, SINGAPORE 119074","Healthcare Facility","Hospital",null,1985,"GoldPlus",2022,"Existing Non-Residential Buildings (RECERT 2017)",146327,70554,0.48216665413765059,0,"Water Cooled Chilled Water Plant",5,0.64,"2021-02-09"]
["NATIONAL CANCER CENTRE OF SINGAPORE PTE LTD","11 HOSPITAL CRESCENT, SINGAPORE 169610","Healthcare Facility","Specialist Clinic",null,1999,null,null,null,16621,14934,0.8985018951928283,0,"Air Cooled Chilled Water Plant","","","",609.07977859334574,9,608.16166295650078,9,585.31460200950607,9]
["ACADEMIA","20 COLLEGE ROAD, SINGAPORE 169856","Healthcare Facility","Specialist Clinic",null,2013,"GoldPlus",2022,"Existing Non-Residential Buildings (RECERT 2017)",75311,51860,0.68861122545179321,0,"Water Cooled Chilled Water Plant",9,0.68,"2021-09-07",475.77840554500671,7,481.32274833689632,8,477.69147269323207,8]
["NATIONAL UNIVERSITY HOSPITAL MEDICAL CENTRE","1 LOWER KENT RIDGE ROAD, SINGAPORE 119082","Healthcare Facility","Specialist Clinic",null,2013,"GoldPlus",2020,"New Building for Non-Residential buildings (version 3)",71921,60916,0.84698488619457457,0,"Air Cooled Chilled Water Plant","","","",509.43146516738267,8,362.60433947696635,7,371.08604913586601,7]
["SINGAPORE NATIONAL EYE CENTRE","11 THIRD HOSPITAL, SINGAPORE 168751","Healthcare Facility","Specialist Clinic",null,1990,null,null,null,19445,16623,0.85487271792234509,0,"Water Cooled Chilled Water Plant",22,"","",343.47683209051172,6,360.73643610182569,6,349.00575983543325,6]
["NATIONAL HEART CENTRE OF SINGAPORE","5 HOSPITAL DRIVE, SINGAPORE 169609","Healthcare Facility","Specialist Clinic",null,2014,"Platinum",2022,"Existing Non-Residential Buildings (RECERT 2017)",48432,38497,0.79486703006276838,0,"Water-Cooled Package Units","",0.65,"2023-02-28",309.80862859266603,5,316.99296952428148,5,312.81463701684834,5]
["GLENEAGLES MEDICAL CENTRE (MCST 1847)","6 NAPIER ROAD, SINGAPORE 258499","Healthcare Facility","Specialist Clinic",null,1994,null,null,null,10767,10766,0.99990712361846379,0,"Water-Cooled Package Units","","","",308.02382279186401,4,295.13592458437819,4,288.45778768459184,4]
["NATIONAL SKIN CENTRE (S) PTE LTD","1 MANDALAY ROAD, SINGAPORE 308205","Healthcare Facility","Specialist Clinic",null,1988,null,null,null,9862,6620,0.6712634354086392,0,"Water Cooled Chilled Water Plant",26,"","",215.56519975664165,2,223.89768809572095,1,270.94261508821739,3]
["MEDICAL CENTRE\nCHANGI GENERAL HOSPITAL","2A SIMEI STREET 3, SINGAPORE 529906","Healthcare Facility","Specialist Clinic",null,2018,"Platinum",2014,"New Building for Non-Residential buildings (version 4.1)",43715,31292,0.71581836898089901,0,"Water Cooled Chilled Water Plant",5,0.57999999999999996,"2022-03-28",228.4381287887453,3,245.08294178199705,3,254.19838499370925,2]
["NATIONAL DENTAL CENTRE","5 SECOND HOSPITAL AVENUE, SINGAPORE 168938","Healthcare Facility","Specialist Clinic",null,1997,null,null,null,13558.16,9848,0.72635224838768686,0,"Water Cooled Chilled Water Plant",13,"","",213.53782519161894,1,228.74859125427048,2,224.13432206140067,1]
["TUBERCULOSIS CONTROL UNIT","144 MOULMEIN ROAD, SINGAPORE 308089","Healthcare Facility","Specialist Clinic",null,2014,null,null,null,1276,155,0.12147335423197492,18,"Air Cooled Chilled Water Plant","","","",null,"",null,""]
["NATIONAL UNIVERSITY CENTRE FOR ORAL HEALTH SINGAPORE (NUCOHS)","9 LOWER KENT RIDGE ROAD, SINGAPORE 119085","Healthcare Facility","Specialist Clinic",null,2018,"GoldPlus",2022,"Existing Non-Residential Buildings (RECERT 2017)",34317,29632,0.86347874231430488,0,"Water Cooled Chilled Water Plant",5,"","",null,"",null,"",null,""]
["TUBERCULOSIS CONTROL UNIT (CONTACT CENTRE)","142 MOULMEIN ROAD, SINGAPORE 308087","Healthcare Facility","Specialist Clinic",null,2014,null,null,null,1276,970,0.7601880877742947,24,"Air Cooled Chilled Water Plant","","","",null,"",null,"",null,""]
["CDC 2","7 JALAN TAN TOCK SENG, SINGAPORE 308440","Healthcare Facility","Specialist Clinic",null,2003,null,null,null,9753,6000,0.61519532451553371,94,"Air Cooled Chilled Water Plant","","","",null,"",null,"",null,""]
["ANG MO KIO POLYCLINIC","21 ANG MO KIO CENTRAL 2, SINGAPORE 569666, SINGAPORE 569666","Healthcare Facility","Polyclinic/ Private Clinic",null,2017,null,null,null,8750,6610,0.75542857142857145,0,"Water Cooled Chilled Water Plant",4,0.48,"2019-03-22",220.48234971428573,11,227.459136,11,230.94277714285715,11]
["CAMDEN MEDICAL","ONE ORCHARD BOULEVARD, SINGAPORE 248649","Healthcare Facility","Polyclinic/ Private Clinic",null,1999,null,null,null,18809,15000,0.79749056302833754,0,"Water Cooled Chilled Water Plant",8,"","",218.17587325216653,10,213.22624807273115,10,203.7330799085544,10]
["HOUGANG POLYCLINIC","89 HOUGANG AVENUE 4, SINGAPORE 538829, SINGAPORE 538829","Healthcare Facility","Polyclinic/ Private Clinic",null,1991,null,null,null,5561,2120,0.38122639812983278,0,"Others",null,null,null,177.30636576155368,8,180.52057183959721,9,180.91586944794102,9]
["WOODLANDS POLYCLINIC","10 WOODLANDS STREET 31, SINGAPORE 738579, SINGAPORE 738579","Healthcare Facility","Polyclinic/ Private Clinic",null,1993,null,null,null,6304,3206,0.50856598984771573,0,"Others",null,null,null,160.96744130710661,7,174.18174175126902,8,176.7503807106599,8]
["TAMPINES POLYCLINIC","1 TAMPINES STREET 41, SINGAPORE 529203","Healthcare Facility","Polyclinic/ Private Clinic",null,1990,null,null,null,5592,5592,1,0,"Others","","","",154.14767525035765,5,150.90185979971386,4,160.4963340486409,7]
["THONG CHAI BUILDING","50 CHIN SWEE ROAD, SINGAPORE 169874","Healthcare Facility","Polyclinic/ Private Clinic",null,2012,"Platinum",2022,"Existing Non-Residental Buildings ENRB: 2017",5314,3864,0.72713586751975912,0,"Water Cooled Chilled Water Plant",0,0.53100000000000003,"2022-12-12",188.59593150169363,9,167.6189273616861,7,158.47191945803539,6]
["CHOA CHU KANG POLYCLINIC","2 TECK WHYE CRESCENT, SINGAPORE 688846","Healthcare Facility","Polyclinic/ Private Clinic",null,1997,null,null,null,6415,2925,0.455962587685113,0,"Others","","","",158.39464536243182,6,160.87248636009352,6,155.53267342166797,5]
["SATA COMMHEALTH BUILDING","351 CHAI CHEE STREET, SINGAPORE 468982","Healthcare Facility","Polyclinic/ Private Clinic",null,1997,null,null,null,5434,2200,0.40485829959514169,0,"Others","","","",151.73366764814133,4,151.38215863084284,5,141.34851858667648,4]
["BUKIT BATOK POLYCLINIC","50 BUKIT BATOK WEST AVENUE 3, SINGAPORE 659164","Healthcare Facility","Polyclinic/ Private Clinic",null,1991,null,null,null,6497,2806,0.4318916422964445,0,"Others","","","",127.76282899799908,1,139.29475142373403,3,138.52725873480068,3]
["PIONEER POLYCLINIC","26 JURONG WEST STREET 61, SINGAPORE 648201","Healthcare Facility","Polyclinic/ Private Clinic",null,2017,"Platinum",2016,"Healthcare Facilities (Version 1.0)",7750,4306,0.55561290322580648,0,"Water Cooled Chilled Water Plant",5,0.61499999999999999,"2019-05-29",136.39158967741938,3,138.83195999999998,1,137.43043741935483,2]
["GEYLANG POLYCLINIC","21 GEYLANG EAST CENTRAL, SINGAPORE 389707, SINGAPORE 389707","Healthcare Facility","Polyclinic/ Private Clinic",null,2013,null,null,null,6546,3462,0.52887259395050412,0,"Others",null,null,null,131.65495722578675,2,138.97574091047969,2,128.44775435380384,1]
["ST. ANDREW'S COMMUNITY HOSPITAL","8 SIMEI STREET 3, SINGAPORE 529895","Healthcare Facility","Community Hospital/ Nursing Home",null,2005,null,null,null,14122,8276,0.58603597224189208,0,"Air Cooled Chilled Water Plant","","","",192.89766322050698,37,190.05460982863619,40,192.46011896331964,41]
["REN CI COMMUNITY HOSPITAL","71 IRRAWADDY ROAD, SINGAPORE 329562","Healthcare Facility","Community Hospital/ Nursing Home",null,2008,null,null,null,20498,8156,0.39789247731485999,0,"Air Cooled Chilled Water Plant","","","",176.36573373012001,36,178.2747760757147,39,185.04708947214363,40]
["YISHUN COMMUNITY HOSPITAL","2 YISHUN CENTRAL 2, SINGAPORE 768024","Healthcare Facility","Community Hospital/ Nursing Home",null,2015,"Platinum",2023,"GM:2021 In Operation",56247,24121,0.42884064927907267,0,"Water Cooled Chilled Water Plant",7,0.59,"2022-12-31",157.12339324763988,35,159.1665599943108,38,165.25436023254574,39]
["ASSISI HOSPICE","832 THOMSON ROAD, SINGAPORE 574627","Healthcare Facility","Community Hospital/ Nursing Home",null,2016,"Platinum",2022,"New Building for Non-Residential buildings (version 4.1)",11188,8260,0.73829102609939223,0,"Water Cooled Chilled Water Plant",2016,0.54,"2023-02-27",149.84753307114767,33,146.8879478012156,36,154.82234179478013,38]
["RENCI @ BUKIT BATOK ST. 52","31 BUKIT BATOK STREET 52, SINGAPORE 659251, SINGAPORE 659251","Healthcare Facility","Community Hospital/ Nursing Home",null,2014,null,null,null,6243,970,0.15537401890116931,0,"Others","",0.42,"2014-09-30",156.70465000800897,34,153.42123978856318,37,152.05247477174436,37]
["ST LUKE'S HOSPITAL","2 BUKIT BATOK STREET 11, SINGAPORE 659674, SINGAPORE 659674","Healthcare Facility","Community Hospital/ Nursing Home",null,1996,null,null,null,12527,3700,0.29536201804103135,0,"Others","","","",144.44648678853676,32,142.38569968867247,35,148.74756765386763,36]
["NTUC HEALTH (JURONG WEST)","50 JURONG WEST STREET 93 S648967, SINGAPORE 648967","Healthcare Facility","Community Hospital/ Nursing Home",null,2015,null,null,null,8652,1225,0.14158576051779936,0,"Others","","","",143.14698335644937,31,129.17241678224687,33,134.12987170596392,35]
["ALL SAINTS HOME (JURONG EAST)","20 JURONG EAST AVENUE 1, SINGAPORE 609792","Healthcare Facility","Community Hospital/ Nursing Home",null,2016,null,null,null,5500,593,0.10781818181818181,0,"Others","","","",133.62152727272726,29,129.47189090909092,34,133.16493636363637,34]
["NURSING HOME (GEYLANG EAST)","25 GEYLANG EAST CENTRAL, SINGAPORE 389708","Healthcare Facility","Community Hospital/ Nursing Home",null,2017,null,null,null,7528,1138,0.15116896918172157,0,"Others","","","",123.29465993623803,28,125.40903028692881,31,129.86062699256112,33]
["ALL SAINTS HOME (TAMPINES)","11 TAMPINES STREET 44, SINGAPORE 529123","Healthcare Facility","Community Hospital/ Nursing Home",null,1998,null,null,null,6455,3000,0.46475600309837334,0,"Others","","","",115.72306738962045,25,115.74163439194423,30,128.15346243222308,32]
["THYE HUA KWAN NURSING HOME LIMITED","48 HOUGANG AVE 8, SINGAPORE 538793","Healthcare Facility","Community Hospital/ Nursing Home",null,2017,null,null,null,8178,9998,1.2225483003179261,0,"Others","","","",137.53589875275128,30,127.20500366837858,32,120.02286867204695,31]
["ST ANDREW'S NURSING HOME","60 BUANGKOK VIEW, SINGAPORE 534012","Healthcare Facility","Community Hospital/ Nursing Home",null,2013,null,null,null,9092,1198,0.1317641882974043,0,"Others","","","",116.99320831500221,27,115.28346898372196,28,118.33717553893534,30]
["KWONG WAI SHIU HOSPITAL","705 SERANGOON ROAD, SINGAPORE 328127","Healthcare Facility","Community Hospital/ Nursing Home",null,2017,null,null,null,22856,13713,0.59997374868743436,0,"Others","","","",116.33220073503675,26,115.29214341967098,29,117.48027957647882,29]
["SINGAPORE CHRISTIAN HOME","20 SEMBAWANG CRESCENT, SINGAPORE 757092","Healthcare Facility","Community Hospital/ Nursing Home",null,2013,null,null,null,6334,441,6.9624250078939062E-2,0,"Others","","","",110.36618250710453,24,110.72058414903695,27,111.20919482159773,28]
["ALL SAINTS HOME (HOUGANG)","5 POH HUAT ROAD, SINGAPORE 546703","Healthcare Facility","Community Hospital/ Nursing Home",null,1986,null,null,null,6056,1602,0.26453104359313079,0,"Others","","","",105.78327939233819,23,100.32585535006605,25,109.72876486129459,27]
["LIONS HOME FOR THE ELDERS","9 BISHAN STREET 13, SINGAPORE 579804","Healthcare Facility","Community Hospital/ Nursing Home",null,2015,null,null,null,7307,632,8.6492404543588336E-2,0,"Others","","","",105.01573149035171,22,106.96936499247298,26,107.74414260298343,26]
["NTUC HEALTH (CHAI CHEE)","35 CHAI CHEE STREET, SINGAPORE 468984","Healthcare Facility","Community Hospital/ Nursing Home",null,2016,null,null,null,12900,1489,0.11542635658914728,0,"Others","","","",92.885765116279075,18,92.82715348837209,23,94.422976744186045,25]
["TAMPINES CARE HOME","31TAMPINES STREET 61, SINGAPORE 528564","Healthcare Facility","Community Hospital/ Nursing Home",null,2018,null,null,null,10833,1164,0.10744945998338411,0,"Others","","","",97.171476045416796,20,87.80527554693991,20,92.550772639158126,24]
["ST.ANDREW'S NURSING HOME","11 JALAN PENJARA SINGAPORE 149380, SINGAPORE 149380","Healthcare Facility","Community Hospital/ Nursing Home",null,2016,null,null,null,10992,1,9.097525473071325E-5,0,"Air Cooled Chilled Water Plant","",0,"2022-12-12",91.766457423580789,16,87.765665938864629,19,88.996271834061133,23]
["SOCIETY FOR THE AGED SICK","130 HOUGANG AVE 1, SINGAPORE 538900","Healthcare Facility","Community Hospital/ Nursing Home",null,1996,null,null,null,15431,1416,9.1763333549348708E-2,0,"Others","","","",100.16543645907589,21,97.27451558550969,24,88.374716479813358,22]
["ST. ANDREW'S NURSING HOME (HENDERSON)","303 HENDERSON ROAD, SINGAPORE 108925","Healthcare Facility","Community Hospital/ Nursing Home",null,2016,null,null,null,9520,1900,0.19957983193277312,0,"Others","","","",92.229668067226882,17,90.073436974789914,21,87.857977941176472,21]
["SUNSHINE WELFARE ACTION MISSION (SWAMI)","NO. 5, SEMBAWANG WALK, SINGAPORE 757717","Healthcare Facility","Community Hospital/ Nursing Home",null,1997,null,null,null,12110,1699,0.1402972749793559,0,"Others","","","",78.229808422791081,8,85.770257638315442,18,87.843919075144512,20]
["THONG TECK HOME FOR SENIOR CITIZENS","91 GEYLANG EAST AVE 2, SINGAPORE 389759","Healthcare Facility","Community Hospital/ Nursing Home",null,1997,null,null,null,5400,700,0.12962962962962962,0,"Others","","","",90.235388888888878,14,91.319074074074081,22,87.489703703703711,19]
["MWS BETHANY NURSING HOME","9 CHOA CHU KANG AVE 4, SINGAPORE 689815","Healthcare Facility","Community Hospital/ Nursing Home",null,2001,null,null,null,8832,1297,0.14685235507246377,0,"Others","","","",81.666694972826093,10,84.479551630434784,16,85.273494112318843,18]
["MAN FUT TONG NURSING HOME","20 WOODLANDS ST 82, SINGAPORE 738507","Healthcare Facility","Community Hospital/ Nursing Home",null,2001,null,null,null,7250,1421,0.19600000000000001,0,"Others","","","",85.07209655172413,12,83.59142068965518,15,84.683703448275864,17]
["INSTITUTE OF MENTAL HEALTH","10 BUANGKOK VIEW, SINGAPORE 539747, SINGAPORE 539747","Healthcare Facility","Community Hospital/ Nursing Home",null,1993,null,null,null,171698,31200,0.18171440552598167,0,"Air Cooled Chilled Water Plant",null,null,null,77.592523675290337,7,77.789166501648239,9,83.868079010821319,16]
["JAMIYAH NURSING HOME","130, WEST COAST DRIVE, SINGAPORE 127444","Healthcare Facility","Community Hospital/ Nursing Home",null,2002,null,null,null,5788,1007,0.17398064961990325,0,"Others","","","",90.744937802349682,15,84.849136143745682,17,82.703178991015889,15]
["BRIGHT HILL EVERGREEN HOME","1 TEBING LANE, SINGAPORE 828838","Healthcare Facility","Community Hospital/ Nursing Home",null,2021,null,null,null,6946,556,8.0046069680391588E-2,0,"Others","","","","","",32.608695652173914,2,81.120069104520582,14]
["WOODLANDS CARE HOME","2 WOODLANDS RISE, SINGAPORE 737749","Healthcare Facility","Community Hospital/ Nursing Home",null,2017,null,null,null,8994,900,0.1000667111407605,0,"Others","","","",79.669693128752499,9,77.292655103402268,8,79.699269513008673,13]
["BRIGHT HILL EVERGREEN HOME","100 PUNGGOL FIELD, SINGAPORE 828811","Healthcare Facility","Community Hospital/ Nursing Home",null,2014,null,null,null,6870,680,9.8981077147016011E-2,0,"Others","","","",84.373362445414841,11,79.126637554585159,11,78.613537117903931,12]
["VILLA FRANCIS HOME FOR THE AGED","91, YISHUN CENTRAL, SINGAPORE 768829","Healthcare Facility","Community Hospital/ Nursing Home",null,2012,null,null,null,6193,1000,0.16147263038914905,0,"Others","","","",93.707419667366395,19,81.041345067011136,13,78.335278540287419,11]
["VANGUARD HEALTHCARE PTE LTD\nBUKIT BATOK CARE HOME","11 BUKIT BATOK WEST AVE 9, SINGAPORE 657995","Healthcare Facility","Community Hospital/ Nursing Home",null,2019,null,null,null,8534.16,2837,0.33242873346644547,0,"Others","","","",73.334184032171891,4,83.127548581231196,14,76.893058016254685,10]
["REN CI @ ANG MO KIO NURSING HOME","10 ANG MO KIO AVE 8, SINGAPORE 567727","Healthcare Facility","Community Hospital/ Nursing Home",null,2018,null,null,null,16599,1853,0.11163323091752515,0,"Others","",0.68,"2018-06-25",71.328231821194052,3,74.626343755647923,6,76.484891860955472,9]
["SUNLOVE ABODE FOR INTELLECTUALLY INFIRMED LTD","70 BUANGKOK VIEW, SINGAPORE 534190","Healthcare Facility","Community Hospital/ Nursing Home",null,2021,null,null,null,12753,2810,0.22034031208343136,0,"Others","",0.83,"2022-12-18","","",74.667853054183325,7,75.147264173135738,8]
["JU ENG HOME FOR SENIOR CITIZENS","205 JALAN KAYU, SINGAPORE 799436","Healthcare Facility","Community Hospital/ Nursing Home",null,2003,null,null,null,18224,680,3.7313432835820892E-2,0,"Others","","","",89.2363218832309,13,78.235792361720812,10,74.841288410886733,7]
["APEX HARMONY LODGE","10 PASIR RIS WALK, SINGAPORE 518240","Healthcare Facility","Community Hospital/ Nursing Home",null,1999,null,null,null,7216,586,8.1208425720620842E-2,0,"Others","","","",75.843590631929047,6,79.445378325942343,12,74.190264689578711,6]
["ALL SAINTS HOME (YISHUN)","551 YISHUN RING ROAD, SINGAPORE 768681","Healthcare Facility","Community Hospital/ Nursing Home",null,2014,null,null,null,6757,389,5.7569927482610625E-2,0,"Others","","","",74.503759064673673,5,69.98207784519758,5,70.063741305313016,5]
["SAINT JOSEPH'S HOME","36 JURONG WEST STREET 24, SINGAPORE 648141","Healthcare Facility","Community Hospital/ Nursing Home",null,2017,null,null,null,22054,3010,0.13648317765484719,0,"Others","","","",64.308520903237508,2,67.197409993651945,4,69.487253106012503,4]
["NTUC HEALTH (PASIR RIS) - NURSING HOME","12 PASIR RIS WALK, SINGAPORE 518063","Healthcare Facility","Community Hospital/ Nursing Home",null,2021,null,null,null,13769,1459,0.10596266976541506,0,"Others","","","","","",2.970440845377297,1,45.338190137264874,3]
["SAINT THERESA'S HOME","49 UPPER THOMSON ROAD\nSINGAPORE 574325, SINGAPORE 574325","Healthcare Facility","Community Hospital/ Nursing Home",null,1939,null,null,null,13002,360,2.7688047992616521E-2,0,"Others","","","",35.726030610675281,1,35.346873557914165,3,34.656537455776032,2]
["AWWA HOME AND DAY ACITIVITY CENTRE","5 PASIR RIS STREET 22, SINGAPORE 518064","Healthcare Facility","Community Hospital/ Nursing Home",null,2022,"Gold",2022,"New Non-Residential Buildings (NRB: 2015) (R3)",11169.33,500,4.4765442510875768E-2,0,"Others","","","","","","","",24.044414481441592,1]
["LEE KONG CHIAN SCHOOL OF MEDICINE (CLINICAL SCIENCES BUILDING)","11 MANDALAY ROAD, SINGAPORE 308232","Educational Institution","Univerisity",null,2018,"Platinum",2019,"Existing Building for Non-Residential buildings (version 3)",41351,32462,0.78503542840560081,0,"Water Cooled Chilled Water Plant",2017,0.61399999999999999,"2018-05-04",303.63874150564675,11,304.18859036057171,11,293.66086430799737,11]
["YONG PUNG HOW SCHOOL OF LAW","55 ARMENIAN STREET, SINGAPORE 179943","Educational Institution","Univerisity",null,2016,null,null,null,23328,1441453,61.790680727023322,0,"Water Cooled Chilled Water Plant",6,0.60699999999999998,"2020-05-20",123.45335005144032,7,130.13077117626887,7,184.68191915294923,10]
["SINGAPORE INSTITUTE OF TECHNOLOGY (SIT@DOVER)","10 DOVER DRIVE, SINGAPORE 138683","Educational Institution","Univerisity",null,2014,null,null,null,19175,16699,0.87087353324641459,0,"Water Cooled Chilled Water Plant",20,"","",159.37647770534551,9,164.01719217731423,9,182.94126101694917,9]
["SINGAPORE UNIVERSITY OF TECHNOLOGY & DESIGN (SUTD)","8 SOMAPAH ROAD, SINGAPORE 487372","Educational Institution","Univerisity",null,2014,"GoldPlus",2022,"GM:2021 In Operation",100637,54191,0.53847988314437034,0,"Water Cooled Chilled Water Plant",7,0.65,"2023-06-01",166.81403425612791,10,174.41539429186076,10,180.09409952325825,8]
["SINGAPORE INSTITUTE OF MANAGEMENT","461 CLEMENTI ROAD, SINGAPORE 599491","Educational Institution","Univerisity",null,1999,null,null,null,78440,74944,0.95543090260071395,0,"Water Cooled Chilled Water Plant",7,0.63200000000000001,"2022-04-28",146.74902154513003,8,144.10236486486485,8,161.41688551759307,7]
["SINGAPORE INSTITUTE OF MANAGEMENT NAMLY CAMPUS","41 NAMLY AVENUE, SINGAPORE 267616","Educational Institution","Univerisity",null,1988,null,null,null,10063,1503,0.14935903806022061,0,"Water-Cooled Package Units","","","",107.13225678227168,6,125.34228957567325,6,131.91843386664016,6]
["SINGAPORE MANAGEMENT UNIVERSITY","50 STAMFORD ROAD, SINGAPORE 178899","Educational Institution","Univerisity",null,2005,"Platinum",2018,"Existing Building for Non-Residential buildings (version 3)",102750,69060,0.67211678832116784,0,"Water Cooled Chilled Water Plant",7,0.53,"2021-06-03",105.54457049425085,5,110.03095391858247,5,123.57458819239032,5]
["SIT@SP BUILDING","510 DOVER ROAD, SINGAPORE 139660","Educational Institution","Univerisity",null,2015,"Platinum",2020,"New Building for Non-Residential buildings (version 4)",20100,9769,0.48601990049751242,0,"Water Cooled Chilled Water Plant",6,0.63600000000000001,"2019-01-30",94.251534328358218,4,93.93304626865671,4,93.597762686567165,4]
["SINGAPORE INSTITUTE OF TECHNOLOGY (SIT@TP)","29BTAMPINES AVENUE 1, SINGAPORE 528694","Educational Institution","Univerisity",null,2014,"Platinum",2020,"New Building for Non-Residential buildings (version 4)",11670,6113,0.52382176520994006,0,"Water Cooled Chilled Water Plant",9,0.56999999999999995,"2019-06-12",77.831165381319622,3,76.817917737789202,3,74.436409597257935,3]
["NATIONAL INSTITUE OF EDUCATION","1 NANYANG WALK, SINGAPORE 637616, SINGAPORE 637616","Educational Institution","Univerisity",null,2000,"Platinum",2017,"Existing Building for Non-Residential buildings (version 3)",109181,60000,0.54954616645753385,0,"Water Cooled Chilled Water Plant",7,0.6,"2021-08-20",70.43980179701596,2,71.433463697896158,2,72.23878696842857,2]
["JAMES COOK UNIVERSITY PTE. LTD.","149 SIMS DRIVE, SINGAPORE 387380, SINGAPORE 387380","Educational Institution","Univerisity",null,2015,null,null,null,24157,7907,0.32731713375005173,0,"Others","",0.73,"2015-04-20",52.806706130728159,1,53.74137310096453,1,62.80813014861117,1]
["TEMASEK LIFE SCIENCES LABORATORY","1 RESEARCH LINK, NUS, SINGAPORE 117604","Educational Institution","Univerisity",null,1998,null,null,null,20335,14851,0.73031718711581017,0,"Water Cooled Chilled Water Plant",19,"","",null,"",null,"",null,""]
["SIT@NP","537 CLEMENTI ROAD, SINGAPORE 599493","Educational Institution","Univerisity",null,2014,"Platinum",2020,"New Building for Non-Residential buildings (version 4)",15063,7153,0.47487220341233488,0,"Water Cooled Chilled Water Plant",8,0.62,"2019-06-16",null,"",null,"",null,""]
["SIT@NYP","172A ANG MO KIO AVENUE 8, SINGAPORE 567739","Educational Institution","Univerisity",null,2015,"Platinum",2020,"Existing Building for Non-Residential buildings (version 3)",15931,12745,0.80001255413972761,280,"Water Cooled Chilled Water Plant",8,0.62,"2020-01-08",null,"",null,"",null,""]
["N/A","21 NANYANG LINK, SINGAPORE 637371","Educational Institution","Univerisity",null,2008,"Platinum",2020,"Existing Non-Residental Buildings ENRB: 2017",44151,39883,0.90333174786528048,0,"District Cooling System (DCS)","",0.74,"2010-07-01"]
["N/A","31 NANYANG LINK, SINGAPORE 637718","Educational Institution","Univerisity",null,1997,"Platinum",2018,"Existing Building for Non-Residential buildings (version 3)",10260,9113,0.88820662768031189,0,"Water Cooled Chilled Water Plant",3,0.64200000000000002,"2018-02-26",null,"",null,"",null,""]
["NIL","36 NANYANG AVENUE, SINGAPORE 639801","Educational Institution","Univerisity",null,1958,null,null,null,1190,974,0.81848739495798317,0,"Others","","","",null,"",null,"",null,""]
["NIL","42 NANYANG AVENUE, SINGAPORE 639815","Educational Institution","Univerisity",null,1966,"Platinum",2020,"Existing Building for Non-Residential buildings (version 3)",7440,6305,0.84744623655913975,0,"Water Cooled Chilled Water Plant",3,0.64,"2015-01-23",null,"",null,"",null,""]
["NIL","46 NANYANG AVENUE, SINGAPORE 639817","Educational Institution","Univerisity",null,1954,"Platinum",2020,"Existing Non-Residental Buildings ENRB: 2017",3186,2389,0.74984306340238549,0,"Others","","","",null,"",null,"",null,""]
["NIL","48 NANYANG AVENUE, SINGAPORE 639818","Educational Institution","Univerisity",null,2009,"Platinum",2019,"Existing Building for Non-Residential buildings (version 3)",15420,14000,0.90791180285343709,0,"Water Cooled Chilled Water Plant",7,0.64,"2019-02-24",null,"",null,"",null,""]
["NIL","50 NANYANG DRIVE, SINGAPORE 637553","Educational Institution","Univerisity",null,2003,"Platinum",2018,"Existing Building for Non-Residential buildings (version 3)",20792,14887,0.71599653712966527,0,"Water Cooled Chilled Water Plant",3,0.63,"2015-03-25",null,"",null,"",null,""]
["NIL","50 NANYANG VIEW, SINGAPORE 639667","Educational Institution","Univerisity",null,1986,"Platinum",2020,"Existing Non-Residental Buildings ENRB: 2017",3356,1542,0.45947556615017876,0,"Others","","","",null,"",null,"",null,""]
["NIL","52 NANYANG AVENUE, SINGAPORE 639816","Educational Institution","Univerisity",null,2015,"Platinum",2016,"New Building for Non-Residential buildings (version 4.1)",15273,5216,0.34151771099325606,0,"Water Cooled Chilled Water Plant",2,0.67,"2022-11-02",null,"",null,"",null,""]
["SINGAPORE MANAGEMENT UNIVERSITY","81 VICTORIA STREET, SINGAPORE 188065","Educational Institution","Univerisity",null,2005,"Platinum",2022,"Existing Non-Residential Buildings (RECERT 2017)",22071.03,19804,0.8972848118098703,0,"Water Cooled Chilled Water Plant",9,0.56499999999999995,"2022-10-31",null,"",null,"",null,""]
["NIL","60 NANYANG DRIVE, SINGAPORE 637551","Educational Institution","Univerisity",null,2004,"Platinum",2020,"Existing Building for Non-Residential buildings (version 3)",37181,36185,0.97321212447217664,0,"Water Cooled Chilled Water Plant",2,0.65,"2014-10-03",null,"",null,"",null,""]
["NIL","60 NANYANG VIEW, SINGAPORE 639673","Educational Institution","Univerisity",null,2003,"Platinum",2018,"Existing Building for Non-Residential buildings (version 3)",18322,16500,0.90055670778299313,170,"Water Cooled Chilled Water Plant",6,0.65,"2018-04-13",null,"",null,"",null,""]
["NIL","62 NANYANG DRIVE, SINGAPORE 637459","Educational Institution","Univerisity",null,2006,"Platinum",2020,"Existing Building for Non-Residential buildings (version 3)",19282,15279,0.79239705424748474,0,"Water Cooled Chilled Water Plant",2,0.63,"2014-12-03",null,"",null,"",null,""]
["NIL","65 NANYANG DRIVE, SINGAPORE 637460","Educational Institution","Univerisity",null,2007,"Platinum",2020,"Existing Building for Non-Residential buildings (version 3)",14798,10896,0.73631571834031628,0,"Water Cooled Chilled Water Plant",11,0.64,"2018-12-21",null,"",null,"",null,""]
["NIL","70 NANYANG DRIVE, SINGAPORE 637457","Educational Institution","Univerisity",null,2006,"Platinum",2020,"Existing Building for Non-Residential buildings (version 3)",11706,6267,0.53536647872885701,0,"Water Cooled Chilled Water Plant",10,0.63,"2014-10-03",null,"",null,"",null,""]
["NIL","76 NANYANG DRIVE, SINGAPORE 637331","Educational Institution","Univerisity",null,2008,"Platinum",2022,"GM:2021 In Operation",15484,10408,0.67217773185223462,0,"Water Cooled Chilled Water Plant",2,0.59299999999999997,"2019-12-02",null,"",null,"",null,""]
["NIL","81 NANYANG DRIVE, SINGAPORE 637458","Educational Institution","Univerisity",null,2006,"Platinum",2018,"Existing Building for Non-Residential buildings (version 3)",19039,16826,0.8837649036188876,0,"Water Cooled Chilled Water Plant",10,0.67,"2018-12-05",null,"",null,"",null,""]
["NTU INNOVATION CENTRE","71 NANYANG DRIVE, SINGAPORE 638075","Educational Institution","Univerisity",null,1993,"Platinum",2023,"GM:2021 In Operation",11606,7455,0.64234016887816647,0,"Water Cooled Chilled Water Plant",4,0.52,"2021-11-28",null,"",null,"",null,""]
["NIL","12 NANYANG HILL, SINGAPORE 637663","Educational Institution","Univerisity",null,1961,"Platinum",2020,"Existing Building for Non-Residential buildings (version 3)",4370,2861,0.65469107551487415,0,"Others","","","",null,"",null,"",null,""]
["YALE-NUS COLLEGE","16 COLLEGE AVENUE WEST #01-220, SINGAPORE 138527","Educational Institution","Univerisity",null,2016,"Platinum",2021,"New Building for Non-Residential buildings (version 4)",68353,29685,0.43428964346846516,0,"District Cooling System (DCS)","","",""]
["DUKE-NUS MEDICAL SCHOOL","8 COLLEGE ROAD, SINGAPORE 169857","Educational Institution","Univerisity",null,2009,"Certified",2022,"Existing Non-Residential Buildings (RECERT 2017)",28340,20884,0.73690896259703598,0,"Water Cooled Chilled Water Plant",14,0.74,"2016-09-29",null,"",null,"",null,""]
["EDUCATION RESOURCE CENTRE","8 COLLEGE AVENUE WEST, SINGAPORE 138608","Educational Institution","Univerisity",null,2014,"Platinum",2021,"Existing Building for Non-Residential buildings (version 3)",12835,5605,0.43669653291780286,0,"District Cooling System (DCS)","","",""]
["STEPHEN RIADY CENTRE","2 COLLEGE AVENUE WEST, SINGAPORE 138607","Educational Institution","Univerisity",null,2012,"Platinum",2021,"New Building for Non-Residential buildings (version 3)",23848,16693,0.69997484065749749,0,"District Cooling System (DCS)","","",""]
["NATION UNIVERSITY OF SINGAPORE - BUKIT TIMAH CAMPUS","469 BUKIT TIMAH RD, SINGAPORE 259756","Educational Institution","Univerisity",null,1976,"Gold",2021,"Existing Non-Residental Buildings ENRB: 2017",24475,24240,0.99039836567926454,0,"Water Cooled Chilled Water Plant",2,0.57399999999999995,"2021-02-22",null,"",null,"",null,""]
["SCHOOL OF COMPUTING BLOCK 3 (COM3)","11 RESEARCH LINK, SINGAPORE 119391","Educational Institution","Univerisity",null,2022,null,null,null,16862,8809,0.52241726960028467,0,"District Cooling System (DCS)","",0.56499999999999995,"2021-03-24"]
["TECHNO EDGE","3A ENGINEERING DRIVE 2, SINGAPORE 117275","Educational Institution","Univerisity",null,2020,null,null,null,7450,8525,1.1442953020134228,0,"District Cooling System (DCS)","",0.53400000000000003,"2021-03-24"]
["UNIVERSITY SPORT CENTRE","2 SPORTS DRIVE, SINGAPORE 117288","Educational Institution","Univerisity",null,2017,null,null,null,9178,714,7.7794726519938989E-2,0,"Others","","","",null,"",null,"",null,""]
["DESIGN & ENVIRONMENT BLOCK 4","8 ARCHITECTURE DRIVE, SINGAPORE 117356","Educational Institution","Univerisity",null,2018,"Platinum",2022,"GM:2021 In Operation",8333,3362,0.40345613824552984,0,"District Cooling System (DCS)","","",""]
["ENGINEERING BLOCK 2A (EDIC)","6 ENGINEERING DRIVE 4, SINGAPORE 117361","Educational Institution","Univerisity",null,2015,"GoldPlus",2021,"GM:2021 In Operation",2107,1475,0.70004746084480307,0,"District Cooling System (DCS)","","",""]
["YST CONSERVATORY OF MUSIC","3 CONSERVATORY ROAD, SINGAPORE 117376","Educational Institution","Univerisity",null,2006,null,null,null,18083,11295,0.6246198086600675,0,"District Cooling System (DCS)","",0.77500000000000002,"2019-06-12"]
["LEE KONG CHIAN NATURAL HISTORY MUSEUM","2 CONSERVATORY ROAD, SINGAPORE 117377","Educational Institution","Univerisity",null,2014,"Gold",2014,"New Building for Non-Residential buildings (version 4)",8369,5858,0.69996415342334806,0,"District Cooling System (DCS)","",0.77500000000000002,"2019-06-24"]
["TEMASEK LAB","5A ENGINEERING DRIVE, SINGAPORE 117411","Educational Institution","Univerisity",null,2006,"Gold",2016,"Existing Building for Non-Residential buildings (version 2.1)",19587,19487,0.99489457293102568,0,"District Cooling System (DCS)","",0.54149999999999998,"2021-03-24"]
["COMPUTING BLOCK 1","13 COMPUTING DRIVE, SINGAPORE 117417","Educational Institution","Univerisity",null,1980,null,null,null,11734,7243,0.61726606442815746,0,"District Cooling System (DCS)","",0.93500000000000005,"2019-04-16"]
["CENTRE FOR LIFE SCIENCES (CELS)","28 MEDICAL DRIVE, SINGAPORE 117456","Educational Institution","Univerisity",null,2001,"Platinum",2017,"Existing Building for Non-Residential buildings (version 3)",20116,12379,0.61538079140982305,0,"District Cooling System (DCS)","",0.60599999999999998,"2021-12-26"]
["SCIENCE BLOCK 15","1 SCIENCE DRIVE 2, SINGAPORE 117541","Educational Institution","Univerisity",null,1986,null,null,null,6842,4768,0.69687225957322418,0,"District Cooling System (DCS)","",0.60599999999999998,"2021-12-26"]
["SCIENCE BLOCK 14","1 SCIENCE DRIVE 2, SINGAPORE 117542","Educational Institution","Univerisity",null,1986,null,null,null,7163,4750,0.66312997347480107,0,"District Cooling System (DCS)","",0.60599999999999998,"2021-12-26"]
["SCIENCE BLOCK 16","3 SCIENCE DRIVE 2, SINGAPORE 117543","Educational Institution","Univerisity",null,1993,null,null,null,15567,9315,0.59838119098092113,0,"District Cooling System (DCS)","",0.60599999999999998,"2021-12-26"]
["MEDICINE BLOCK 4","5 SCIENCE DRIVE 2, SINGAPORE 117545","Educational Institution","Univerisity",null,1981,"Platinum",2013,"Existing Building for Non-Residential buildings (version 3)",8735,5842,0.6688036634230109,0,"District Cooling System (DCS)","",0.60599999999999998,"2021-12-26"]
["FRONTIER","6 SCIENCE DRIVE 2, SINGAPORE 117546","Educational Institution","Univerisity",null,2016,"Platinum",2021,"GM:2021 In Operation",4801,1761,0.36679858362841072,0,"District Cooling System (DCS)","",0.60599999999999998,"2021-12-26"]
["SCIENCE BLOCK 5","8 SCIENCE DRIVE 2, SINGAPORE 117547","Educational Institution","Univerisity",null,1986,null,null,null,7823,5033,0.6433593250671098,0,"District Cooling System (DCS)","",0.60599999999999998,"2021-12-26"]
["SCIENCE BLOCK 6","10 SCIENCE DRIVE 2, SINGAPORE 117548","Educational Institution","Univerisity",null,1986,null,null,null,9625,3269,0.33963636363636363,0,"District Cooling System (DCS)","",0.60599999999999998,"2021-12-26"]
["MD BLK 1 (TAHIR FOUNDATION BLDG)","12 SCIENCE DRIVE 2, SINGAPORE 117549","Educational Institution","Univerisity",null,2014,"Platinum",2021,"New Building for Non-Residential buildings (version 3)",38448,23333,0.6068716188098211,0,"District Cooling System (DCS)","",0.60599999999999998,"2021-12-26"]
["NANYANG TECHNOLOGICAL UNIVERSITY – ACADEMIC BUILDINGS","50 NANYANG AVE, SINGAPORE 639798","Educational Institution","Univerisity",null,1986,"Platinum",2020,"Existing Building for Non-Residential buildings (version 3)",738667,517068,0.70000148916900307,0,"Water Cooled Chilled Water Plant","",0.65,"2019-02-19",null,"",null,"",null,""]
["SCIENCE BLOCK 12","2 SCIENCE DRIVE 3, SINGAPORE 117551","Educational Institution","Univerisity",null,1981,null,null,null,5141,3067,0.5965765415288854,0,"District Cooling System (DCS)","",0.60599999999999998,"2023-12-26"]
["SCIENCE BLOCK 8","3 SCIENCE DRIVE 3, SINGAPORE 117552","Educational Institution","Univerisity",null,1981,null,null,null,5678,3106,0.54702359985910531,0,"District Cooling System (DCS)","",0.60599999999999998,"2021-12-26"]
["SCIENCE BLOCK 11","4 SCIENCE DRIVE 3, SINGAPORE 117553","Educational Institution","Univerisity",null,1981,null,null,null,3163,2218,0.70123300663926647,0,"District Cooling System (DCS)","",0.60599999999999998,"2021-12-26"]
["SCIENCE BLOCK 7","6 SCIENCE DRIVE 3, SINGAPORE 117554","Educational Institution","Univerisity",null,1981,null,null,null,4658,3269,0.70180334907685704,0,"District Cooling System (DCS)","",0.60599999999999998,"2021-12-26"]
["SCIENCE BLOCK 1A","10 SCIENCE PARK DRIVE 4, SINGAPORE 117555","Educational Institution","Univerisity",null,1991,null,null,null,10531,7493,0.71151837432342613,0,"District Cooling System (DCS)","",0.60599999999999998,"2021-12-26"]
["CTR FOR ENGLISH LANGUAGE COMMUNICATION","10 ARCHITECTURE DRIVE, SINGAPORE 117511","Educational Institution","Univerisity",null,2003,null,null,null,3103,3103,1,0,"District Cooling System (DCS)","",0.53400000000000003,"2021-03-24"]
["SCIENCE BLOCK 1","12 SCIENCE DRIVE 4, SINGAPORE 117556","Educational Institution","Univerisity",null,1981,null,null,null,1180,763,0.64661016949152539,0,"District Cooling System (DCS)","",0.60599999999999998,"2021-12-24"]
["SCIENCE BLOCK 2","14 SCIENCE DRIVE 4, SINGAPORE 117557","Educational Institution","Univerisity",null,1981,null,null,null,5047,3471,0.68773528829007335,0,"District Cooling System (DCS)","",0.60599999999999998,"2021-12-24"]
["SCIENCE BLOCK 3","16 SCIENCE DRIVE 4, SINGAPORE 117558","Educational Institution","Univerisity",null,1981,null,null,null,6492,3694,0.56900800985828714,0,"District Cooling System (DCS)","",0.60599999999999998,"2021-12-24"]
["SCIENCE BLOCK 4","18 SCIENCE DRIVE 4, SINGAPORE 117559","Educational Institution","Univerisity",null,1981,null,null,null,4553,2978,0.65407423676696685,0,"District Cooling System (DCS)","",0.60599999999999998,"2021-12-24"]
["SCIENCE BLOCK 4A","20 SCIENCE DRIVE 4, SINGAPORE 117560","Educational Institution","Univerisity",null,1996,null,null,null,2347,1553,0.66169578184916911,0,"District Cooling System (DCS)","",0.60599999999999998,"2021-12-24"]
["MEDICINE BLOCK 9","2 MEDICAL DRIVE, SINGAPORE 117593","Educational Institution","Univerisity",null,1981,"Platinum",2013,"Existing Building for Non-Residential buildings (version 3)",4307,2593,0.60204318551195724,0,"District Cooling System (DCS)","",0.60599999999999998,"2021-12-24"]
["MEDICINE BLOCK 10","4 MEDICAL DRIVE, SINGAPORE 117594","Educational Institution","Univerisity",null,1981,"Platinum",2021,"Existing Non-Residental Buildings ENRB: 2017",4289,3200,0.74609466076008391,0,"District Cooling System (DCS)","",0.60599999999999998,"2021-12-24"]
["MEDICINE BLOCK 7","8 MEDICAL DRIVE, SINGAPORE 117596","Educational Institution","Univerisity",null,1981,"Gold",2021,"Existing Non-Residental Buildings ENRB: 2017",5084,3494,0.68725413060582219,0,"District Cooling System (DCS)","",0.60599999999999998,"2021-12-24"]
["MEDICINE BLOCK 11","10 MEDICAL DRIVE, SINGAPORE 117597","Educational Institution","Univerisity",null,1995,"Platinum",2015,"Existing Building for Non-Residential buildings (version 3)",16437,11592,0.70523818215002743,0,"District Cooling System (DCS)","",0.60599999999999998,"2021-12-24"]
["MD BLK 6 (CTR FOR TRANS MED)","14 MEDICAL DRIVE, SINGAPORE 117599","Educational Institution","Univerisity",null,2011,"Gold",2021,"Existing Non-Residental Buildings ENRB: 2017",40764,23758,0.58281817289765481,0,"District Cooling System (DCS)","",0.60599999999999998,"2021-12-24"]
["MEDICINE BLOCK 3","16 MEDICAL DRIVE, SINGAPORE 117600","Educational Institution","Univerisity",null,1997,"Platinum",2021,"Existing Non-Residental Buildings ENRB: 2017",5910,3633,0.61472081218274111,0,"District Cooling System (DCS)","",0.60599999999999998,"2021-12-24"]
["MEDICINE BLOCK 2","18 MEDICAL DRIVE, SINGAPORE 117601","Educational Institution","Univerisity",null,2008,"Platinum",2021,"Existing Non-Residental Buildings ENRB: 2017",7373,3708,0.50291604502916043,0,"District Cooling System (DCS)","",0.60599999999999998,"2021-12-24"]
["SCIENCE BLOCK 17","10 LOWER KENT RIDGE ROAD, SINGAPORE 119076","Educational Institution","Univerisity",null,1998,null,null,null,10454,6597,0.63105031566864356,0,"District Cooling System (DCS)","",0.60599999999999998,"2021-12-24"]
["DESIGN & ENVIRONMENT BLOCK 1","4 ARCHITECTURE DRIVE, SINGAPORE 117566","Educational Institution","Univerisity",null,2021,"Platinum",2022,"GM:2021 In Operation",5717,4758,0.83225467902746197,0,"District Cooling System (DCS)","",0.53400000000000003,"2021-03-24"]
["DESIGN & ENVIRONMENT BLOCK 2","2 ARCHITECTURE DRIVE, SINGAPORE 117565","Educational Institution","Univerisity",null,1976,null,null,null,5617,3546,0.63129784582517356,0,"District Cooling System (DCS)","",0.53400000000000003,"2021-03-24"]
["ENGINEERING BLOCK 3A","7 ENGINEERING DRIVE 1, SINGAPORE 117574","Educational Institution","Univerisity",null,1999,null,null,null,12130,9035,0.74484748557295966,0,"District Cooling System (DCS)","",0.53400000000000003,"2021-03-24"]
["ENGINEERING BLOCK A (EA)","9 ENGINEERING DRIVE 1, SINGAPORE 117575","Educational Institution","Univerisity",null,1999,"Platinum",2022,"GM:2021 In Operation",19178,11559,0.60272186880800915,0,"District Cooling System (DCS)","",0.53400000000000003,"2021-03-24"]
["ENGINEERING BLOCK 1A","1 ENGINEERING DRIVE 2, SINGAPORE 117576","Educational Institution","Univerisity",null,1999,"GoldPlus",2020,"GM NRB: 2015",7584,5115,0.67444620253164556,0,"District Cooling System (DCS)","",0.53400000000000003,"2021-03-24"]
["ENGINEERING WORKSHOP 1","2 ENGINEERING DRIVE 2, SINGAPORE 117577","Educational Institution","Univerisity",null,1976,null,null,null,8948,4815,0.53810907465355384,0,"Others","","","",null,"",null,"",null,""]
["ENGINEERING BLOCK 1","3 ENGINEERING DRIVE 2, SINGAPORE 117578","Educational Institution","Univerisity",null,1976,null,null,null,12453,11560,0.92829037179796037,0,"District Cooling System (DCS)","",0.53400000000000003,"2021-03-24"]
["ENGINEERING BLOCK 2","5 ENGINEERING DRIVE 2, SINGAPORE 117579","Educational Institution","Univerisity",null,1976,null,null,null,8663,5119,0.59090384393397211,0,"District Cooling System (DCS)","",0.53400000000000003,"2021-03-24"]
["ENGINEERING BLOCK 8","1 ENGINEERING DRIVE 3, SINGAPORE 117580","Educational Institution","Univerisity",null,2021,"Platinum",2022,"GM:2021 In Operation",15737,10079,0.64046514583465719,0,"District Cooling System (DCS)","",0.53400000000000003,"2021-03-24"]
["ENGINEERING BLOCK 3","2 ENGINEERING DRIVE 3, SINGAPORE 117581","Educational Institution","Univerisity",null,1976,null,null,null,9395,7438,0.79169771154869617,0,"District Cooling System (DCS)","",0.53400000000000003,"2021-03-24"]
["ENGINEERING BLOCK 4A","3 ENGINEERING DRIVE 3, SINGAPORE 117582","Educational Institution","Univerisity",null,1998,null,null,null,8318,5821,0.69980764606876655,0,"District Cooling System (DCS)","",0.53400000000000003,"2021-03-24"]
["ENGINEERING BLOCK 4","4 ENGINEERING DRIVE 3, SINGAPORE 117583","Educational Institution","Univerisity",null,1976,"Platinum",2019,"Existing Non-Residental Buildings ENRB: 2017",19015,11218,0.58995529844859318,0,"District Cooling System (DCS)","",0.53400000000000003,"2021-03-24"]
["ENGINEERING BLOCK 5","4 ENGINEERING DRIVE 4, SINGAPORE 117585","Educational Institution","Univerisity",null,1976,null,null,null,9410,5755,0.61158342189160464,0,"District Cooling System (DCS)","",0.53400000000000003,"2021-03-24"]
["ENGINEERING BLOCK 6","5 ENGINEERING DRIVE 1, SINGAPORE 117608","Educational Institution","Univerisity",null,2009,"Platinum",2018,"Existing Building for Non-Residential buildings (version 3)",12289,9622,0.78297664578077952,0,"District Cooling System (DCS)","",0.53400000000000003,"2021-03-24"]
["ARTS & SOCIAL SCIENCES BLOCK 2","ARTS & SOCIAL SCIENCES BLOCK 2, SINGAPORE 117568","Educational Institution","Univerisity",null,1980,null,null,null,7971,3922,0.49203362187931249,0,"District Cooling System (DCS)","",0.56999999999999995,"2021-03-24"]
["FASS BLK7 (SHAW FDN BLDG)","5 ARTS LINK, SINGAPORE 117570","Educational Institution","Univerisity",null,1993,null,null,null,8164,5214,0.63865752082312588,0,"District Cooling System (DCS)","",0.56999999999999995,"2021-03-24"]
["ARTS & SOCIAL SCIENCES BLOCK 5","7 ARTS LINK, SINGAPORE 117571","Educational Institution","Univerisity",null,1981,null,null,null,6413,2637,0.41119600810852958,0,"District Cooling System (DCS)","",0.56999999999999995,"2021-03-24"]
["ARTS & SOCIAL SCIENCES BLOCK 4","9 ARTS LINK, SINGAPORE 117572","Educational Institution","Univerisity",null,1980,null,null,null,7530,4038,0.53625498007968131,0,"District Cooling System (DCS)","",0.56999999999999995,"2021-03-24"]
["ARTS & SOCIAL SCIENCES BLOCK 1","11 ARTS LINK, SINGAPORE 117573","Educational Institution","Univerisity",null,1980,null,null,null,6770,3777,0.55790251107828659,0,"District Cooling System (DCS)","",0.56999999999999995,"2021-03-24"]
["INNOVATION 4.0","3 RESEARCH LINK, SINGAPORE 117602","Educational Institution","Univerisity",null,1999,"Platinum",2017,"Existing Building for Non-Residential buildings (version 3)",16206,12320,0.76021226706158218,0,"District Cooling System (DCS)","",0.56999999999999995,"2021-03-24"]
["SHAW FOUNDATION ALUMNI HOUSE (SFAH)","11 KENT RIDGE DRIVE, SINGAPORE 119244","Educational Institution","Univerisity",null,2010,null,null,null,11709,7977,0.68127081732001027,0,"District Cooling System (DCS)","",0.56999999999999995,"2021-03-24"]
["ARTS & SOCIAL SCIENCES BLOCK 8 (AS8)","10 KENT RIDGE CRESCENT, SINGAPORE 119260","Educational Institution","Univerisity",null,2016,"Platinum",2014,"New Building for Non-Residential buildings (version 4.1)",10475,4827,0.46081145584725536,0,"District Cooling System (DCS)","",0.56999999999999995,"2021-03-24"]
["VENTUS (UNI CAMPUS INFRA)","8 KENT RIDGE DRIVE, SINGAPORE 119246","Educational Institution","Univerisity",null,2013,"Platinum",2013,"New Building for Non-Residential buildings (version 4)",5256,27982801,5323.9727929984783,0,"District Cooling System (DCS)","",0.56999999999999995,"2021-03-24"]
["BUSINESS BLOCK 1-MOCHTAR RIADY","15 KENT RIDGE DRIVE, SINGAPORE 119245","Educational Institution","Univerisity",null,2009,"Gold",2015,"Existing Building for Non-Residential buildings (version 3)",16626,13545,0.81468783832551428,0,"District Cooling System (DCS)","",0.93500000000000005,"2019-04-16"]
["ICUBE, I3","21 HENG MUI KENG TERRACE, SINGAPORE 119613","Educational Institution","Univerisity",null,1984,null,null,null,14464,11559,0.79915652654867253,0,"Water Cooled Chilled Water Plant",25,"","",null,"",null,"",null,""]
["INSTITUTE OF SYSTEMS SCIENCE","25 HENG MUI KENG TERRACE, SINGAPORE 119615","Educational Institution","Univerisity",null,2001,"Platinum",2020,"Existing Building for Non-Residential buildings (version 3)",6462,5323,0.82373878056329308,0,"Others","","","",null,"",null,"",null,""]
["TECH CTR FOR OFFSHORE & MARINE (TCOMS)","12 PRINCE GEORGE'S PARK, SINGAPORE 118411","Educational Institution","Univerisity",null,2018,"Platinum",2017,"New Building for Non-Residential buildings (version 4.1)",12799,5620,0.43909680443784671,0,"Others","","","",null,"",null,"",null,""]
["UNIVERSITY HALL","21 LOWER KENT RIDGE ROAD, SINGAPORE 119077","Educational Institution","Univerisity",null,2005,"Platinum",2021,"Existing Non-Residental Buildings ENRB: 2017",21645,17647,0.81529221529221529,0,"District Cooling System (DCS)","",0.69699999999999995,"2021-11-01"]
["UNIVERSITY CULTURAL CENTRE (UCC)","50 KENT RIDGE CRESCENT, SINGAPORE 119279","Educational Institution","Univerisity",null,2000,"Certified",2018,"Existing Building for Non-Residential buildings (version 3)",23819,10009,0.42021075611906461,0,"District Cooling System (DCS)","",0.77500000000000002,"2019-06-14"]
["CENTRAL LIBRARY","12 KENT RIDGE CRESCENT, SINGAPORE 119275","Educational Institution","Univerisity",null,2021,null,null,null,26036,18347,0.70467813796282075,0,"District Cooling System (DCS)","",0.56999999999999995,"2021-03-24"]
["CENTRAL STORAGE LIBRARY ANNEX","15 KENT RIDGE ROAD, SINGAPORE 119225","Educational Institution","Univerisity",null,1977,null,null,null,6819,5057,0.74160434081243587,0,"District Cooling System (DCS)","",0.56999999999999995,"2021-03-24"]
["CTR FOR THE ARTS (CFA)","17 KENT RIDGE CRESCENT, SINGAPORE 119277","Educational Institution","Univerisity",null,1985,null,null,null,3143,2500,0.79541839007317849,0,"Others","","","",null,"",null,"",null,""]
["UNIVERSITY HEALTH CENTRE","20 LOWER KENT RIDGE ROAD, SINGAPORE 119080","Educational Institution","Univerisity",null,1979,null,null,null,3744,2809,0.75026709401709402,0,"Others","","","",null,"",null,"",null,""]
["S'PORE SYNCHROTRON LIGHTSOURCE","5 RESEARCH LINK, SINGAPORE 117603","Educational Institution","Univerisity",null,1999,null,null,null,2372,1365,0.57546374367622255,0,"District Cooling System (DCS)","",0.56999999999999995,"2021-03-24"]
["S2S (CRISP)","18 KENT RIDGE ROAD, SINGAPORE 119227","Educational Institution","Univerisity",null,2009,null,null,null,2056,1492,0.72568093385214005,0,"Others","","","",null,"",null,"",null,""]
["INSTITUTE OF MATHEMATICAL SCIENCE","3 & 4  PRINCE GEORGES PARK, SINGAPORE 118402","Educational Institution","Univerisity",null,1950,null,null,null,995,897,0.90150753768844216,0,"Others","","","",null,"",null,"",null,""]
["17 & 18 - OFFICE OF CAMPUS SECURITY HQ","17 & 18 PRINCE GEORGE'S PARK, SINGAPORE 118416","Educational Institution","Univerisity",null,1950,null,null,null,775,933,1.2038709677419355,0,"Others","","","",null,"",null,"",null,""]
["12A KR BUNGALOW - TROPICAL MARINE SCIENCE INSTITUTE","12A KENT RIDGE ROAD, SINGAPORE 119222","Educational Institution","Univerisity",null,1950,null,null,null,264,264,1,0,"Others","","","",null,"",null,"",null,""]
["SHATEC","21 BUKIT BATOK STREET 22, SINGAPORE 659589","Educational Institution","ITE/ Polytechnic",null,1995,null,null,null,6073,4500,0.74098468631648284,0,"Others","","","",136.03858883583072,9,168.30824962950766,9,144.85991272847028,10]
["NANYANG POLYTECHNIC","180 ANG MO KIO AVE 8, SINGAPORE 569830","Educational Institution","ITE/ Polytechnic",null,1998,"Platinum",2022,"Existing Non-Residential Buildings (RECERT 2017)",266291,170816,0.64146366193374915,0,"Water Cooled Chilled Water Plant",4,0.65,"2022-09-01",117.88431093252829,7,121.96434721602142,7,126.45799406141265,9]
["NANYANG ACADEMY OF FINE ARTS - CAMPUS 1","80 BENCOOLEN STREET, SINGAPORE 189655","Educational Institution","ITE/ Polytechnic",null,2004,"Gold",2012,"Existing Building for Non-Residential buildings (version 2.1)",29128,20000,0.68662455369404007,0,"Water Cooled Chilled Water Plant",1,0.65,"2017-05-05",125.4801886296418,8,127.63009749151057,8,123.29580698871726,8]
["ITE COLLEGE WEST","1 CHOA CHU KANG GROVE, SINGAPORE 688236","Educational Institution","ITE/ Polytechnic",null,44995,"Platinum",2022,"Existing Non-Residential Buildings (RECERT 2017)",97876,80133,0.81871960439740077,22,"Water Cooled Chilled Water Plant",12,0.65,"2022-11-15","","","","",106.53843638890024,7]
["SINGAPORE POLYTECHNIC","500, DOVER ROAD, SINGAPORE 139651","Educational Institution","ITE/ Polytechnic",null,1978,"Platinum",2022,"Existing Non-Residental Buildings ENRB: 2017",289060,15000,5.1892340690514079E-2,0,"Water Cooled Chilled Water Plant",1978,0,"2023-01-01",101.89814571369266,4,99.662734380405453,5,103.33660831661247,6]
["ITE HEADQUARTERS & COLLEGE CENTRAL","2 ANG MO KIO DRIVE, SINGAPORE 567720","Educational Institution","ITE/ Polytechnic",null,2012,"Platinum",2017,"Existing Building for Non-Residential buildings (version 3)",192821,131450,0.68172035203634462,0,"Water Cooled Chilled Water Plant",10,0.6,"2020-10-22",91.006648653414302,3,95.151565441523488,3,100.42314893087371,5]
["TEMASEK POLYTECHNIC","21 TAMPINES AVE 1, SINGAPORE 529757","Educational Institution","ITE/ Polytechnic",null,1995,"Platinum",2022,"New Non-Residential Buildings (NRB: 2015) (R3)",357964,190744,0.53285805276508247,0,"Water Cooled Chilled Water Plant",1,"","",101.97585511392207,5,102.17000312880624,6,94.390752980746669,3]
["REPUBLIC POLYTECHNIC","W2 - 9 WOODLANDS AVE 9, SINGAPORE 738964","Educational Institution","ITE/ Polytechnic",null,2005,"Platinum",2021,"Existing Non-Residental Buildings ENRB: 2017",256082,8098,3.1622683359236493E-2,0,"Water Cooled Chilled Water Plant","","","",107,6,98,4,94,4]
["ITE COLLEGE EAST","10 SIMEI AVENUE, SINGAPORE 486047, SINGAPORE 486047","Educational Institution","ITE/ Polytechnic",null,2004,"Platinum",2022,"Existing Non-Residential Buildings (RECERT 2017)",130424,71430,0.54767527448935782,0,"Water Cooled Chilled Water Plant",5,0.57399999999999995,"2020-07-31",75.42998604551309,2,74.679399497025088,2,76.528614365454217,2]
["NGEE ANN POLYTECHNIC","535 CLEMENTI ROAD, SINGAPORE 599489","Educational Institution","ITE/ Polytechnic",null,1963,"GoldPlus",2022,"Existing Non-Residential Buildings (ENRB: 2017)",364287,154343,0.42368517130723854,0,"Water Cooled Chilled Water Plant",7,0.7,"2023-02-27",60.877858705680765,1,59.239277975484384,1,62.617447212336899,1]
["NANYANG ACADEMY OF FINE ARTS - CAMPUS 2","38 BENCOOLEN STREET, SINGAPORE 189654","Educational Institution","ITE/ Polytechnic",null,2004,"GoldPlus",2022,"Existing Non-Residental Buildings ENRB: 2017",4930,2053,0.41643002028397563,0,"Others","","","",null,"",null,"",null,""]
["NANYANG ACADEMY OF FINE ARTS - CAMPUS 3","151 BENCOOLEN STREET, SINGAPORE 189656","Educational Institution","ITE/ Polytechnic",null,2004,"Platinum",2014,"Existing Building for Non-Residential buildings (version 3)",11587,6305,0.54414429964615518,0,"Water Cooled Chilled Water Plant",7,"","",null,"",null,"",null,""]
["501 STIRLING ROAD","501 STIRLING ROAD, SINGAPORE 148951","Educational Institution","Private School",null,2005,"GoldPlus",2013,"New Building for Non-Residential buildings (version 4)",25000,19000,0.76,0,"Others","","","",102.73756,10,78.802880000000002,8,212.91983999999999,19]
["PARKWAY CENTRE","1 MARINE PARADE CENTRAL, SINGAPORE 449408","Educational Institution","Private School",null,1998,null,null,null,9642,9205,0.95467745281062022,0,"Others","","","",178.19061501763119,17,197.17819643227548,18,209.50978116573324,18]
["NTUC TRADE UNION HOUSE","73 BRAS BASAH ROAD, SINGAPORE 189556","Educational Institution","Private School",null,1976,"Gold",2015,"Existing Building for Non-Residential buildings (version 3)",5656,5656,1,0,"Water Cooled Chilled Water Plant",8,0.56999999999999995,"2017-10-26",181.66129773691657,18,175.92546852899574,17,189.05993635077795,17]
["ESSEC","5 NEPAL PARK, SINGAPORE 139408","Educational Institution","Private School",null,2014,null,null,null,5378,5378,1,5,"Others","","","",138.88248419486797,16,143.85552249907028,15,172.03421346225363,16]
["LASALLE COLLEGE OF THE ARTS","1 MCNALLY STREET, SINGAPORE 187940","Educational Institution","Private School",null,2007,"Gold",2019,"Existing Building for Non-Residential buildings (version 3)",35823,20823,0.58127460011724308,0,"Water Cooled Chilled Water Plant",12,1.06,"2022-12-15",131.92549842280098,15,158.03261033414287,16,146.20882673142953,15]
["LIFELONG LEARNING INSTITUTE","11 EUNOS RD 8, SINGAPORE 408601","Educational Institution","Private School",null,2013,"Platinum",2022,"Existing Non-Residential Buildings (RECERT 2017)",29577,202800,6.8566791763870576,0,"Water Cooled Chilled Water Plant",10,"","",131.40616458734829,14,136.64798661121819,13,143.59943976738683,14]
["INSEAD","1 AYER RAJAR AVENUE, SINGAPORE 138676","Educational Institution","Private School",null,1999,"Platinum",2022,"Existing Non-Residental Buildings ENRB: 2017",29887,15862,0.53073242546926758,133,"Water Cooled Chilled Water Plant",8,0.52,"2023-03-07",129.7822548265132,13,137.89487904440057,14,132.63517582895574,13]
["CEREBRAL PALSY CENTRE","65 PASIR RIS DRIVE 1, SINGAPORE 519529","Educational Institution","Private School",null,2013,null,null,null,6600,7000,1.0606060606060606,0,"Others","","","",109.6641212121212,11,116.38490606060606,11,115.04555151515152,12]
["MOUNTBATTEN CENTRE","231 MOUNTBATTEN ROAD, SINGAPORE 397999","Educational Institution","Private School",null,1951,null,null,null,9384,9384,1,0,"District Cooling System (DCS)","","","",116.16120524296676,12,127.59899296675191,12,108.45812020460357,11]
["S P JAIN SCHOOL OF GLOBAL MANAGEMENT","10 HYDERABAD ROAD, SINGAPORE 119579","Educational Institution","Private School",null,2006,null,null,null,10430,7273,0.69731543624161074,138,"Others","","","",88.522550335570472,7,87.591860019175456,10,90.016581975071901,10]
["SINGAPORE INSTITUTE OF POWER & GAS (SIPG)","1A. WOODLEIGH PARK, SINGAPORE 357874","Educational Institution","Private School",null,1995,null,null,null,5570,2785,0.5,0,"Others","","","",91.74069120287254,8,85.235565529622974,9,80.165915619389594,9]
["SINGAPORE BIBLE COLLEGE","9 – 15 ADAM ROAD, SINGAPORE 289886","Educational Institution","Private School",null,2022,null,null,null,9093.4,7867,0.86513295357072162,0,"Air Cooled Chilled Water Plant","","","","","","","",76.209292453867633,8]
["DIMENSIONS INTERNATIONAL COLLEGE","58 LOWLAND ROAD, SINGAPORE 547453","Educational Institution","Private School",null,2006,null,null,null,7778,7778,1,0,"Others","","","",65.527144510156859,6,60.324002314219598,5,69.384372589354598,7]
["UNITED WORLD COLLEGE OF SOUTH EAST ASIA - EAST","1 TAMPINES STREET 73, SINGAPORE 528704","Educational Institution","Private School",null,2011,"Platinum",2023,"GM:2021 In Operation",77641,76000,0.97886425986270142,0,"Water Cooled Chilled Water Plant",13,0.57999999999999996,"2020-01-16",62.068327301296996,5,68.254124753673963,6,66.594026352056261,6]
["UNITED WORLD COLLEGE OF SOUTHEAST ASIA","1207 DOVER ROAD, SINGAPORE 139654","Educational Institution","Private School",null,1900,"Platinum",2023,"GM:2021 In Operation",87829,50000,0.56928804836671254,0,"Water Cooled Chilled Water Plant",13,0.63,"2020-01-16",55.980981566452989,4,59.936474285258853,4,58.284225028179762,5]
["29 HENG MUI KENG TERRACE","29 HENG MUI KENG TERRACE SINGAPORE 119620, SINGAPORE 119620","Educational Institution","Private School",null,2004,null,null,null,25198,17782,0.70569092785141674,0,"Air Cooled Chilled Water Plant","","","",96.217914120168274,9,68.408107786332252,7,57.622533534407495,4]
["EAST ASIA INSTITUTE OF MANAGEMENT","9 AH HOOD ROAD, SINGAPORE 329975","Educational Institution","Private School",null,2012,null,null,null,10999,4600,0.41821983816710612,0,"Others","","","",44.197232475679606,3,42.083251204654971,3,45.320600054550418,3]
["SHELTON COLLEGE INTERNATIONAL","1 TELOK BLANGAH RISE, SINGAPORE 098888","Educational Institution","Private School",null,2003,null,null,null,6997,3437,0.49121051879376876,40,"Others","","","",38.792876947263117,2,36.800245819636991,2,40.601369158210666,2]
["YO:HA TAMPINES","6 TAMPINES STREET 92, SINGAPORE 528893","Educational Institution","Private School",null,2019,"Gold",2018,"Existing Building for Non-Residential buildings (version 3)",15888,9207,0.57949395770392753,0,"Others","","","",15.09308912386707,1,20.821223564954682,1,40.580324773413892,1]
["CHINESE SWIMMING CLUB","21 AMBER ROAD, SINGAPORE 439870","Sports & Recreation Centre","Sports Complex",null,2010,null,null,null,9764,6205,0.63549774682507165,0,"Others","","","",411.33167759115116,12,461.57699201147074,12,477.76715997541987,12]
["SENGKANG SPORTS CENTRE","57 ANCHORVALE ROAD, SINGAPORE 544964","Sports & Recreation Centre","Sports Complex",null,2008,"Gold",2022,"Existing Non-Residental Buildings ENRB: 2017",13691,1962,0.14330582134248776,0,"Others","","","",198.24990139507705,8,227.1958658973048,11,232.28271857424588,11]
["ACTIVESG PASIR RIS SPORTS CENTRE","120 PASIR RIS CENTRAL, SINGAPORE 519640","Sports & Recreation Centre","Sports Complex",null,2011,"GoldPlus",2016,"New Building for Non-Residential buildings (version 3)",11800,1400,0.11864406779661017,0,"Others","","","",212.15495338983052,11,205.72212711864407,10,218.04701694915252,10]
["QUEENSTOWN SPORT CENTRE","473 STIRLING ROAD S(148948), SINGAPORE 148948","Sports & Recreation Centre","Sports Complex",null,1970,null,null,null,3110,211,6.7845659163987132E-2,0,"Water-Cooled Package Units",null,"","",174.49271061093245,7,186.88688102893889,9,182.28805466237941,9]
["SINGAPORE SPORTSHUB","3 STADIUM DRIVE, SINGAPORE 397630","Sports & Recreation Centre","Sports Complex",null,2014,"GoldPlus",2012,"New Building for Non-Residential buildings (version 3)",241796,100810,0.41692170259226785,0,"Water Cooled Chilled Water Plant",9,0.73,"2021-05-09",200.84158625452861,9,171.93960040695461,8,170.22311973729921,8]
["TOA PAYOH SPORT CENTRE","301 LORONG 6 TOA PAYOH, SINGAPORE 319389","Sports & Recreation Centre","Sports Complex",null,1973,null,null,null,13744.7125,2000,0.14551050085623835,0,"District Cooling System (DCS)","","","",204.93061459088358,10,150.52485310260218,7,167.05762161267469,7]
["SINGAPORE INDOOR STADIUM","2 STADIUM WALK SINGAPORE, 397691","Sports & Recreation Centre","Sports Complex",null,1989,null,null,null,32411,20000,0.61707445003239636,0,"Water Cooled Chilled Water Plant",19,0.91,"2013-02-08",76.737095430563699,4,87.72618863965937,5,123.09149671407856,6]
["CHOA CHU KANG STADIUM","1 CHOA CHU KANG STREET 53, SINGAPORE 689236, SINGAPORE 689236","Sports & Recreation Centre","Sports Complex",null,2000,"Gold",2022,"Existing Non-Residential Buildings (ENRB: 2017)",18893,865,4.5784152860847936E-2,0,"Others",null,null,null,96.409410892923304,6,94.35192928597894,6,103.46771290954322,5]
["JURONG WEST SPORTS AND RECREATION CENTRE","20 JURONG WEST STREET 93, SINGAPORE 648965, SINGAPORE 648965","Sports & Recreation Centre","Sports Complex",null,2006,"Gold",2022,"Existing Non-Residental Buildings ENRB: 2017",29752,1735,5.8315407367571931E-2,0,"District Cooling System (DCS)","","","",84.135553912342033,5,83.750618445818759,4,86.390561979026614,4]
["JALAN BESAR SPORT CENTRE","100 TYRWHITT ROAD, SINGAPORE 207542","Sports & Recreation Centre","Sports Complex",null,2003,"Gold",2022,"Existing Non-Residental Buildings ENRB: 2017",25900,400,1.5444015444015444E-2,0,"Others","","","",55.207725868725873,2,48.926623552123552,2,77.169202702702705,3]
["CLEMENTI SPORT HALL","518 CLEMENTI AVENUE 3, SINGAPORE 129907","Sports & Recreation Centre","Sports Complex",null,1990,null,null,null,5091,300,5.8927519151443723E-2,0,"Others","","","",73.165354547240227,3,56.009434295816149,3,69.183058338243967,2]
["BEDOK STADIUM","1 BEDOK NORTH STREET 2, SINGAPORE 469642","Sports & Recreation Centre","Sports Complex",null,1981,null,null,null,21600,800,3.7037037037037035E-2,0,"Others","","","",7.7641773148148152,1,11.699666666666666,1,11.34675,1]
["HOUGANG SPORTS CENTRE","95 HOUGANG AVE 4, SINGAPORE 538830","Sports & Recreation Centre","Sports Complex",null,1993,null,null,null,9406,2533,0.26929619391877524,0,"Others","","","",0,"",0,"",0,""]
["BUKIT GOMBAK STADIUM","800 BUKIT BATOK WEST AVENUE 5, SINGAPORE 659081","Sports & Recreation Centre","Sports Complex",null,1990,null,null,null,2072,100,4.8262548262548263E-2,0,"Others","","","",0,"",0,"",0,""]
["BISHAN STADIUM","7, BISHAN STREET 14, SINGAPORE 579784","Sports & Recreation Centre","Sports Complex",null,1998,null,null,null,41641.4,0,0,0,"Others","","","",null,"",null,"",null,""]
["SUTD","61 CHANGI SOUTH AVE 1, SINGAPORE 486000","Sports & Recreation Centre","Sports Complex",null,2015,"Platinum",2019,"New Building for Non-Residential buildings (version 4)",9066,3392,0.37414515773218621,0,"Water Cooled Chilled Water Plant",7,0.65,"2023-06-01",null,"",null,"",null,""]
["THE BRITISH CLUB","73 BUKIT TINGGI ROAD, SINGAPORE 289761","Sports & Recreation Centre","Recreation Club",null,1981,null,null,null,3945,4358,1.1046894803548797,0,"Air Cooled Chilled Water Plant","","","",483.03705196451205,44,524.59098859315588,{"$f":"U1002+1","v":{"$error":"#VALUE!"}},560.59076045627376,48]
["MARITIME HOUSE","120 CANTONMENT ROAD, SINGAPORE 089760","Sports & Recreation Centre","Recreation Club",null,1973,null,null,null,374,4556,12.181818181818182,46,"Others","","","",1904.9043850267381,45,1790.1931818181815,{"$f":"U1003+1","v":{"$error":"#VALUE!"}},552.0743582887701,47]
["THE SINGAPORE ISLAND COUNTRY CLUB","180 ISLAND CLUB ROAD, SINGAPORE 578774","Sports & Recreation Centre","Recreation Club",null,2003,null,null,null,18697,14957,0.79996790929026051,0,"Water Cooled Chilled Water Plant",12,"","",376.05929293469541,42,459.56467347702835,{"$f":"U1004+1","v":{"$error":"#VALUE!"}},504.77734395892389,46]
["SINGAPORE RECREATION CLUB","B CONNAUGHT DRIVE, SINGAPORE 179682","Sports & Recreation Centre","Recreation Club",null,1998,null,null,null,7895,6049,0.76618112729575683,0,"Water Cooled Chilled Water Plant",26,1.52,"2018-10-07",439.57830018999368,43,449.52828752374921,{"$f":"U1005+1","v":{"$error":"#VALUE!"}},459.87527042431918,45]
["THE AMERICAN CLUB","10, CLAYMORE HILL, SINGAPORE 228219","Sports & Recreation Centre","Recreation Club",null,2023,null,null,null,12001,7425,0.61869844179651701,0,"Water Cooled Chilled Water Plant",4,0.6,"2023-03-07","","","","",418.27776601949836,44]
["TANGLIN CLUB","5 STEVEN ROAD, SINGAPORE 257814","Sports & Recreation Centre","Recreation Club",null,1900,"Certified",2019,"Existing Building for Non-Residential buildings (version 3)",10707,7167,0.66937517511908096,16,"Water Cooled Chilled Water Plant",2,0.70499999999999996,"2019-06-03",308.40839637620252,41,335.00220416549922,{"$f":"U1007+1","v":{"$error":"#VALUE!"}},388.41353320257775,43]
["SENTOSA GOLF CLUB CLUBHOUSE","27 BUKIT MANIS ROAD, SINGAPORE 099892","Sports & Recreation Centre","Recreation Club",null,1993,"Platinum",2018,"Existing Building for Non-Residential buildings (version 3)",12595,4334,0.3441048034934498,0,"Air Cooled Chilled Water Plant","",0.88,"2020-10-22",281.41790948789202,40,334.49788487495039,{"$error":"#VALUE!"},352.59562842397781,42]
["HOMETEAMNS BUKIT BATOK","2 BUKIT BATOK WEST AVENUE 7, SINGAPORE 659003","Sports & Recreation Centre","Recreation Club",null,1998,null,null,null,15342,15200,0.99074436188241433,0,"Water Cooled Chilled Water Plant",24,"","",260.22903728327469,37,272.62285555990093,{"$error":"#VALUE!"},321.92853995567725,41]
["SAFRA CLUBHOUSE (TOA PAYOH)","293 LORONG 6 TOA PAYOH SINGAPORE 319387, SINGAPORE 319387","Sports & Recreation Centre","Recreation Club",null,2014,null,null,null,16902,14728,0.87137616850076915,0,"Others","","","",266.40416518755177,38,288.53127440539578,{"$error":"#VALUE!"},312.5050999881671,40]
["RAFFLES TOWN CLUB","1 PLYMOUTH AVE, SINGAPORE 297753","Sports & Recreation Centre","Recreation Club",null,1999,null,null,null,17245,15660,0.90808930124673815,30,"Water Cooled Chilled Water Plant",23,"","",277.82157146999128,39,287.57118005218905,{"$error":"#VALUE!"},295.11110466801972,39]
["BUILDING A & B","31 AH HOOD ROAD, SINGAPORE 329979","Sports & Recreation Centre","Recreation Club",null,2002,null,null,null,4368,3848,0.88095238095238093,0,"Others","","","",232.88028846153847,33,248.78304945054947,{"$error":"#VALUE!"},286.56535714285712,38]
["SERANGOON GARDENS COUNTRY CLUB","22 KENSINGTON PARK ROAD, SINGAPORE 557271","Sports & Recreation Centre","Recreation Club",null,1988,null,null,null,9921,4353,0.43876625340187481,0,"Others","","","",241.13261263985484,36,263.47926418707789,{"$error":"#VALUE!"},272.68886503376677,37]
["WARREN GOLF & COUNTRY CLUB","81 CHOA CHU KANG WAY, SINGAPORE 688263, SINGAPORE 688263","Sports & Recreation Centre","Recreation Club",null,2000,null,null,null,11745,2593,0.22077479778629203,0,"Others","","","",240.96129076202638,35,252.28299957428695,{"$error":"#VALUE!"},258.15342699020857,36]
["SAFRA YISHUN COUNTRY CLUB","60 YISHUN AVE 4, SINGAPORE 769027","Sports & Recreation Centre","Recreation Club",null,2001,null,null,null,17141,10400,0.60673239600956774,0,"Others","","","",222.59050522139898,31,243.57465783793245,{"$error":"#VALUE!"},248.77376640802754,35]
["SINGAPORE SWIMMING CLUB","45 TANJONG RHU ROAD, SINGAPORE 436899","Sports & Recreation Centre","Recreation Club",null,1935,null,null,null,20543.53,15000,0.73015689124507821,0,"Others","","","",213.89964382946846,30,229.91833341202801,{"$error":"#VALUE!"},242.70798397354301,34]
["RAFFLES MARINA LTD","10 TUAS WEST DRIVE, SINGAPORE 638404","Sports & Recreation Centre","Recreation Club",null,1996,null,null,null,12450,7000,0.56224899598393574,19,"Water Cooled Chilled Water Plant",0,"","",234.2847156626506,34,224.1404497991968,{"$error":"#VALUE!"},230.81339759036143,33]
["ARENA COUNTRY CLUB","511 UPPER JURONG ROAD, SINGAPORE 638366, SINGAPORE 638366","Sports & Recreation Centre","Recreation Club",null,2001,null,null,null,12406,5500,0.44333387070772207,0,"Others",null,null,null,105.00694019023054,16,113.46795743994841,{"$error":"#VALUE!"},222.10825004030309,32]
["SAFRA CLUBHOUSE (MOUNT FABER)","2 TELOK BLANGAH WAY, SINGAPORE 098803","Sports & Recreation Centre","Recreation Club",null,2004,null,null,null,15949,13770,0.86337701423286728,0,"Others","","","",185.91290990030723,28,206.40753840366168,{"$error":"#VALUE!"},218.52710828265094,31]
["SELETAR COUNTRY CLUB","101 SELETAR CLUB ROAD, SINGAPORE 798273","Sports & Recreation Centre","Recreation Club",null,1994,null,null,null,16450.48,4350,0.26442997407978369,0,"Others","","","",182.85795490465932,27,208.51696303086598,{"$error":"#VALUE!"},216.55129819920148,30]
["NATIONAL SERVICE RESORT & COUNTRY CLUB","10 CHANGI COAST WALK, SINGAPORE 499739","Sports & Recreation Centre","Recreation Club",null,1994,null,null,null,24410,12795,0.52417042195821384,0,"Water Cooled Chilled Water Plant",2,0.65,"2020-06-20",205.26755428103237,29,198.81196231052849,{"$error":"#VALUE!"},213.10735354362967,29]
["SAFRA PUNGGOL","9 SENTUL CRESCENT, SINGAPORE 828654","Sports & Recreation Centre","Recreation Club",null,2016,null,null,null,19995,10568,0.5285321330332583,0,"Water Cooled Chilled Water Plant",3,0.61,"2022-09-30",174.9246211552888,26,181.40156939234808,{"$error":"#VALUE!"},195.64348087021756,28]
["SINGAPORE POLYTECHNIC GRADUATES GUILD","1010 DOVER ROAD, SINGAPORE 139658","Sports & Recreation Centre","Recreation Club",null,1991,null,null,null,5726,2000,0.34928396786587496,0,"Others","","","",151.52427523576668,23,162.69361683548726,{"$error":"#VALUE!"},185.60693328676214,27]
["SAFRA JURONG CLUBHOUSE (JURONG)","333 BOON LAY WAY, SINGAPORE 649848","Sports & Recreation Centre","Recreation Club",null,2010,null,null,null,14595,10000,0.68516615279205206,0,"Others","","","",128.52349503254538,19,148.07535525865023,{"$error":"#VALUE!"},185.5050565262076,26]
["GRASSROOTS CLUB","190 ANG MO KIO AVENUE 8, SINGAPORE 568046","Sports & Recreation Centre","Recreation Club",null,1998,null,null,null,11710,5000,0.42698548249359519,0,"Water Cooled Chilled Water Plant",35,"","",148.10643894107599,22,173.72233988044408,{"$error":"#VALUE!"},184.28331340734417,25]
["THE SINGAPORE ISLAND COUNTRY CLUB (THE BUKIT)","240 SIME ROAD, SINGAPORE 288303","Sports & Recreation Centre","Recreation Club",null,1988,null,null,null,12948,4050,0.31278962001853566,0,"Water Cooled Chilled Water Plant",12,"","",227.57747451343837,32,205.51883843064564,{"$error":"#VALUE!"},175.53550818659249,24]
["TANAH MERAH COUNTRY CLUB","1 TANAH MERAH COAST ROAD, SINGAPORE 498722","Sports & Recreation Centre","Recreation Club",null,2018,null,null,null,18029.900000000001,1917,0.1063233850437329,0,"Water-Cooled Package Units",null,"","",161.27395215724988,24,160.88230162119589,{"$error":"#VALUE!"},166.06346235974686,23]
["SEMBAWANG COUNTRY CLUB.","249, SEMBAWANG ROAD, SINGAPORE 758352","Sports & Recreation Centre","Recreation Club",null,2011,"GoldPlus",2022,"Existing Non-Residental Buildings ENRB: 2017",10641,2736,0.25711869185226954,0,"Others","","","",145.07555680857061,20,158.65219434263696,{"$error":"#VALUE!"},158.65219434263696,22]
["SAFRA TAMPINES","1A TAMPINES ST 92\nSINGAPORE 528882, SINGAPORE 528882","Sports & Recreation Centre","Recreation Club",null,1988,null,null,null,14030,10743,0.76571632216678542,0,"Others","","","",127.69389878831076,18,136.2892729864576,{"$error":"#VALUE!"},157.50313613684961,21]
["CLUB CSC @ CHANGI","2 NETHERAVON ROAD, SINGAPORE 508503","Sports & Recreation Centre","Recreation Club",null,2017,"Platinum",2023,"GM:2021 In Operation",12309,8157,0.66268583962953931,0,"Water-Cooled Package Units","","","",146.15805914371597,21,150.85235112519297,{"$error":"#VALUE!"},149.72739946380696,20]
["CLUB CSC @ BUKIT BATOK","91 BUKIT BATOK WEST AVENUE 2, SINGAPORE 659206","Sports & Recreation Centre","Recreation Club",null,2009,"GoldPlus",2023,"GM:2021 In Operation",17734,400,2.2555543024698321E-2,0,"Others","","","",126.82766662907409,17,126.90389308672607,{"$error":"#VALUE!"},142.00603360775909,19]
["SINGAPORE POLO CLUB","80 MOUNT PLEASANT ROAD, SINGAPORE 298334","Sports & Recreation Centre","Recreation Club",null,1982,null,null,null,8514,1352,0.15879727507634483,15,"Others","","","",85.966085271317823,8,117.51254404510219,{"$error":"#VALUE!"},137.6702078928823,18]
["THE CHEVRONS","48 BOON LAY WAY, SINGAPORE 609961","Sports & Recreation Centre","Recreation Club",null,2004,"Platinum",2022,"Existing Non-Residental Buildings ENRB: 2017",18525,12273,0.66251012145748989,0,"Others","",0.72,"2022-12-09",101.37985856950067,14,98.169648043184878,{"$error":"#VALUE!"},132.60323940620782,17]
["SIA GROUP SPORTS CLUB","726, UPPER CHANGI ROAD EAST, SINGAPORE 486046","Sports & Recreation Centre","Recreation Club",null,2005,null,null,null,9610,6000,0.62434963579604574,0,"Others","","","",95.366690946930277,12,101.56932986472425,{"$error":"#VALUE!"},129.89358168574401,16]
["NSRCC KRANJI SANCTUARY GOLF COURSE","50 NEO TIEW LANE 3, SINGAPORE 718828","Sports & Recreation Centre","Recreation Club",null,2003,null,null,null,8679.1,1779,0.20497517023654527,0,"Others","","","",169.91594865827102,25,163.0698459517692,{"$error":"#VALUE!"},127.55876185318753,15]
["CLUB CSC @ TESSENSOHN","60 TESSENSOHN ROAD, SINGAPORE 217664, SINGAPORE 217664","Sports & Recreation Centre","Recreation Club",null,2022,"GoldPlus",2022,"GM:2021 In Operation",15513,182,1.1732095661703088E-2,0,"Others","","","","","","","",117.94760201121639,14]
["TERUSAN RECREATION CENTRE","1 JALAN PAPAN, SINGAPORE 619392","Sports & Recreation Centre","Recreation Club",null,2017,"Certified",2015,"New Building for Non-Residential buildings (version 4.1)",5273,170,3.223971173904798E-2,0,"Others","","","",91.310521524748722,10,96.112727100322402,{"$f":"U1037+1","v":{"$error":"#VALUE!"}},111.16858714204437,13]
["MARINA COUNTRY CLUB","11 NORTHSHORE DRIVE, SINGAPORE 828670","Sports & Recreation Centre","Recreation Club",null,1997,null,null,null,16134,777,4.8159166976571216E-2,0,"Others","","","",104.89269245072518,15,100.0319561175158,{"$error":"#VALUE!"},106.24573075492749,12]
["NTU ONE NORTH","11 SLIM BARRACKS RISE, SINGAPORE 138664, SINGAPORE 138664","Sports & Recreation Centre","Recreation Club",null,2006,null,null,null,15000,12000,0.8,0,"District Cooling System (DCS)","","","",91.463697333333329,11,94.648975333333325,{"$error":"#VALUE!"},96.942488666666677,11]
["TUAS SOUTH RECREATION CENTRE","12 TUAS SOUTH STREET 13, SINGAPORE 636937, SINGAPORE 636937","Sports & Recreation Centre","Recreation Club",null,2015,"Certified",2015,"New Building for Non-Residential buildings (version 4.1)",5648,116,2.0538243626062325E-2,0,"Others","","","",73.421322592067995,7,91.113925283286108,{"$error":"#VALUE!"},95.01811083569406,10]
["TEMASEK CLUB","131\nRIFLE RANGE ROAD, #03-03, SINGAPORE 588406","Sports & Recreation Centre","Recreation Club",null,2015,"Platinum",2022,"GM:2021 In Operation",21188.37,12276,0.57937443984600989,12,"Water Cooled Chilled Water Plant",6,0.51,"2022-08-22",99.725874618953696,13,81.168699621537669,{"$error":"#VALUE!"},84.717880610920048,9]
["ONE15 MARINA CLUB","11 COVE DRIVE, SINGAPORE 098497","Sports & Recreation Centre","Recreation Club",null,2008,null,null,null,141719,6270,4.4242479836860263E-2,26,"Others","","","",43.234793852623852,6,45.733924173893406,{"$error":"#VALUE!"},53.207459832485412,8]
["PALAWAN KIDZ CITY SENTOSA\nSENTOSA DEVELOPMENT CORPORATION","31 BEACH VIEW, SINGAPORE 098008","Sports & Recreation Centre","Recreation Club",null,2015,"Platinum",2018,"Existing Building for Non-Residential buildings (version 3)",12648,12648,1,0,"Water Cooled Chilled Water Plant",8,380,"2023-07-21",89.620207147375069,9,57.625988298545224,{"$error":"#VALUE!"},51.002494465528152,7]
["REPUBLIC OF SINGAPORE YACTH CLUB","52 WEST COAST FERRY ROAD, SINGAPORE 126887","Sports & Recreation Centre","Recreation Club",null,2027,null,null,null,61601,17401,0.28247918053278354,60,"Others","","","","","","","",44.589004236944206,6]
["SINGAPORE YOUTH FLYING CLUB","515 WEST CAMP ROAD, SINGAPORE 797695","Sports & Recreation Centre","Recreation Club",null,2003,null,null,null,8281,2008,0.24248279193334138,0,"Others","","","",32.169291148412029,5,35.62843859437266,{"$f":"U1045+1","v":{"$error":"#VALUE!"}},37.054401642313728,5]
["SAF YACHT CLUB","43 ADMIRALTY ROAD WEST, SINGAPORE 759962","Sports & Recreation Centre","Recreation Club",null,1997,null,null,null,8735,850,9.7309673726388088E-2,3,"Others","","","",20.278763594733828,3,25.228391528334289,{"$f":"U1046+1","v":{"$error":"#VALUE!"}},31.482541499713793,4]
["SARIMBUN SCOUT CAMPSITE","70 JALAN BAHTERA, SINGAPORE 719921","Sports & Recreation Centre","Recreation Club",null,1984,null,null,null,5366,1500,0.27953783078643307,0,"Others","","","",25.409390607528881,4,21.410734252702198,{"$f":"U1047+1","v":{"$error":"#VALUE!"}},21.803950801341781,3]
["ORCHID COUNTRY CLUB","1 ORCHIDCLUB ROAD, SINGAPORE 769162","Sports & Recreation Centre","Recreation Club",null,1993,null,null,null,813841,34800,4.2760195173258658E-2,75,"Water Cooled Chilled Water Plant","","","",10.797344321556668,2,11.971111064691998,{"$f":"U1048+1","v":{"$error":"#VALUE!"}},12.849267854531782,2]
["MANDALA CLUB","31 BUKIT PASOH ROAD, SINGAPORE 089845","Sports & Recreation Centre","Recreation Club",null,0,null,null,null,207221,4,1.9303062913507803E-5,0,"Others","","","",3.1244786966571918,1,4.362397006094942,1,5.1375470150226086,1]
["KEPPEL CLUB","239 SIME ROAD, SINGAPORE 289685","Sports & Recreation Centre","Recreation Club",null,2023,null,null,null,6480,3000,0.46296296296296297,0,"Others","","","","","","","",null,""]
["KENT RIDGE GUILD HOUSE","9 KENT RIDGE DRIVE, SINGAPORE 119241","Sports & Recreation Centre","Recreation Club",null,2008,null,null,null,11769,5489,0.46639476591044271,0,"Others","","","",null,"",null,"",null,""]
["POLICE LOGISTICS BASE","1 HEMMANT ROAD, SINGAPORE 438675","Civic, Community & Cultural Institution","Civic Institution",null,1981,null,null,null,7620,1524,0.2,0,"Others","","","",122.12228346456693,7,806.92083727034128,14,789.48724146981635,16]
["SPEAR BASE","978 UPPER CHANGI ROAD NORTH, SINGAPORE 506977","Civic, Community & Cultural Institution","Civic Institution",null,2005,"Gold",2022,"Existing Non-Residental Buildings ENRB: 2017",6148,3000,0.48796356538711777,0,"Others","","","",228.03637383953469,14,258.9016893229238,13,255.93654497805389,15]
["CLEMENTI POLICE DIVISION HEADQUARTERS","20 CLEMENTI AVENUE 5, SINGAPORE 129858","Civic, Community & Cultural Institution","Civic Institution",null,1989,null,null,null,7860,6360,0.80916030534351147,0,"Others","","","",224.75166412213741,13,216.50946183206108,11,219.10574809160303,14]
["TANGLIN POLICE DIVISIONAL HEADQUARTERS","21 KAMPONG JAVA ROAD, SINGAPORE 228892","Civic, Community & Cultural Institution","Civic Institution",null,2000,"Gold",2022,"Existing Non-Residental Buildings ENRB: 2017",17997,15000,0.83347224537422904,0,"Others","","","",246.6981858087459,15,226.02643496138245,12,203.14485747624605,13]
["AIRPORT POLICE STATION","35 AIRPORT BOULEVARD, SINGAPORE 819645","Civic, Community & Cultural Institution","Civic Institution",null,1999,"Gold",2022,"Existing Non-Residental Buildings ENRB: 2017",9598,5730,0.59699937486976451,0,"Air Cooled Chilled Water Plant","","","",0,"",0,"",196.02646384663473,12]
["ANG MO KIO POLICE DIVISION HEADQUARTERS","51 ANG MO KIO AVENUE 9, SINGAPORE 569784","Civic, Community & Cultural Institution","Civic Institution",null,1986,"Gold",2020,"Existing Non-Residental Buildings ENRB: 2017",8632,8632,1,0,"Others","","","",210.51629054680259,12,196.67252780352177,10,190.95231464318812,11]
["POLICE COAST GUARD HQ & POLCOM BUILDING","11 BRANI WAY, SINGAPORE 098658","Civic, Community & Cultural Institution","Civic Institution",null,2006,"Platinum",2019,"Existing Building for Non-Residential buildings (version 3)",39982,13673,0.34197889050072533,0,"Water Cooled Chilled Water Plant",2,0.62,"2019-08-31",192.52478615376918,11,181.90150567755489,9,177.98808213696162,10]
["BEDOK POLICE DIVISION HEADQUARTERS","30 BEDOK NORTH ROAD, SINGAPORE 469676","Civic, Community & Cultural Institution","Civic Institution",null,1987,"Gold",2022,"Existing Non-Residental Buildings ENRB: 2017",12574,81731,6.5,0,"Others","","","",189.15699061555591,10,165.42613885796086,8,166.90356847463022,9]
["JURONG POLICE DIVISION HEADQUARTERS","2 JURONG WEST AVENUE 5, SINGAPORE 649482","Civic, Community & Cultural Institution","Civic Institution",null,1985,"Platinum",2019,"Existing Building for Non-Residential buildings (version 3)",20488,11088,0.54119484576337373,0,"Air Cooled Chilled Water Plant","","","",148.55225985942991,9,138.38011518937913,7,139.2142815306521,8]
["TRAFFIC POLICE HEADQUARTERS","10 UBI AVENUE 3, SINGAPORE 408865","Civic, Community & Cultural Institution","Civic Institution",null,2020,"Platinum",2019,"Existing Building for Non-Residential buildings (version 3)",19099.72,0,0,0,"Water Cooled Chilled Water Plant",4,"","",135.24257161885095,8,129.92911728548899,6,133.28708483684576,7]
["KALLANG FIRE STATION / HOME TEAM JOINT FACILITY","2 GUILLEMARD CLOSE, SINGAPORE 397623","Civic, Community & Cultural Institution","Civic Institution",null,2019,"Gold",2017,"New Building for Non-Residential buildings (version 4.1)",13973,4312,0.30859514778501396,0,"Others","","","",107.16095326701496,6,103.999499033851,5,97.712016030916772,6]
["POLICE COAST GUARD LOYANG BASE","91 LOYANG WAY, SINGAPORE 508773","Civic, Community & Cultural Institution","Civic Institution",null,2004,null,null,null,7000,3000,0.42857142857142855,0,"Others","","","",80.331161428571434,5,77.755564285714286,4,82.147308571428582,5]
["POLICE COAST GUARD GUL BASE","9 PIONEER PLACE, SINGAPORE 627864","Civic, Community & Cultural Institution","Civic Institution",null,2004,"Gold",2020,"Existing Non-Residental Buildings ENRB: 2017",9500,3500,0.36842105263157893,0,"Others","","","",68.744871578947368,4,62.907974736842107,3,66.994536842105262,4]
["SPECIAL OPERATIONS COMMAND","QUEENSWAY, SINGAPORE 149051","Civic, Community & Cultural Institution","Civic Institution",null,1992,"Gold",2022,"Existing Non-Residental Buildings ENRB: 2017",36664,15000,0.4091206633209688,0,"Others","","","",42.640240290202925,2,37.922335260746237,1,40.661925049094478,3]
["9 VERNON PARK","9 VERNON PARK, SINGAPORE 367828","Civic, Community & Cultural Institution","Civic Institution",null,1995,"Certified",2022,"Existing Non-Residential Buildings (ENRB: 2017)",301318,18965,6.2940149609382781E-2,0,"Others",null,null,null,61.530888463351012,3,38.226491613511307,2,33.966308020098367,2]
["TRAFFIC POLICE (TP-ACCIDENT POUND)","517 AIRPORT ROAD, SINGAPORE 539942","Civic, Community & Cultural Institution","Civic Institution",null,2003,null,null,null,6400,74,1.15625E-2,0,"Others","","","",15.489218749999999,1,0,null,15.346875000000001,1]
["CLUSTER A","982 UPPER CHANGI ROAD NORTH, SINGAPORE 507709","Civic, Community & Cultural Institution","Civic Institution",null,2004,null,null,null,145993,24500,0.16781626516339823,0,"Air Cooled Chilled Water Plant","","","",null,"",null,"",null,""]
["CLUSTER B AND ANNEX BUILDINGS","984 UPPER CHANGI ROAD NORTH, SINGAPORE 506969","Civic, Community & Cultural Institution","Civic Institution",null,2009,null,null,null,150098,35000,0.23318098842089835,0,"Others","","","",null,"",null,"",null,"","Office Building with Non-Typical Activity (e.g. Industrial Function)"]
["PRISON HEADQUARTERS","980 UPPER CHANGI ROAD NORTH, SINGAPORE 507708","Civic, Community & Cultural Institution","Civic Institution",null,2018,null,null,null,25295,20000,0.79067009290373591,0,"Water Cooled Chilled Water Plant",5,0.63,"2022-03-01",null,"",null,"",null,""]
["TM1 & TM2 (CLUSTER C)","10 TANAH MERAH BESAR ROAD, SINGAPORE 498834","Civic, Community & Cultural Institution","Civic Institution",null,1994,"GoldPlus",2018,"Existing Building for Non-Residential buildings (version 3)",55502,12704,0.22889265251702642,0,"Others","","","",null,"",null,"",null,""]
["SELARANG PARK COMPLEX & SPHH","1811 & 1825 UPPER CHANGI ROAD NORTH, SINGAPORE 506909","Civic, Community & Cultural Institution","Civic Institution",null,2021,null,null,null,53488,8787,0.16427983846844152,0,"Water Cooled Chilled Water Plant",3,"","",null,"",null,"",null,""]
["CHUI HUAY LIM CLUB","190 KENG LEE ROAD, SINGAPORE 308409","Civic, Community & Cultural Institution","Community Institution",null,2020,null,null,null,6835,5326,0.77922457937088518,0,"Others","","","",290.04163569861009,38,260.09403072421361,{"$f":"U1073+1","v":{"$error":"#VALUE!"}},333.28968544257498,41]
["TAMPINES WEST COMMUNITY CLUB","5 TAMPINES AVENUE 3 , SINGAPORE 529705, SINGAPORE 529705","Civic, Community & Cultural Institution","Community Institution",null,2013,"Gold",2019,"Existing Building for Non-Residential buildings (version 3)",5200,1200,0.23076923076923078,0,"Others","","","",291.48552115384615,39,292.72612884615387,{"$error":"#VALUE!"},243.30413076923077,40]
["PUNGGOL 21 COMMUNITY CLUB","80 PUNGGOL FIELD, SINGAPORE 828815, SINGAPORE 828815","Civic, Community & Cultural Institution","Community Institution",null,2015,null,null,null,4805,1541,0.32070759625390216,0,"Others","","","",202.31192299687825,36,254.01382101977111,{"$error":"#VALUE!"},242.190901144641,39]
["THE JAPANESE ASSOCIATION, SINGAPORE","120 ADAM ROAD, SINGAPORE 289899","Civic, Community & Cultural Institution","Community Institution",null,1999,null,null,null,7825,7000,0.89456869009584661,0,"Others","","","",236.27156549520768,37,231.28686900958468,{"$error":"#VALUE!"},230.02207667731631,38]
["KEAT HONG COMMUNITY CLUB","2 CHOA CHU KANG LOOP, #01-01, SINGAPORE 689687","Civic, Community & Cultural Institution","Community Institution",null,2016,"Platinum",2016,"New Building for Non-Residential buildings (version 4.1)",8806,5846,0.66386554621848737,0,"Water Cooled Chilled Water Plant",2016,0.6,"2022-01-26",171.78420735861911,33,209.34424483306836,{"$error":"#VALUE!"},220.00632863956392,37]
["LIGHTHOUSE SCHOOL","51 TOA PAYOH RISE, SINGAPORE 298106","Civic, Community & Cultural Institution","Community Institution",null,1956,null,null,null,619,264,0.42649434571890144,0,"Others","","","",159.86752827140549,30,152.52665589660742,{"$error":"#VALUE!"},195.46042003231017,36]
["YOUNG WOMAN CHRISTIAN ASSOCIATION HOSTELS","6 FORT CANNING ROAD, SINGAPORE 179494","Civic, Community & Cultural Institution","Community Institution",null,2000,null,null,null,14576,11809,0.81016739846322727,175,"Water Cooled Chilled Water Plant",13,0.9,"2023-02-20",170.93314215148189,32,173.12106750823273,{"$error":"#VALUE!"},188.08912047200877,35]
["HEARTBEAT@BEDOK","11 BEDOK NORTH STREET 1, SINGAPORE 469662","Civic, Community & Cultural Institution","Community Institution",null,2017,"Platinum",2022,"Existing Non-Residental Buildings ENRB: 2017",42842,16397,0.38273189860417345,0,"Water Cooled Chilled Water Plant",6,0.56999999999999995,"2021-05-14",175.74971406563651,34,175.06297325054851,{"$error":"#VALUE!"},177.13129265673871,34]
["SENGKANG COMMUNITY HUB","2 SENGKANG SQUARE, SINGAPORE 545025, SINGAPORE 545025","Civic, Community & Cultural Institution","Community Institution",null,2004,null,null,null,11472,9089,0.79227684797768483,0,"Others","","","",163.32194735006973,31,178.84238319386333,{"$error":"#VALUE!"},163.68913354253834,33]
["CI YUAN COMMUNITY CLUB","51 HOUGANG AVE 9, SINGAPORE 538776","Civic, Community & Cultural Institution","Community Institution",null,2015,null,null,null,10928,4828,0.44180087847730598,0,"Others","","","",179.90157576866767,35,182.9869875549048,{"$error":"#VALUE!"},153.17190336749636,32]
["WOODLANDS GALAXY CC","31 WOODLANDS AVE 6, SINGAPORE 738991","Civic, Community & Cultural Institution","Community Institution",null,2012,null,null,null,4175,2922,0.69988023952095813,0,"Others","","","",111.1139616766467,25,182.49888383233531,{"$error":"#VALUE!"},148.11866107784431,31]
["ZHENGHUA COMMUNITY CLUB","1 SEGAR ROAD, SINGAPORE 677738","Civic, Community & Cultural Institution","Community Institution",null,2005,"Gold",2022,"Existing Non-Residental Buildings ENRB: 2017",5584,0,0,0,"Others","","","",141.80571633237821,29,135.29545666189111,{"$error":"#VALUE!"},144.2677829512894,30]
["DEVAN NAIR INSTITITE FOR EMPLOYMENT AND EMPLOYABILITY","80 JURONG EAST ST 21 #07-03, SINGAPORE 609607","Civic, Community & Cultural Institution","Community Institution",null,2013,"Platinum",2022,"Existing Non-Residential Buildings (RECERT 2017)",27065,20238,0.74775540365786075,0,"Water Cooled Chilled Water Plant",10,0.65,"2022-11-14",130.62438573803806,28,128.50260484019952,{"$error":"#VALUE!"},138.01189728431552,29]
["SREE NARAYANA MISSION (SINGAPORE)","12 YISHUN AVE 5, SINGAPORE 768992, SINGAPORE 768992","Civic, Community & Cultural Institution","Community Institution",null,1993,null,null,null,6793,462,6.8011187987634336E-2,0,"Others","","","",119.11955689680553,26,123.09722508464596,{"$error":"#VALUE!"},127.62113940821435,28]
["BISHAN COMMUNITY CLUB","51 BISHAN STREET 13, SINGAPORE 579799","Civic, Community & Cultural Institution","Community Institution",null,1995,null,null,null,7636,3818,0.5,0,"Others","","","",91.84903221581979,21,112.14428103719224,{"$error":"#VALUE!"},115.35770298585648,27]
["YMCA","1 ORCHARD ROAD, SINGAPORE 238824","Civic, Community & Cultural Institution","Community Institution",null,1987,"GoldPlus",2017,"Existing Building for Non-Residential buildings (version 3)",8710,7867,0.90321469575200919,110,"Water Cooled Chilled Water Plant",8,0.67,"2021-09-21",105.23979793340986,24,106.72516188289323,{"$error":"#VALUE!"},110.69347416762342,26]
["SINGAPORE TURF CLUB","1 TURF CLUB AVE 738078, SINGAPORE 738078","Civic, Community & Cultural Institution","Community Institution",null,1999,null,null,null,210427,559390,2.6583565797164814,0,"Water Cooled Chilled Water Plant",8,"","",121.79147162673992,27,101.67056508908077,{"$error":"#VALUE!"},97.897703241504175,25]
["SINGAPORE MANUFACTURING FEDERATION BUILDING","2985 JALAN BUKIT MERAH, SINGAPORE 159457","Civic, Community & Cultural Institution","Community Institution",null,1978,null,null,null,7018,7250,1.0330578512396693,0,"Others","","","",98.646694214876035,23,92.890125391849537,{"$error":"#VALUE!"},97.520205186662878,24]
["THK HOME FOR DISABLED @ SEMBAWANG","7 SEMBAWANG WALK, SINGAPORE 756977","Civic, Community & Cultural Institution","Community Institution",null,2017,null,null,null,6013,1753,0.29153500748378514,0,"Others","","","",91.125421586562453,20,92.995409945118908,{"$error":"#VALUE!"},97.285305172127067,23]
["WISMA GEYLANG SERAI","1 ENGKU AMAN TURN, SINGAPORE 408528","Civic, Community & Cultural Institution","Community Institution",null,2018,"Platinum",2022,"New Building for Non-Residential buildings (version 4.1)",16644,7440,0.44700793078586876,0,"Water Cooled Chilled Water Plant",5,0.64800000000000002,"2022-11-16",97.925179043499156,22,103.29102679644315,{"$error":"#VALUE!"},87.312891131939438,22]
["ULU PANDAN COMMUNITY CLUB","170, GHIM MOH ROAD, SINGAPORE 279621","Civic, Community & Cultural Institution","Community Institution",null,45070,"GoldPlus",2022,"Existing Non-Residental Buildings ENRB: 2017",14956,4998,0.33418026210216634,0,"Others","","","","","","","",81.201244316662212,21]
["MWS CHRISTALITE METHODIST HOME","51 MARSILING DRIVE, SINGAPORE 739297","Civic, Community & Cultural Institution","Community Institution",null,1995,null,null,null,5709,552,9.6689437729900157E-2,0,"Others","","","",80.303293046067608,19,83.990117358556674,{"$f":"U1094+1","v":{"$error":"#VALUE!"}},80.89845857418112,20]
["JAMIYAH HOME FOR THE AGED","1 TAMPINES AVE 3, SINGAPORE 529707","Civic, Community & Cultural Institution","Community Institution",null,1996,null,null,null,5797,783,0.13506986372261515,0,"Others","","","",66.211333448335338,14,65.274219423839924,{"$error":"#VALUE!"},76.617336553389691,19]
["BUKIT BATOK HOME FOR THE AGED","11 BUKIT BATOK WEST AVE 2, SINGAPORE 659205","Civic, Community & Cultural Institution","Community Institution",null,1995,null,null,null,6199,355,5.7267301177609295E-2,0,"Others","","","",72.525407323761897,17,75.332311663171481,{"$error":"#VALUE!"},73.619132118083556,18]
["THE SALVATION ARMY TERRITORIAL HEADQUARTER","20 BISHAN STREET 22, SINGAPORE 579768","Civic, Community & Cultural Institution","Community Institution",null,1994,null,null,null,6848,4782,0.69830607476635509,0,"Others","","","",78.317610981308405,18,71.816223714953267,{"$error":"#VALUE!"},69.932523364485974,17]
["THE SALVATION ARMY PRAISEHAVEN","500 BUKIT TIMAH ROAD , SINGAPORE 678106, SINGAPORE 678106","Civic, Community & Cultural Institution","Community Institution",null,2002,null,null,null,10771,9256,0.85934453625475815,0,"Others","","","",71.460072416674393,15,75.90808838547953,{"$error":"#VALUE!"},68.705893603193772,16]
["TIONG BAHRU CC","67A EU CHIN STREET, SINGAPORE 169715","Civic, Community & Cultural Institution","Community Institution",null,2017,null,null,null,4249,3000,0.70604848199576375,0,"Water-Cooled Package Units",null,4,"2023-06-01",57.552843021887504,11,68.481315603671447,{"$error":"#VALUE!"},67.84974817604143,15]
["FU HUI LINK","19 COMPASSVALE WALK, SINGAPORE 544644","Civic, Community & Cultural Institution","Community Institution",null,2016,null,null,null,14450,10000,0.69204152249134943,0,"Others","","","",72.071195847750872,16,70.317368858131488,{"$error":"#VALUE!"},66.179325259515565,14]
["PELANGI VILLAGE","2 BUANGKOK GREEN, SINGAPORE 539749","Civic, Community & Cultural Institution","Community Institution",null,2001,null,null,null,6235,496,7.9550922213311948E-2,0,"Others","","","",62.229776037756082,12,62.733782044406304,{"$error":"#VALUE!"},63.40927598412528,13]
["SINGAPORE ASSOCIATION OF THE VISUALLY HANDICAPPED","47 TOA PAYOH RISE, SINGAPORE 298104","Civic, Community & Cultural Institution","Community Institution",null,1975,null,null,null,942,654,0.69426751592356684,0,"Others","","","",65.976847133757971,13,63.448651804670909,{"$error":"#VALUE!"},63.26674097664543,12]
["SPD ABILITY CENTRE","2 PENG NGUAN STREET, SINGAPORE 168955","Civic, Community & Cultural Institution","Community Institution",null,1994,null,null,null,8393,2856,0.3402835696413678,0,"Others","","","",56.312519957107114,10,62.282656976051477,{"$error":"#VALUE!"},59.60329560347909,11]
["ACACIA WELFARE HOME","30 ADMIRALTY STREET, SINGAPORE 757441","Civic, Community & Cultural Institution","Community Institution",null,2016,"GoldPlus",2020,"New Building for Non-Residential buildings (version 4.1)",8294,280,3.3759344104171689E-2,0,"Others","","","",48.803954666023628,8,53.642392090667954,{"$error":"#VALUE!"},53.033518205931998,10]
["GRACEHAVEN","3 LORONG NAPIRI, SINGAPORE 547528","Civic, Community & Cultural Institution","Community Institution",null,1990,null,null,null,6533,162,2.4797183529771928E-2,0,"Others","","","",42.042190417878466,6,48.986866676871273,{"$error":"#VALUE!"},51.876118169294351,9]
["ANGLICAN CARE CENTRE (SIMEI)","10 SIMEI STREET 3, SINGAPORE 529897","Civic, Community & Cultural Institution","Community Institution",null,2004,null,null,null,9132,4000,0.43802014892685065,0,"Others","","","",55.125279237844943,9,54.464142575558476,{"$error":"#VALUE!"},50.906865965834427,8]
["HOME @ HONG SAN","28 HONG SAN TERRACE, SINGAPORE 688247","Civic, Community & Cultural Institution","Community Institution",null,2006,"GoldPlus",2019,"Existing Building for Non-Residential buildings (version 3)",5095,915,0.17958783120706576,0,"Others","","","",46.753373895976445,7,47.357872423945039,{"$error":"#VALUE!"},48.579163886162902,7]
["ONE PUNGGOL","1 PUNGGOL DR., SINGAPORE 828629","Civic, Community & Cultural Institution","Community Institution",null,2022,null,null,null,45473,27900,0.61355089833527587,0,"Water Cooled Chilled Water Plant",1,"","","","","","",41.036923009258238,6]
["ST. ANDREW'S ADULT HOME (SENGKANG)","147 COMPASSVALE BOW, SINGAPORE 544691","Civic, Community & Cultural Institution","Community Institution",null,2018,"GoldPlus",2023,"GM:2021 In Operation",11201,2697,0.24078207302919383,0,"Others","","","",35.770874029104547,5,37.781594500491032,{"$f":"U1109+1","v":{"$error":"#VALUE!"}},38.971754307651103,5]
["SINGAPORE ASSOCIATION OF THE VISUALLY HANDICAPPED","49 TOA PAYOH RISE, SINGAPORE 298105","Civic, Community & Cultural Institution","Community Institution",null,1964,null,null,null,1584,623,0.39330808080808083,0,"Others","","","",31.24558080808081,4,33.294823232323232,{"$f":"U1110+1","v":{"$error":"#VALUE!"}},34.650252525252526,4]
["GOOD SHEPHERD PLACE","9 LORONG 8 TOA PAYOH, SINGAPORE 319253","Civic, Community & Cultural Institution","Community Institution",null,2014,null,null,null,9062,1916,0.21143235488854559,0,"Others","","","",21.637607592143016,3,22.185499889649083,{"$f":"U1111+1","v":{"$error":"#VALUE!"}},21.975281394835577,3]
["SINGAPORE BUDDHIST WELFARE SERVICES","105 PUNGGOL ROAD, SINGAPORE 546636","Civic, Community & Cultural Institution","Community Institution",null,1991,null,null,null,9998,0,0,0,"Others","","","",21.469998999799959,2,20.621542308461692,{"$f":"U1112+1","v":{"$error":"#VALUE!"}},21.933539707941588,2]
["TRUSTEES OF THE RAMAKRISHNA MISSION","179 BARTLEY ROAD, SINGAPORE 539784","Civic, Community & Cultural Institution","Community Institution",null,1900,null,null,null,66676,700,1.0498530205771192E-2,0,"Others","","","",3.0512478253044573,1,3.1365858779770832,1,2.9064430979662847,1]
["PELANGI VILLAGE","14 BUANGKOK GREEN, SINGAPORE 539755","Civic, Community & Cultural Institution","Community Institution",null,2001,null,null,null,6762,336,4.9689440993788817E-2,0,"Others","","","",null,"",null,"",null,""]
["PELANGI VILLAGE","12 BUANGKOK GREEN, SINGAPORE 539754","Civic, Community & Cultural Institution","Community Institution",null,2001,null,null,null,6796,343,5.0470865214832253E-2,0,"Others","","","",null,"",null,"",null,""]
["PELANGI VILLAGE","10 BUANGKOK GREEN, SINGAPORE 539753","Civic, Community & Cultural Institution","Community Institution",null,2001,null,null,null,6891,308,4.469598026411261E-2,0,"Others","","","",null,"",null,"",null,""]
["PELANGI VILLAGE","8 BUANGKOK GREEN, SINGAPORE 539752","Civic, Community & Cultural Institution","Community Institution",null,2001,null,null,null,6726,823,0.12236098721379721,0,"Others","","","",null,"",null,"",null,""]
["PELANGI VILLAGE","6 BUANGKOK GREEN, SINGAPORE 539751","Civic, Community & Cultural Institution","Community Institution",null,2001,null,null,null,6520,275,4.2177914110429447E-2,0,"Others","","","",null,"",null,"",null,""]
["PELANGI VILLAGE","4 BUANGKOK GREEN, SINGAPORE 539750","Civic, Community & Cultural Institution","Community Institution",null,2001,null,null,null,6685,342,5.1159311892296187E-2,0,"Others","","","",null,"",null,"",null,""]
["NATIONAL MUSEUM OF SINGAPORE","93 STAMFORD ROAD, SINGAPORE 178897","Civic, Community & Cultural Institution","Cultural Institution",null,2006,"GoldPlus",2020,"Existing Building for Non-Residential buildings (version 3)",20121,15931,0.79175985289001538,0,"Water Cooled Chilled Water Plant",2021,0.57799999999999996,"2022-08-21",423.10992495402814,7,397.47198946374436,7,307.18916554843202,7]
["ASIAN CIVILISATIONS MUSEUM","EMPRESS PLACE, SINGAPORE 179555","Civic, Community & Cultural Institution","Cultural Institution",null,2000,"GoldPlus",2020,"Existing Building for Non-Residential buildings (version 3)",16448.45,898097,54.600707057503897,0,"Water Cooled Chilled Water Plant","",0.71,"2022-08-07",199.16173013262645,5,221.50678270596927,5,233.28891415300529,6]
["VICTORIA THEATRE","9 EMPRESS PLACE, SINGAPORE 179556, SINGAPORE 179556","Civic, Community & Cultural Institution","Cultural Institution",null,2014,null,null,null,13869,10000,0.72103251856658734,0,"Water Cooled Chilled Water Plant",4,null,null,164.41340255245512,4,185.24333693849593,4,192.97966399884635,5]
["HERITAGE CONSERVATION CENTRE","32 JURONG PORT ROAD, SINGAPORE 619104","Civic, Community & Cultural Institution","Cultural Institution",null,2010,"Platinum",2019,"Existing Building for Non-Residential buildings (version 3)",20940,19384,0.92569245463228267,0,"Air Cooled Chilled Water Plant","",1.21,"2016-01-21",313.81,6,292.48766475644697,6,187.75458452722063,4]
["SINGAPORE CONFERENCE HALL","7, SHENTON WAY, SINGAPORE 068810","Civic, Community & Cultural Institution","Cultural Institution",null,2001,null,null,null,10349,9700,0.93728862692047543,0,"Air Cooled Chilled Water Plant","",1.07,"2022-06-22",117.74735336747513,2,138.15910522755823,2,140.67499468547686,3]
["NATIONAL GALLERY SINGAPORE","1 ST. ANDREWS ROAD, SINGAPORE 178957, SINGAPORE 178957","Civic, Community & Cultural Institution","Cultural Institution",null,2015,"GoldPlus",2022,"GM:2021 In Operation",64469,60980,0.94588096604569638,0,"Water Cooled Chilled Water Plant",8,0.64300000000000002,"2022-08-04",156.73083575051575,3,165.01379732894878,3,110.38132280631001,2]
["SINGAPORE CHINESE CULTURAL CENTRE","1 STRAITS BOULEVARD, SINGAPORE 018906","Civic, Community & Cultural Institution","Cultural Institution",null,2016,"Platinum",2021,"New Building for Non-Residential buildings (version 4.1)",15123,9342,0.61773457647292207,0,"District Cooling System (DCS)","","","",68.794354294782778,1,78.089942471731803,1,88.546982080275072,1]
[]
["note: includes buildings without completed submissions in 2022, buildings without EUI or EUI Quartile/Ranking are buildings that were not benchmarked, or EUI which was combined under the main building"]

{"sheet":"Commercial Buildings","index":3,"n_rows":760,"n_cols":24,"rows_kept":760,"cut":false,"hidden":false,"merged":[]}
["Building Name","Address","Building Type","Main Function","Building Size","2020 EUI","2020 EUI Quartile/ Energy Ranking","2021 EUI","2021 EUI Quartile/ Energy Ranking","2022 EUI","2022 EUI Quartile/ Energy Ranking","TOP/CSC Year","Award (Green/Non-Green)","Year of GM Award","Green Mark Version","GFA","AC Area","AC Area Percentage","No. Of Hotel Room","AC Type","Age  of Chiller","Air-con system efficiency (kW/RT)","Date of Last Audit/Health Check","Reason for High EUI (if any)"]
["EQUINIX SG3 DATA CENTRE","26A AYER RAJAH CRESCENT, SINGAPORE 139963","Commercial Building","Office","Large",3724.675904367085,{"$f":"IFERROR(IF(F2<=VLOOKUP($D2&$E2,Benchmarks!$S$14:$V$19,2,FALSE),\"Top Quartile\",IF(F2<=VLOOKUP($D2&$E2,Benchmarks!$S$14:$V$19,3,FALSE),\"2nd Quartile\",IF(F2<=VLOOKUP($D2&$E2,Benchmarks!$S$14:$V$19,4,FALSE),\"3rd Quartile\",IF(F2>VLOOKUP($D2&$E2,Benchmarks!$S$14:$V$19,4,FALSE),\"Bottom Quartile\",\"\")))),\"\")","v":"Bottom Quartile"},4453.2057754557327,{"$f":"IFERROR(IF(H2<=VLOOKUP($D2&$E2,Benchmarks!$K$14:$N$19,2,FALSE),\"Top Quartile\",IF(H2<=VLOOKUP($D2&$E2,Benchmarks!$K$14:$N$19,3,FALSE),\"2nd Quartile\",IF(H2<=VLOOKUP($D2&$E2,Benchmarks!$K$14:$N$19,4,FALSE),\"3rd Quartile\",IF(H2>VLOOKUP($D2&$E2,Benchmarks!$K$14:$N$19,4,FALSE),\"Bottom Quartile\",\"\")))),\"\")","v":"Bottom Quartile"},4579.5895280822306,{"$f":"IFERROR(IF(J2<=VLOOKUP($D2&$E2,Benchmarks!$C$14:$F$19,2,FALSE),\"Top Quartile\",IF(J2<=VLOOKUP($D2&$E2,Benchmarks!$C$14:$F$19,3,FALSE),\"2nd Quartile\",IF(J2<=VLOOKUP($D2&$E2,Benchmarks!$C$14:$F$19,4,FALSE),\"3rd Quartile\",IF(J2>VLOOKUP($D2&$E2,Benchmarks!$C$14:$F$19,4,FALSE),\"Bottom Quartile\",\"\")))),\"\")","v":"Bottom Quartile"},2015,"Platinum",2022,"Existing Data Centres",35218,28536,0.81026747685842471,0,"Water Cooled Chilled Water Plant",7,0.74399999999999999,"2023-05-03","Office Building with Non-Typical Activity (e.g. Industrial Function)"]
["BLK 20 ARC","BLK 20 AYER RAJAH CRESCENT, SINGAPORE 139964","Commercial Building","Office","Large",2043.5498938694616,"Bottom Quartile",2213.9957524316151,"Bottom Quartile",2305.2968651073043,"Bottom Quartile",1999,null,null,null,38349,20000,0.52152598503220426,0,"Water Cooled Chilled Water Plant",20,"","","Office Building with Non-Typical Activity (e.g. Industrial Function)"]
["SYNTHESIS","6 FUSIONOPOLIS WAY, SINGAPORE 138636","Commercial Building","Office","Large",1157.4027538726334,"Bottom Quartile",1182.1218119230168,"Bottom Quartile",1150.5562900954467,"Bottom Quartile",2014,"Platinum",2020,"New Building for Non-Residential buildings (version 3)",19173,19173,1,0,"Water Cooled Chilled Water Plant",5,0.57799999999999996,"2023-02-20","Office Building with Non-Typical Activity (e.g. Industrial Function)"]
["DSO NATIONAL LABORATORIES","20 SCIENCE PARK DRIVE, SINGAPORE 118230","Commercial Building","Office","Large",553.08993434023853,"Bottom Quartile",660.88190282456446,"Bottom Quartile",805.35280032213552,"Bottom Quartile",1986,null,null,null,15819.43,12724,0.80432733669923628,0,"Water Cooled Chilled Water Plant","","",""]
["UOB ALEXANDRA BUILDING","396 ALEXANDRA ROAD, SINGAPORE 119954","Commercial Building","Office","Large",712.94639633726081,"Bottom Quartile",712.22323935803604,"Bottom Quartile",723.91930322622989,"Bottom Quartile",1995,"GoldPlus",2022,"Existing Building for Non-Residential buildings (version 3)",30469,22476,0.73766779349502776,0,"Water Cooled Chilled Water Plant",8,0.58199999999999996,"2021-10-01","Office Building with Non-Typical Activity (e.g. Industrial Function)"]
["TELEPARK","5 TAMPINES CENTRAL 6, SINGAPORE 529482","Commercial Building","Office","Large",790.92122903236157,"Bottom Quartile",753.6836332146637,"Bottom Quartile",695.23615253856758,"Bottom Quartile",1995,null,null,null,31179,21500,0.68956669553224925,0,"Water Cooled Chilled Water Plant",27,"","","Office Building with Non-Typical Activity (e.g. Industrial Function)"]
["HELIOS","11 BIOPOLIS WAY, SINGAPORE 138667","Commercial Building","Office","Large",641.82718985578492,null,649.48149154843838,null,658.71549696820716,null,2008,"GoldPlus",2016,"Existing Building for Non-Residential buildings (version 3)",36007,25895,0.71916571777709892,0,"District Cooling System (DCS)","",0.05,"2010-08-01"]
["THE KENDALL","50 SCIENCE PARK ROAD, SINGAPORE 117406","Commercial Building","Office","Large",566.20564635958397,"Bottom Quartile",529.39249678058445,"Bottom Quartile",568.24349925705792,"Bottom Quartile",2011,"Certified",2021,"Existing Non-Residental Buildings ENRB: 2017",20190,16870,0.83556215948489354,0,"Water Cooled Chilled Water Plant",12,"","","Office Building with Non-Typical Activity (e.g. Industrial Function)"]
["XILINX ASIA PACIFIC PTE LTD","XILINX ASIA PACIFIC PTE LTD, 5 CHANGI BUSINESS PARK VISTA, SINGAPORE 486040","Commercial Building","Office","Large",495.96940928270044,null,521.52153353702897,null,522.81229109074161,null,2007,"Platinum",2007,"New Building (version 1)",20619,13947,0.67641495707842281,0,"District Cooling System (DCS)","","",""]
["INNOVIS","2 FUSIONOPOLIS WAY, SINGAPORE 138634","Commercial Building","Office","Large",503.36340324812454,"Bottom Quartile",491.18200640885578,"Bottom Quartile",494.47539994659286,"Bottom Quartile",2014,"Gold",2023,"GM:2021 In Operation",41193,30413,0.73830505182919426,0,"Water Cooled Chilled Water Plant",5,0.57799999999999996,"2023-02-20"]
["ESR BIZPARK@CHAI CHEE","750 CHAI CHEE ROAD, SINGAPORE 469000","Commercial Building","Office","Large",520.52023907050852,"Bottom Quartile",360.17597344914378,"Bottom Quartile",490.10717676835333,"Bottom Quartile",2017,null,null,null,141841,105166,0.74143583308070304,0,"Water Cooled Chilled Water Plant",2,0.62,"2017-03-01"]
["HEALTH PROMOTION BOARD","3 SECOND HOSPITAL AVENUE, SINGAPORE 168937","Commercial Building","Office","Large",148.40478104255968,"2nd Quartile",507.23150573289621,"Bottom Quartile",483.30921556062935,"Bottom Quartile",1996,"Platinum",2020,"Existing Building for Non-Residential buildings (version 2.1)",32147.8,23595,0.73395380088217543,0,"Water Cooled Chilled Water Plant",9,0.65,"2020-01-06"]
["SEAGATE SINGAPORE DESIGN CENTER - THE SHUGART","26 AYER RAJAH CRESCENT, SINGAPORE 139944","Commercial Building","Office","Large",492.7328033268102,null,482.50437866927592,null,456.91308708414874,null,2014,"Platinum",2015,"New Building for Non-Residential buildings (version 4.1)",40880,35333,0.86431017612524463,0,"District Cooling System (DCS)","","",""]
["HEALTH SCIENCES AUTHORITY","11 OUTRAM ROAD, SINGAPORE 169078","Commercial Building","Office","Large",447.36173802360565,"Bottom Quartile",458.8381526267068,"Bottom Quartile",438.14511918537374,"Bottom Quartile",1988,"Platinum",2022,"Existing Non-Residential Buildings (RECERT 2017)",17284,15751,0.91130525341356172,0,"Water Cooled Chilled Water Plant",3,0.58399999999999996,"2022-06-03","Office Building with Non-Typical Activity (e.g. Industrial Function)"]
["BANK OF AMERICA HARBOURFRONT","2 HARBOURFRONT PLACE, SINGAPORE 098499, SINGAPORE 098499","Commercial Building","Office","Large",348.74354333142026,"Bottom Quartile",397.75692022427268,"Bottom Quartile",435.14052359719216,"Bottom Quartile",2008,"GoldPlus",2021,"Existing Building for Non-Residential buildings (version 3)",22651,21106,0.93179109090106393,0,"Water Cooled Chilled Water Plant",13,0.64,"2020-09-30","Office Building with Non-Typical Activity (e.g. Industrial Function)"]
["NEUROS","8 BIOMEDICAL GROVE, SINGAPORE 138665, SINGAPORE 138665","Commercial Building","Office","Large",413.49142391182096,null,411.26377797773029,null,423.68774603531659,null,2006,"Gold",2023,"GM:2021 In Operation",12960,10000,0.77160493827160492,0,"District Cooling System (DCS)","","",""]
["VALLEY POINT","491 RIVER VALLEY ROAD, SINGAPORE 248371","Commercial Building","Office","Large",384.91865086875873,"Bottom Quartile",399.58861339289098,"Bottom Quartile",407.07956240299808,"Bottom Quartile",1998,"Gold",2022,"GM:2021 In Operation",26417,22930,0.86800166559412495,0,"Others","",0.76,"2022-06-06"]
["RAFFLES CITY TOWER","252 NORTH BRIDGE ROAD, SINGAPORE 179103","Commercial Building","Office","Large",378.49213840641107,"Bottom Quartile",390.53270405281364,"Bottom Quartile",397.20681529337003,"Bottom Quartile",1986,"GoldPlus",2020,"Existing Building for Non-Residential buildings (version 2.1)",44934,41000,0.91244937018738592,0,"Water Cooled Chilled Water Plant","","",""]
["SHAW CENTRE","1 SCOTTS ROAD, SINGAPORE 228208","Commercial Building","Office","Large",317.63807127677762,"Bottom Quartile",327.99785046044116,"Bottom Quartile",371.05205305454456,"Bottom Quartile",1975,"Gold",2021,"Existing Building for Non-Residential buildings (version 3)",40939,35950,0.87813576296441043,0,"Water Cooled Chilled Water Plant",10,0.65,"2021-07-02"]
["UE SQUARE","83 CLEMENCEAU AVENUE, SINGAPORE 239920","Commercial Building","Office","Large",451.93334837222909,"Bottom Quartile",422.77255866792171,"Bottom Quartile",355.66723489889318,"Bottom Quartile",1995,null,null,null,30809,29361,0.95300074653510336,180,"Water Cooled Chilled Water Plant",17,"",""]
["WESTGATE TOWER","1 GATEWAY DRIVE, #01-51 WESTGATE TOWER, SINGAPORE 608531","Commercial Building","Office","Large",289.32588839504075,"Bottom Quartile",303.54432937073346,"Bottom Quartile",327.36448121132213,"Bottom Quartile",2014,"Platinum",2018,"New Building for Non-Residential buildings (version 4.1)",38868,32602,0.83878769167438505,0,"Water Cooled Chilled Water Plant",8,0.47199999999999998,"2022-01-27"]
["THE GEMINI","41 SCIENCE PARK ROAD, SINGAPORE 117610","Commercial Building","Office","Large",271.42636246323752,"Bottom Quartile",298.64363423564009,"Bottom Quartile",315.31023918132161,"Bottom Quartile",1998,"Gold",2022,"GM:2021 In Operation",33322,11653,0.34970890102634894,0,"Others","",0.21540000000000001,"2022-12-01","Office Building with Non-Typical Activity (e.g. Industrial Function)"]
["P&G SINGAPORE INNOVATION CENTRE","70 BIOPOLIS STREET , SINGAPORE 138547","Commercial Building","Office","Large",296.43049082088845,null,309.63121849139162,null,311.01983258822412,null,2012,"GoldPlus",2022,"Existing Non-Residental Buildings ENRB: 2017",31539,28385,0.8999968293224262,0,"District Cooling System (DCS)","","",""]
["BANK OF SINGAPORE CENTRE","63 MARKET STREET, SINGAPORE 048942","Commercial Building","Office","Large",377.95256908344732,"Bottom Quartile",343.66616689466485,"Bottom Quartile",303.53361422708616,"Bottom Quartile",2000,"Certified",2021,"Existing Non-Residental Buildings ENRB: 2017",18275,18074,0.98900136798905613,0,"Others","",0.81,"2022-08-31"]
["NEW PHOENIX PARK","28 IRRAWADDY ROAD, SINGAPORE 329560","Commercial Building","Office","Large",319.10667971864245,"Bottom Quartile",304.78687267259386,"Bottom Quartile",302.92237438314277,"Bottom Quartile",2001,"Platinum",2019,"Existing Non-Residental Buildings ENRB: 2017",99091,77451,0.78161487925240436,0,"Water Cooled Chilled Water Plant",16,"","","Office Building with Non-Typical Activity (e.g. Industrial Function)"]
["BANK OF CHINA BUILDING","4 BATTERY ROAD, SINGAPORE 049908","Commercial Building","Office","Large",301.97509043927653,"Bottom Quartile",295.50542635658917,"Bottom Quartile",300.88201550387595,"Bottom Quartile",1953,null,null,null,15480,15480,1,0,"Others","","",""]
["INFINITE STUDIOS","21 MEDIA CIRCLE, SINGAPORE 138562","Commercial Building","Office","Large",297.46145772310098,"Bottom Quartile",294.98093634055846,"Bottom Quartile",300.8384348760008,"Bottom Quartile",2014,"GoldPlus",2022,"Existing Non-Residential Buildings (RECERT 2017)",20484,18058,0.88156610037102123,0,"Water Cooled Chilled Water Plant",9,0.64,"2023-07-15"]
["DBS ASIA HUB","2 CHANGI BUSINESS PARK CRESCENT, SINGAPORE 486029, SINGAPORE 486029","Commercial Building","Office","Large",298.50928457213598,null,283.21442203538453,null,299.36323309434158,null,2008,"Platinum",2018,"Existing Building for Non-Residential buildings (version 3)",38774,34511,0.89005519162325275,0,"District Cooling System (DCS)","","",""]
["PARKWAY PARADE","80 MARINE PARADE ROAD, #08-02 PARKWAY PARADE, SINGAPORE 449269, SINGAPORE 449269","Commercial Building","Office","Large",260.69736778782737,"Bottom Quartile",300.70776935822613,"Bottom Quartile",298.99086456365501,"Bottom Quartile",1983,"Platinum",2022,"Existing Non-Residential Buildings (RECERT 2017)",94753,94753,1,0,"Water Cooled Chilled Water Plant",10,0.63100000000000001,"2022-10-10"]
["KINESIS","4 FUSIONOPOLIS WAY, SINGAPORE 138635","Commercial Building","Office","Large",290.5293853213779,"Bottom Quartile",299.40596443558854,"Bottom Quartile",298.63147359840599,"Bottom Quartile",2014,"Platinum",2020,"New Building for Non-Residential buildings (version 3)",33123,26327,0.79482534794553639,0,"Water Cooled Chilled Water Plant",5,0.57799999999999996,"2023-02-20"]
["OUE BAYFRONT","50 COLLYER QUAY, SINGAPORE 049321","Commercial Building","Office","Large",271.51940667490732,"Bottom Quartile",276.22927070457354,"Bottom Quartile",293.94932014833125,"Bottom Quartile",2011,"Gold",2022,"Existing Building for Non-Residential buildings (version 2.1)",38624,38624,1,0,"Water Cooled Chilled Water Plant",11,0.81599999999999995,"2021-12-20"]
["NOVENA SQUARE","238 THOMSON ROAD, SINGAPORE 307683","Commercial Building","Office","Large",293.10204014999215,"Bottom Quartile",284.14535851262531,"Bottom Quartile",289.08467713189901,"Bottom Quartile",2000,"GoldPlus",2022,"Existing Non-Residential Buildings (RECERT 2017)",22349,18949,0.84786791355317914,0,"Water Cooled Chilled Water Plant",2018,0.65,"2021-11-10"]
["CLEANTECH ONE","1 CLEANTECH LOOP, SINGAPORE 637141","Commercial Building","Office","Large",289.62226840277771,"Bottom Quartile",298.30469027777781,"Bottom Quartile",288.91996736111111,"Bottom Quartile",2012,"Platinum",2021,"New Building for Non-Residential buildings (version 3)",28800,20897,0.72559027777777774,0,"Water Cooled Chilled Water Plant",11,"","","Office Building with Non-Typical Activity (e.g. Industrial Function)"]
["ICA BUILDING","10 KALLANG ROAD, SINGAPORE 208718","Commercial Building","Office","Large",351.00491891891892,"Bottom Quartile",307.06140540540542,"Bottom Quartile",288.80886486486486,"Bottom Quartile",1997,"Platinum",2022,"New Non-Residential Buildings (NRB: 2015) (R3)",37000,3700,0.1,0,"Water Cooled Chilled Water Plant",2,"","","Office Building with Non-Typical Activity (e.g. Industrial Function)"]
["COMCENTRE","31 EXETER ROAD, SINGAPORE 239732","Commercial Building","Office","Large",328.68092261961471,"Bottom Quartile",315.5146433947524,"Bottom Quartile",288.40408909891198,"Bottom Quartile",1981,null,null,null,104962,83076,0.79148644271260071,0,"Water Cooled Chilled Water Plant",5,0.72,"2014-11-30","Office Building with Non-Typical Activity (e.g. Industrial Function)"]
["CPF TAMPINES BUILDING","1 TAMPINES CENTRAL 5, SINGAPORE 529508","Commercial Building","Office","Large",296.04778906752415,"Bottom Quartile",281.01022122186492,"Bottom Quartile",287.62980707395496,"Bottom Quartile",1997,"GoldPlus",2021,"Existing Non-Residental Buildings ENRB: 2017",15550,13873,0.89215434083601286,0,"Water Cooled Chilled Water Plant",2,0.61799999999999999,"2019-02-25","Office Building with Non-Typical Activity (e.g. Industrial Function)"]
["CAPITAL SQUARE","23 CHURCH STREET, SINGAPORE 049481","Commercial Building","Office","Large",282.70601167264255,"Bottom Quartile",266.22836242770029,"Bottom Quartile",283.73698605040698,"Bottom Quartile",1998,"GoldPlus",2021,"Existing Building for Non-Residential buildings (version 3)",38209,31200,0.81656154309194173,0,"Water Cooled Chilled Water Plant",5,0.6,"2021-09-24","Office Building with Non-Typical Activity (e.g. Industrial Function)"]
["THE CAPRICORN","1 SCIENCE PARK ROAD\nSINGAPORE SCIENCE PARK 2, SINGAPORE 117528","Commercial Building","Office","Large",264.2544954898259,"Bottom Quartile",275.80436927487585,"Bottom Quartile",278.09360813929095,"Bottom Quartile",2001,"GoldPlus",2022,"Existing Non-Residential Buildings (RECERT 2017)",28602,28602,1,0,"Air Cooled Chilled Water Plant","","","","Office Building with Non-Typical Activity (e.g. Industrial Function)"]
["ONE RAFFLES LINK","1 RAFFLES LINK, SINGAPORE 039393","Commercial Building","Office","Large",296.74744349503857,"Bottom Quartile",278.64310915104738,"Bottom Quartile",275.19443219404633,"Bottom Quartile",1999,"Platinum",2020,"Existing Non-Residental Buildings ENRB: 2017",36280,30698,0.84614112458654911,0,"Water Cooled Chilled Water Plant",1999,0.56000000000000005,"2021-03-28","Office Building with Non-Typical Activity (e.g. Industrial Function)"]
["DSO NATIONAL LABORATORIES","12 SCIENCE PARK DRIVE, SINGAPORE 118225","Commercial Building","Office","Large",246.18021555849845,"Bottom Quartile",264.46478817837334,"Bottom Quartile",266.94398625880132,"Bottom Quartile",2013,"GoldPlus",2013,"New Building for Non-Residential buildings (version 4)",45637,30912,0.6773451366216009,0,"Water Cooled Chilled Water Plant",7,0.65,"2020-10-20","Office Building with Non-Typical Activity (e.g. Industrial Function)"]
["ECLIPSE","1 FUSIONOPOLIS VIEW, SINGAPORE 138577","Commercial Building","Office","Large",256.5496,null,243.08789999999999,null,259.32676666666669,null,2013,"Platinum",2022,"Existing Building for Non-Residential buildings (version 3)",22500,2800,0.12444444444444444,0,"District Cooling System (DCS)","","",""]
["GOLDEN MILE TOWER","6001 BEACH ROAD, SINGAPORE 199589","Commercial Building","Office","Large",241.77654793085387,"Bottom Quartile",243.19198390399546,"Bottom Quartile",247.63525405971714,"Bottom Quartile",1970,"Gold",2014,"Existing Building for Non-Residential buildings (version 3)",20999,18900,0.90004285918377069,0,"Water Cooled Chilled Water Plant",13,0.52600000000000002,"2023-01-01"]
["SHAW HOUSE","350 ORCHARD ROAD, SINGAPORE 238868","Commercial Building","Office","Large",225.98765495025282,"Bottom Quartile",237.47619678682108,"Bottom Quartile",240.23010112542815,"Bottom Quartile",1993,"Gold",2021,"Existing Building for Non-Residential buildings (version 3)",49048,26199,0.5341502201924645,0,"Water Cooled Chilled Water Plant",12,0.60099999999999998,"2021-07-02"]
["GUOCO TOWER","1 5 7 9 WALLICH STREET, SINGAPORE 078884","Commercial Building","Office","Large",326.89234232150841,"Bottom Quartile",226.47304318332485,"Bottom Quartile",234.80560566116276,"Bottom Quartile",2016,"Platinum",2020,"New Building for Non-Residential buildings (version 4)",129726,115000,0.88648381974315094,223,"Water Cooled Chilled Water Plant",5,0.64500000000000002,"2018-05-17"]
["INTERNATIONAL BUILDING","360 ORCHARD ROAD, SINGAPORE 238869","Commercial Building","Office","Large",239.85549276521968,"Bottom Quartile",236.34577615523108,"Bottom Quartile",229.43097152763886,"Bottom Quartile",1990,"GoldPlus",2019,"Existing Building for Non-Residential buildings (version 3)",15159,14547,0.95962794379576488,0,"Water Cooled Chilled Water Plant",9,0.6,"2014-09-17"]
["HARBOURFRONT CENTRE","1 MARITIME SQUARE, SINGAPORE 099253","Commercial Building","Office","Large",204.23494028230186,"3rd Quartile",211.80369163952227,"Bottom Quartile",225.45038002171552,"Bottom Quartile",1979,"Platinum",2022,"Existing Non-Residential Buildings (RECERT 2017)",110520,79182,0.7164495114006515,0,"Water Cooled Chilled Water Plant",13,0.64700000000000002,"2020-03-04"]
["PARKVIEW SQUARE","600 NORTH BRIDGE ROAD, SINGAPORE 188778","Commercial Building","Office","Large",202.69234793715671,"3rd Quartile",200.19914803934088,"3rd Quartile",218.24720705070891,"Bottom Quartile",2002,null,null,null,39145,34501,0.88136415889641073,0,"Water Cooled Chilled Water Plant",21,"",""]
["THE ATRIUM@ORCHARD","60 ORCHARD ROAD, SINGAPORE 238889","Commercial Building","Office","Large",76.248609964360739,"Top Quartile",210.09429454571517,"Bottom Quartile",215.47779115722332,"Bottom Quartile",2002,null,null,null,53581.36,42866,0.80001702084456239,0,"Water Cooled Chilled Water Plant","","",""]
["9 PENANG ROAD","9 PENANG ROAD, SINGAPORE 238459","Commercial Building","Office","Large",95.731367581515372,"Top Quartile",203.51817968566738,"Bottom Quartile",214.31550551254983,"Bottom Quartile",2019,null,null,null,42630,36510,0.85643912737508798,0,"Air Cooled Chilled Water Plant","",0.57299999999999995,"2021-07-27"]
["PAYA LEBAR SQUARE","60 PAYA LEBAR ROAD SINGAPORE 409051, SINGAPORE 409051","Commercial Building","Office","Large",213.31976800154024,"Bottom Quartile",218.06505102040816,"Bottom Quartile",211.94657296881016,"Bottom Quartile",2014,"GoldPlus",2021,"New Building for Non-Residential buildings (version 4)",62328,57395,0.92085419073289698,0,"Water Cooled Chilled Water Plant",8,"",""]
["WOODLANDS CIVIC CENTRE","900 SOUTH WOODLANDS DRIVE, SINGAPORE 730900","Commercial Building","Office","Large",212.22555970149253,"Bottom Quartile",209.77163631144973,"Bottom Quartile",211.75532747103642,"Bottom Quartile",1999,"Platinum",2015,"Existing Building for Non-Residential buildings (version 3)",38324,30249,0.78929652437115128,0,"Water Cooled Chilled Water Plant",7,0.6,"2020-10-31"]
["OUR TAMPINES HUB","1 TAMPINES WALK SINGAPORE 528523, SINGAPORE 528523","Commercial Building","Office","Large",215.47421988743469,"Bottom Quartile",207.86453825168644,"Bottom Quartile",211.75307160098413,"Bottom Quartile",2016,"Platinum",2020,"New Building for Non-Residential buildings (version 4.1)",120267.9,42473,0.35315325203150633,0,"Water Cooled Chilled Water Plant",7,"",""]
["3 TAMPINES GRANDE","3 TAMPINES GRANDE, SINGAPORE 528799","Commercial Building","Office","Large",207.08830237862495,"3rd Quartile",211.63554903877485,"Bottom Quartile",210.81759530791788,"Bottom Quartile",2002,null,null,null,15345,13475,0.87813620071684584,0,"Others"]
["CURRENCY HOUSE","109 PASIR PANJANG ROAD, SINGAPORE 118536","Commercial Building","Office","Large",199.60130973221811,"3rd Quartile",208.23964209297802,"Bottom Quartile",210.04399273811839,"Bottom Quartile",2001,null,null,null,15423,8863,0.57466122025546262,0,"Water Cooled Chilled Water Plant",22,"",""]
["CONNEXIS","1 FUSIONOPOLIS WAY, SINGAPORE 138632, SINGAPORE 138632","Commercial Building","Office","Large",197.49235911749074,null,204.45041616826157,null,209.95402395667202,null,2008,null,null,null,120383,86950,0.72227806251713278,0,"District Cooling System (DCS)"]
["CAPITAL TOWER","168 ROBINSON ROAD, SINGAPORE 068912","Commercial Building","Office","Large",266.97900587835409,"Bottom Quartile",236.22181789099054,"Bottom Quartile",209.74075258927499,"Bottom Quartile",2000,"Platinum",2020,"Existing Building for Non-Residential buildings (version 3)",75021,69037,0.92023566734647633,0,"Water Cooled Chilled Water Plant",23,3.617,"2020-12-30"]
["HDB HUB","490 LORONG 6 TOA PAYOH, SINGAPORE 310490","Commercial Building","Office","Large",217.2691570631722,"Bottom Quartile",205.15591934665991,"Bottom Quartile",209.33697184339056,"Bottom Quartile",2000,"Platinum",2020,"Existing Building for Non-Residential buildings (version 3)",187345,122472,0.65372441218073607,0,"Water Cooled Chilled Water Plant",10,0.65,"2019-09-15"]
["1ST SCDF DIVISION HQ / ALEXANDRA FIRE STATION","3 QUEENSWAY, SINGAPORE 149073","Commercial Building","Office","Large",210.76085158883004,"3rd Quartile",220.23695414058739,"Bottom Quartile",208.60228574867597,"Bottom Quartile",2005,null,null,null,16616,9195,0.55338228213769858,0,"Air Cooled Chilled Water Plant","",1.41,"2019-11-01"]
["HONG LEONG BUILDING","16 RAFFLES QUAY, SINGAPORE 048581","Commercial Building","Office","Large",224.30858965228322,"Bottom Quartile",212.58265354000841,"Bottom Quartile",208.4438680351906,"Bottom Quartile",1980,"Platinum",2022,"Existing Non-Residental Buildings ENRB: 2017",47740,44136,0.92450775031420196,0,"Water Cooled Chilled Water Plant",13,"",""]
["PICKERING OPERATION CENTRE","20 PICKERING STREET, SINGAPORE 048658","Commercial Building","Office","Large",222.24270833333333,"Bottom Quartile",215.66996527777778,"Bottom Quartile",206.42528935185186,"Bottom Quartile",1989,null,null,null,34560,18000,0.52083333333333337,0,"Water Cooled Chilled Water Plant",3,"",""]
["ASCENT","2 SCIENCE PARK DRIVE, SINGAPORE 118222","Commercial Building","Office","Large",186.14735862229463,"3rd Quartile",190.31193856178731,"3rd Quartile",204.60139632301608,"3rd Quartile",2016,"Platinum",2022,"Existing Non-Residential Buildings (RECERT 2017)",51564,41400,0.80288573423318599,0,"Water Cooled Chilled Water Plant",2016,0.55000000000000004,"2023-02-25"]
["NATIONAL LIBRARY BUI","100 VICTORIA STREET, SINGAPORE 188064","Commercial Building","Office","Large",188.46804007961487,"3rd Quartile",201.28971981695386,"Bottom Quartile",204.13669258118841,"3rd Quartile",2005,"Platinum",2019,"Existing Building for Non-Residential buildings (version 2.1)",58783,58783,1,0,"Water Cooled Chilled Water Plant",18,0.81,"2019-05-30"]
["POLICE CANTONMENT COMPLEX","391 NEW BRIDGE ROAD, SINGAPORE 088762","Commercial Building","Office","Large",216.86317455263921,"Bottom Quartile",214.4199385727529,"Bottom Quartile",203.0746022679389,"3rd Quartile",2001,"Platinum",2019,"Existing Building for Non-Residential buildings (version 3)",106793,27600,0.25844390549942414,0,"Water Cooled Chilled Water Plant",3,0.52,"2019-08-22"]
["MTOWER/ARC","460 ALEXANDRA ROAD, SINGAPORE 119963","Commercial Building","Office","Large",198.66567269303201,"3rd Quartile",192.30346327683617,"3rd Quartile",202.59139962335217,"3rd Quartile",1986,"GoldPlus",2018,"Existing Building for Non-Residential buildings (version 2.1)",79650,74816,0.93930947897049588,0,"Water Cooled Chilled Water Plant",11,0.69,"2021-04-20"]
["MINISTRY OF FOREIGN AFFAIRS","1 SHERWOOD ROAD, SINGAPORE 248163","Commercial Building","Office","Large",204.28530098781414,"3rd Quartile",212.43659696620043,"Bottom Quartile",198.55955872006302,"3rd Quartile",2003,"Gold",2020,"Existing Non-Residental Buildings ENRB: 2017",35533,26752,0.75287760673177051,0,"Water Cooled Chilled Water Plant",2,0.59,"2016-05-25"]
["CAPITASPRING","88 MARKET STREET, SINGAPORE 048948","Commercial Building","Office","Large","",null,67.07278220269157,"Top Quartile",198.34778157848743,"3rd Quartile",2021,null,null,null,80102,67798,0.84639584529724599,0,"Water Cooled Chilled Water Plant",2,0.752,"2022-09-03"]
["THE ARCADE","11 COLLYER QUAY, SINGAPORE 049317","Commercial Building","Office","Large",210.40291649939783,"3rd Quartile",197.75843235648338,"3rd Quartile",198.21868576876759,"3rd Quartile",1983,null,null,null,19928,14629,0.7340927338418306,3,"Water-Cooled Package Units",null,0.83,"2017-07-12"]
["ONE@CHANGI CITY","NO. 1 CHANGI BUSINESS PARK CENTRAL 1, SINGAPORE 486036","Commercial Building","Office","Large",199.87414275274742,"3rd Quartile",192.81696365833778,"3rd Quartile",196.11769934511932,"3rd Quartile",2012,"GoldPlus",2022,"Existing Non-Residential Buildings (RECERT 2017)",71158,53000,0.74482138340032045,0,"Water Cooled Chilled Water Plant",10,0.63200000000000001,"2023-04-30"]
["INCOME AT TAMPINES JUNCTION","300 TAMPINES AVENUE 5, SINGAPORE 529653","Commercial Building","Office","Large",184.0236057426836,"3rd Quartile",186.81165102153506,"3rd Quartile",194.48520154610713,"3rd Quartile",1997,"GoldPlus",2016,"Existing Building for Non-Residential buildings (version 3)",18110,14803,0.81739370513528442,0,"Water Cooled Chilled Water Plant",6,"",""]
["6 RAFFLES QUAY","6 RAFFLES QUAY, SINGAPORE 048580","Commercial Building","Office","Large",210.41181310152126,"3rd Quartile",196.3417342440236,"3rd Quartile",194.20538652592361,"3rd Quartile",1992,null,null,null,16105,16000,0.9934802856255821,0,"Others","","",""]
["FORTUNE CENTRE","190 MIDDLE RD, #06-00 FORTUNE CENTRE, SINGAPORE 188979","Commercial Building","Office","Large",204.47373628207799,"3rd Quartile",196.79816190277484,"3rd Quartile",193.84607928228667,"3rd Quartile",1980,"Gold",2018,"Existing Building for Non-Residential buildings (version 3)",23965,20875,0.87106196536615899,0,"Water Cooled Chilled Water Plant",2015,0.55600000000000005,"2023-04-12"]
["AIA TAMPINES","3 TAMPINES GRANDE, SINGAPORE 048542","Commercial Building","Office","Large",190.22730235286451,"3rd Quartile",198.37020139477286,"3rd Quartile",192.40070390406049,"3rd Quartile",2002,"Certified",2019,"Existing Building for Non-Residential buildings (version 3)",15343,13475,0.8782506680570944,0,"Others","",0.87,"2011-06-06"]
["ONE GEORGE STREET","1 GEORGE STREET, SINGAPORE 049145","Commercial Building","Office","Large",193.63430232558139,"3rd Quartile",186.21499701848538,"3rd Quartile",191.73297555158021,"3rd Quartile",2006,"GoldPlus",2021,"Existing Building for Non-Residential buildings (version 2.1)",50310,41621,0.82729079705823894,0,"Water Cooled Chilled Water Plant",18.5,0.9,"2023-05-18"]
["SCIENCE CENTRE SINGAPORE","15 SCIENCE CENTRE ROAD, SINGAPORE 609081, SINGAPORE 609081","Commercial Building","Office","Large",164.06634511270795,"3rd Quartile",178.79579683039668,"3rd Quartile",190.57371132329297,"3rd Quartile",1975,"GoldPlus",2023,"GM:2021 In Operation",30477,27429,0.89999015651146763,0,"Water Cooled Chilled Water Plant",0,0.629,"2018-03-15"]
["2 BUKIT MERAH CENTRAL","2 BUKIT MERAH CENTRAL, SINGAPORE 159835","Commercial Building","Office","Large",210.76349987112295,"3rd Quartile",209.38686742847324,"Bottom Quartile",188.6774851791391,"3rd Quartile",1988,null,null,null,23278,22000,0.94509837614915371,0,"Water Cooled Chilled Water Plant",19,"",""]
["MOE BUILDING","1 NORTH BUONA VISTA DRIVE, SINGAPORE 138675","Commercial Building","Office","Large",182.50061189999806,"3rd Quartile",188.81289457837175,"3rd Quartile",188.43116610656773,"3rd Quartile",2000,"Platinum",2022,"Existing Non-Residental Buildings ENRB: 2017",51479,30615,0.59470852192156021,0,"Water Cooled Chilled Water Plant",2,0.18,"2018-10-22"]
["NUCLEOS","21 BIOPOLIS ROAD, SINGAPORE 138567","Commercial Building","Office","Large",152.81270917360337,null,157.6106689264567,null,186.82568866386339,null,2014,"GoldPlus",2022,"Existing Non-Residential Buildings (RECERT 2017)",46612,38820,0.8328327469321205,0,"District Cooling System (DCS)","","",""]
["REPUBLIC PLAZA","9 RAFFLES PLACE, SINGAPORE 048619, SINGAPORE 048619","Commercial Building","Office","Large",183.12823378491322,"3rd Quartile",185.43405119633036,"3rd Quartile",185.6344826915975,"3rd Quartile",1998,"Platinum",2023,"Existing Non-Residential Buildings Re-Cert (GM:2021 In Operation)",102898,81652,0.79352368364788428,0,"Water Cooled Chilled Water Plant",5,0.61,"2017-01-23"]
["71 ROBINSON","71 ROBINSON ROAD, SINGAPORE 068895","Commercial Building","Office","Large",177.101660508946,"3rd Quartile",166.25883183195648,"3rd Quartile",184.28411308065921,"3rd Quartile",2009,"Gold",2022,"Existing Non-Residential Buildings (RECERT 2017)",24089,23530,0.97679438747976255,0,"Water Cooled Chilled Water Plant",9,0.60199999999999998,"2022-04-27"]
["THE SYNERGY","1 INTERNATIONAL BUSINESS PARK, SINGAPORE 609917","Commercial Building","Office","Large",197.31095423446075,"3rd Quartile",181.73974324879723,"3rd Quartile",183.61281821918141,"3rd Quartile",1998,"GoldPlus",2021,"Existing Non-Residental Buildings ENRB: 2017",41363,28100,0.67935111089621159,0,"Water Cooled Chilled Water Plant",2,0.59899999999999998,"2021-05-10"]
["80 ROBINSON ROAD","80 ROBINSON ROAD, SINGAPORE 068898","Commercial Building","Office","Large",171.36336727788338,"3rd Quartile",181.44050078953305,"3rd Quartile",181.34834455866715,"3rd Quartile",1997,null,null,null,31031,25833,0.83249009055460665,0,"Water-Cooled Package Units",null,"",""]
["SINGAPORE POST CENTRE","10 EUNOS ROAD 8, SINGAPORE 408600","Commercial Building","Office","Large",187.5277548200871,"3rd Quartile",181.70844795046074,"3rd Quartile",179.69007117569419,"3rd Quartile",1999,"GoldPlus",2022,"Existing Non-Residental Buildings ENRB: 2017",162134,153490,0.94668607448160169,0,"Water Cooled Chilled Water Plant",2,0.62,"2022-06-16"]
["THE GATEWAY","152 BEACH ROAD, SINGAPORE 189721","Commercial Building","Office","Large",271.93285665451231,"Bottom Quartile",174.39335973108479,"3rd Quartile",178.55289995442115,"3rd Quartile",1990,null,null,null,105312,70526,0.66968626557277422,0,"Water Cooled Chilled Water Plant","",0.72,"2023-04-04"]
["CLEANTECH TWO BLK A","3 CLEANTECH LOOP, SINGAPORE 637143","Commercial Building","Office","Large",149.90373137647319,"2nd Quartile",162.02221614409606,"3rd Quartile",177.87338225483657,"3rd Quartile",2014,"Platinum",2020,"New Building for Non-Residential buildings (version 4.0)",22485,10537,0.46862352679564157,0,"Water Cooled Chilled Water Plant",5,0.6,"2022-12-02"]
["WINSLAND HOUSE II","163/165/167 PENANG ROAD, SINGAPORE 238463","Commercial Building","Office","Large",173.48993833735074,"3rd Quartile",175.14885924098886,"3rd Quartile",177.55183194125232,"3rd Quartile",1997,"GoldPlus",2021,"Existing Building for Non-Residential buildings (version 3)",17839,7821,0.43842143617915802,0,"Water Cooled Chilled Water Plant",16,0.64200000000000002,"2021-06-02"]
["ONE RAFFLES PLACE","1 RAFFLES PLACE, SINGAPORE 048616","Commercial Building","Office","Large",172.11403680417897,"3rd Quartile",171.73765749823465,"3rd Quartile",177.18270220603875,"3rd Quartile",1988,"Gold",2022,"GM:2021 In Operation",117541,106000,0.90181298440544155,0,"Water Cooled Chilled Water Plant",5,0.623,"2023-01-04"]
["COLLYER QUAY CENTRE","16 COLLYER QUAY, SINGAPORE 049318","Commercial Building","Office","Large",173.74909317027672,"3rd Quartile",170.84857239092133,"3rd Quartile",174.16158410197949,"3rd Quartile",1992,"Gold",2023,"GM:2021 In Operation",38596,36706,0.95103119494248112,0,"Water Cooled Chilled Water Plant",3,0.60499999999999998,"2022-12-16"]
["SPRINGLEAF TOWER","3 ANSON ROAD, SINGAPORE 079909","Commercial Building","Office","Large",168.16586893576789,"3rd Quartile",162.74451929326952,"3rd Quartile",173.2335283342197,"3rd Quartile",2003,null,null,null,33846,33846,1,0,"Others","","",""]
["MAPLETREE ANSON BUILDING","60 ANSON ROAD, SINGAPORE 079914","Commercial Building","Office","Large",174.82250329528563,"3rd Quartile",162.21793757186526,"3rd Quartile",172.98948313094203,"3rd Quartile",2009,"Platinum",2022,"Existing Non-Residential Buildings (RECERT 2017)",35657,32771,0.9190621757298707,0,"Water Cooled Chilled Water Plant",12,"",""]
["SGX CENTRE 1","2 SHENTON WAY, SINGAPORE 068804","Commercial Building","Office","Large",266.93795403198493,"Bottom Quartile",189.87451369865266,"3rd Quartile",172.89264768268981,"3rd Quartile",2000,"Platinum",2021,"Existing Building for Non-Residential buildings (version 3)",30408.1,28950,0.9520489606387772,0,"Water Cooled Chilled Water Plant",2,0.55000000000000004,"2022-09-12"]
["OCEAN FINANCIAL CENTRE","10 COLLYER QUAY SINGAPORE 049315, SINGAPORE 049315","Commercial Building","Office","Large",184.59973226935577,null,179.32192266022167,null,172.38095362113509,null,2011,"Platinum",2022,"Existing Building for Non-Residential buildings (version 3)",95992,85783,0.89364738728227355,0,"District Cooling System (DCS)"]
["MARINA BAY FINANCIAL CENTRE TOWER 1","8 MARINA BOULEVARD, SINGAPORE 018981","Commercial Building","Office","Large",173.30423175459345,null,167.11787285367578,null,171.52965485668673,null,2009,"Platinum",2020,"Existing Building for Non-Residential buildings (version 3)",68130,60000,0.8806693086745927,0,"District Cooling System (DCS)","","",""]
["OCBC CENTRE","65 CHULIA STREET, SINGAPORE 049513","Commercial Building","Office","Large",172.66897201614299,"3rd Quartile",165.51413844084232,"3rd Quartile",170.53309180996018,"3rd Quartile",1979,"Gold",2022,"Existing Non-Residential Buildings (RECERT 2017)",75079,50258,0.66940156368625048,0,"Water Cooled Chilled Water Plant",12,0.79,"2014-10-04"]
["20 COLLYER QUAY","20 COLLYER QUAY, SINGAPORE 049319","Commercial Building","Office","Large",181.37670295489892,"3rd Quartile",167.67200622083982,"3rd Quartile",170.1108864696734,"3rd Quartile",1985,"Certified",2021,"Existing Building for Non-Residential buildings (version 2.1)",32150,27761,0.86348367029548989,0,"Water Cooled Chilled Water Plant",10,0.72,"2021-02-11"]
["OXLEY TOWER","138 ROBINSON ROAD, SINGAPORE 068906","Commercial Building","Office","Large",174.165810321278,"3rd Quartile",165.80141873032846,"3rd Quartile",169.89042817269433,"3rd Quartile",2017,null,null,null,16839,1000,5.938594928439931E-2,0,"Others","","",""]
["THE RUTHERFORD","89 SCIENCE PARK DRIVE, SCIENCE PARK 1, SINGAPORE 118261","Commercial Building","Office","Large",163.40955617336044,"3rd Quartile",154.55290125601942,"2nd Quartile",168.28657498882987,"3rd Quartile",1995,"Certified",2022,"Existing Non-Residential Buildings (RECERT 2017)",20143,16115,0.80002978702278704,0,"Water-Cooled Package Units","",0.65,"2022-12-07"]
["ASIA SQUARE TOWER 2","12 MARINA VIEW, SINGAPORE 018961","Commercial Building","Office","Large",161.13611713665944,null,151.1411183417691,null,166.9743914196192,null,2013,"Platinum",2020,"New Building for Non-Residential buildings (version 3)",99576,82727,0.83079256045633487,305,"District Cooling System (DCS)","","",""]
["ODEON TOWERS","331 NORTH BRIDGE ROAD, SINGAPORE 188720","Commercial Building","Office","Large","",null,"",null,165.95050783267345,"3rd Quartile",36161,"Platinum",2022,"Existing Non-Residental Buildings ENRB: 2017",23236,18357,0.79002410053365468,0,"Water Cooled Chilled Water Plant",2022,0.53,"2023-02-07"]
["SGX CENTRE 2","4 SHENTON WAY, SINGAPORE 068807","Commercial Building","Office","Large",285.38059367188526,"Bottom Quartile",188.79684712537824,"3rd Quartile",165.0619076437311,"3rd Quartile",2001,"Platinum",2021,"Existing Building for Non-Residential buildings (version 3)",30404,28950,0.95217734508617291,0,"Water Cooled Chilled Water Plant",2,0.55000000000000004,"2022-09-12"]
["MYP CENTRE","9 BATTERY ROAD, SINGAPORE 049910","Commercial Building","Office","Large",116.01373983301913,"Top Quartile",153.55433342310798,"2nd Quartile",164.76571990304336,"3rd Quartile",2009,"Gold",2023,"GM:2021 In Operation",18565,14762,0.79515216805817401,0,"Others","","",""]
["FRASERS TOWER","182 CECIL STREET, SINGAPORE 069547","Commercial Building","Office","Large",153.59537056477009,"2nd Quartile",154.46261022464833,"2nd Quartile",163.47946672265377,"3rd Quartile",2018,"Platinum",2017,"New Building for Non-Residential buildings (version 4.1)",76208,67215,0.88199401637623343,0,"Water Cooled Chilled Water Plant",4,0.58199999999999996,"2021-01-20"]
["SHENTON HOUSE","3 SHENTON WAY, SINGAPORE 068805","Commercial Building","Office","Large",144.09994381827642,"2nd Quartile",148.39728975203744,"2nd Quartile",162.10711496445293,"3rd Quartile",1983,null,null,null,28835,28835,1,0,"Water Cooled Chilled Water Plant",19,"",""]
["SAMSUNG HUB","NO 3 CHURCH STREET SAMSUNG HUB #07-02 SINGAPORE 049483, SINGAPORE 049483","Commercial Building","Office","Large",176.37884098721983,"3rd Quartile",159.65757512539795,"3rd Quartile",161.37481519106748,"3rd Quartile",2005,"GoldPlus",2021,"Existing Building for Non-Residential buildings (version 3)",27562.25,33840,1.2277662382425238,0,"Water Cooled Chilled Water Plant",7,0.624,"2021-05-18"]
["GB BUILDING","143 CECIL STREET, SINGAPORE 069542","Commercial Building","Office","Large",150.73633364151164,"2nd Quartile",164.85149254593784,"3rd Quartile",160.85882930775452,"3rd Quartile",1989,null,null,null,17306,15000,0.86675141569397895,0,"Water Cooled Chilled Water Plant",20,"",""]
["LAND TRANSPORT AUTHORITY","1 HAMPSHIRE ROAD, SINGAPORE 219428","Commercial Building","Office","Large",185.35978482714975,"3rd Quartile",175.24180260000526,"3rd Quartile",160.84864804999606,"3rd Quartile",1997,null,null,null,37923,30003,0.79115576299343404,0,"Others","","",""]
["CAPITAGREEN","138 MARKET STREET, SINGAPORE 048946","Commercial Building","Office","Large",156.31420191944198,"2nd Quartile",149.83533529261123,"2nd Quartile",160.40868626757558,"3rd Quartile",2014,"Platinum",2021,"New Building for Non-Residential buildings (version 4.0)",82003,65225,0.79539772935136521,0,"Water Cooled Chilled Water Plant",9,0.56000000000000005,"2021-01-25"]
["FOOK HAI BUILDING","150 SOUTH BRIDGE ROAD, SINGAPORE 058727","Commercial Building","Office","Large",152.17173115634091,"2nd Quartile",152.72779747260128,"2nd Quartile",160.19218183851487,"3rd Quartile",1976,null,null,null,17884,10888,0.60881234623126812,0,"Water Cooled Chilled Water Plant",4,"",""]
["OUE DOWNTOWN","6 SHENTON WAY, SINGAPORE 068809, SINGAPORE 068809","Commercial Building","Office","Large",159.57736848907845,"2nd Quartile",156.28364999353755,"3rd Quartile",160.03699108181465,"3rd Quartile",1974,"Gold",2022,"Existing Building for Non-Residential buildings (version 3)",116055,110000,0.94782646159148676,268,"Water Cooled Chilled Water Plant",6,"",""]
["THE ALPHA","10 SCIENCE PARK ROAD, SINGAPORE 117684","Commercial Building","Office","Large",156.03017558616338,"2nd Quartile",136.0453860442295,"2nd Quartile",158.29639364945851,"2nd Quartile",1995,"GoldPlus",2022,"Existing Non-Residential Buildings (RECERT 2017)",28533,19537,0.68471594294325866,0,"Water Cooled Chilled Water Plant",1995,"",""]
["111 SOMERSET","111 SOMERSET ROAD #B1-01, SINGAPORE 238164","Commercial Building","Office","Large",150.64925955570536,"2nd Quartile",153.16785758418285,"2nd Quartile",158.24373536102451,"2nd Quartile",1975,"GoldPlus",2011,"Existing Building (version 2)",71214,70000,0.98295279018170589,0,"Water Cooled Chilled Water Plant",1,"",""]
["GOLDBELL TOWERS","47 SCOTTS ROAD, SINGAPORE 228233","Commercial Building","Office","Large",145.508830760595,"2nd Quartile",156.0730008419871,"3rd Quartile",157.872877911872,"2nd Quartile",1999,"Gold",2022,"Existing Non-Residential Buildings (RECERT 2017)",17815,16000,0.8981195621667134,0,"Others","",0.75,"2020-01-04"]
["78 SHENTON WAY","78 SHENTON WAY, SINGAPORE 079120","Commercial Building","Office","Large",172.59396839876118,"3rd Quartile",162.13799991472396,"3rd Quartile",157.76814474189135,"2nd Quartile",1989,null,null,null,38697.85,31000,0.80107809606993674,0,"Water Cooled Chilled Water Plant","","",""]
["18 ROBINSON","ROBINSON ROAD, SINGAPORE 048547","Commercial Building","Office","Large",145.26186513124708,"2nd Quartile",153.8397765625694,"2nd Quartile",157.28885731616836,"2nd Quartile",2019,"GoldPlus",2022,"Existing Non-Residental Buildings ENRB: 2017",24085.49,20000,0.83037546672291074,0,"Water Cooled Chilled Water Plant",4,0.53,"2021-10-12"]
["WILMAR INTERNATIONAL","28 BIOPOLIS ROAD, SINGAPORE 138568","Commercial Building","Office","Large","",null,"",null,157.26440481002425,null,2022,"GoldPlus",2020,"Non-Residential Buildings NRB: 2015",19792,15075,0.76167138237671783,0,"District Cooling System (DCS)","","",""]
["SYNAPSE","3 BIOPOLIS DRIVE, SINGAPORE 138623","Commercial Building","Office","Large",181.54649106478035,null,193.86753071481758,null,157.05835815338793,null,2011,"Gold",2011,"New Building for Non-Residential buildings (version 3)",33458,28003,0.83695977045848524,0,"District Cooling System (DCS)","","",""]
["MANHATTAN HOUSE","151 CHIN SWEE ROAD, SINGAPORE 169876","Commercial Building","Office","Large",166.16282613981761,"3rd Quartile",156.7462407294833,"3rd Quartile",155.7806303951368,"2nd Quartile",1969,null,null,null,16450,16350,0.99392097264437695,0,"Water Cooled Chilled Water Plant",53,"",""]
["UOB PLAZA 1 & 2","80 RAFFLES PLACE, SINGAPORE 048624","Commercial Building","Office","Large",180.52254743534303,"3rd Quartile",175.60680443969017,"3rd Quartile",155.27187412279704,"2nd Quartile",1992,"GoldPlus",2022,"Existing Building for Non-Residential buildings (version 3)",131811,113717,0.86272769343984945,0,"Water Cooled Chilled Water Plant",6,0.75,"2021-10-23"]
["HARBOURFRONT TOWER ONE","1 HARBOURFRONT PLACE, SINGAPORE 098633, SINGAPORE 098633","Commercial Building","Office","Large",147.42951612631012,"2nd Quartile",146.62771126225718,"2nd Quartile",154.32653170410626,"2nd Quartile",2002,"Gold",2022,"Existing Building for Non-Residential buildings (version 2.1)",40061,34377,0.85811637253188888,0,"Water Cooled Chilled Water Plant",9,0.80900000000000005,"2022-10-01"]
["OCBC CENTRE EAST","63 CHULIA STREET, SINGAPORE 049514","Commercial Building","Office","Large",146.5704325428546,"2nd Quartile",144.71866950883737,"2nd Quartile",154.21107558397728,"2nd Quartile",1996,"Gold",2022,"Existing Non-Residential Buildings (RECERT 2017)",22518,18014,0.79998223643307576,0,"Water Cooled Chilled Water Plant",12,0.73299999999999998,"2016-10-03"]
["PRUDENTIAL TOWER","30 CECIL STREET, SINGAPORE 049712","Commercial Building","Office","Large",156.39920574749991,"2nd Quartile",147.63828297050435,"2nd Quartile",153.83196505288998,"2nd Quartile",1998,"GoldPlus",2021,"Existing Building for Non-Residential buildings (version 2.1)",27699,27699,1,0,"Water Cooled Chilled Water Plant",8,0.68,"2021-02-21"]
["HQ SCDF","91 UBI AVENUE 4, SINGAPORE 408827","Commercial Building","Office","Large",177.24832055451373,"3rd Quartile",158.18591402188619,"3rd Quartile",153.58848244593727,"2nd Quartile",2001,"Platinum",2022,"Existing Non-Residental Buildings ENRB: 2017",42127,34000,0.80708334322406061,0,"Water Cooled Chilled Water Plant",2,"",""]
["CENTENNIAL TOWER","3 TEMASEK AVENUE SINGAPORE 039190, SINGAPORE 039190","Commercial Building","Office","Large",167.7988310767048,"3rd Quartile",164.22257348178761,"3rd Quartile",152.1883231039694,"2nd Quartile",1997,"GoldPlus",2022,"Existing Building for Non-Residential buildings (version 2.1)",64846,51932,0.80085124757116866,0,"Water Cooled Chilled Water Plant",7,0.65,"2013-03-20"]
["SINGAPORE BUSINESS FEDERATION CENTER","160 ROBINSON ROAD, SINGAPORE 068914","Commercial Building","Office","Large",149.89159778637057,"2nd Quartile",151.34869275249213,"2nd Quartile",151.99463762460533,"2nd Quartile",2017,"Platinum",2021,"New Building for Non-Residential buildings (version 4)",28189,26779,0.94998048884316577,0,"Water Cooled Chilled Water Plant",7,0.6,"2021-07-22"]
["THE MCST PLAN NO 4484","2 VENTURE DRIVE, SINGAPORE 608526","Commercial Building","Office","Large",121.20045847402497,"Top Quartile",142.88143489978623,"2nd Quartile",151.89512096899105,"2nd Quartile",2017,"GoldPlus",2022,"Existing Non-Residential Buildings (RECERT 2017)",64562,52918,0.81964623152938265,0,"Water Cooled Chilled Water Plant",7,0.56799999999999995,"2021-10-04"]
["CAPITASKY","79 ROBINSON ROAD, SINGAPORE 068897","Commercial Building","Office","Large",47.419100348469037,"Top Quartile",125.02969946756761,"2nd Quartile",151.01197530645817,"2nd Quartile",2020,null,null,null,56533,52417,0.92719296693966358,0,"Water Cooled Chilled Water Plant",3,0.63,"2022-06-30"]
["GALAXIS","1 FUSIONOPOLIS PLACE 138522, SINGAPORE 138522","Commercial Building","Office","Large",147.99398596725695,"2nd Quartile",142.09134356977876,"2nd Quartile",149.87213643428871,"2nd Quartile",2014,"Platinum",2021,"New Building for Non-Residential buildings (version 4.0)",68839,55585,0.80746379232702392,0,"Water Cooled Chilled Water Plant",9,0.62,"2023-06-17"]
["THE METROPOLIS","9 NORTH BUONA VISTA DRIVE, SINGAPORE 138588","Commercial Building","Office","Large",149.19877810997011,"2nd Quartile",148.63647471727543,"2nd Quartile",149.52770050695437,"2nd Quartile",2013,"Platinum",2021,"New Building for Non-Residential buildings (version 3)",115395,102171,0.88540231379175871,0,"Water Cooled Chilled Water Plant",10,0.54200000000000004,"2021-08-01"]
["LAZADA ONE","51 BRAS BASAH ROAD, #02-06, SINGAPORE 189554","Commercial Building","Office","Large","",null,"",null,148.73481119410692,"2nd Quartile",45190,"Platinum",2017,"Existing Building for Non-Residential buildings (version 3)",29051,23241,0.80000688444459744,0,"Water Cooled Chilled Water Plant",14,0.61,"2023-10-30"]
["ROBINSON POINT","39 ROBINSON ROAD, SINGAPORE 068911","Commercial Building","Office","Large",154.41999999999999,"2nd Quartile",138.56948051948052,"2nd Quartile",147.36194805194805,"2nd Quartile",1997,"Gold",2013,"Existing Building for Non-Residential buildings (version 2.1)",15400,13927,0.90435064935064935,0,"Water Cooled Chilled Water Plant",25,"",""]
["TELETECH PARK","20 SCIENCE PARK ROAD, SINGAPORE 117674","Commercial Building","Office","Large",182.37790234899538,"3rd Quartile",167.04265318239413,"3rd Quartile",146.99734091983723,"2nd Quartile",1996,"GoldPlus",2022,"Existing Non-Residential Buildings (RECERT 2017)",17701.61,17700,0.99990904782107382,0,"Water Cooled Chilled Water Plant",2015,"",""]
["ASIA SQUARE TOWER 1","8 MARINA VIEW, SINGAPORE 018960","Commercial Building","Office","Large",145.29172674219018,null,133.3507037418469,null,146.62239958805355,null,2011,"Platinum",2021,"Existing Building for Non-Residential buildings (version 3)",145650,123715,0.84939924476484718,0,"District Cooling System (DCS)","","",""]
["TWENTY ANSON","20 ANSON ROAD, SINGAPORE 079912","Commercial Building","Office","Large",193.55495511200209,"3rd Quartile",171.67214329294868,"3rd Quartile",146.38900026148349,"2nd Quartile",2009,"Platinum",2021,"Existing Building for Non-Residential buildings (version 3)",22946,20132,0.87736424649176326,0,"Water Cooled Chilled Water Plant",14,0.63300000000000001,"2021-07-26"]
["MINISTRY OF MANPOWER SERVICE CENTRE","1500 BENDEMEER RD, SINGAPORE 339946","Commercial Building","Office","Large",143.00788613753539,"2nd Quartile",134.47109723331639,"2nd Quartile",144.9611095780989,"2nd Quartile",2012,"Platinum",2022,"Existing Non-Residental Buildings ENRB: 2017",27542,16190,0.58782949676857166,0,"Water Cooled Chilled Water Plant",11,0.63600000000000001,"2015-07-01"]
["FRAGRANCE EMPIRE BUILDING","456 ALEXANDRA ROAD, SINGAPORE 119962","Commercial Building","Office","Large",133.85903914590747,"2nd Quartile",142.6020640569395,"2nd Quartile",143.76451957295373,"2nd Quartile",2016,null,null,null,28100,19300,0.68683274021352314,0,"Water Cooled Chilled Water Plant",18,"",""]
["STANDARD CHARTERED @ CHANGI","7 CHANGI BUSINESS PARK CRESCENT, SINGAPORE 486028","Commercial Building","Office","Large",165.1869183040331,null,141.2172772935441,null,143.73732272122913,null,2009,"Platinum",2019,"Existing Building for Non-Residential buildings (version 3)",27076,22004,0.81267543211700399,0,"District Cooling System (DCS)","","",""]
["30 RAFFLES PLACE","30 RAFFLES PLACE, SINGAPORE 048622","Commercial Building","Office","Large",54.692647176826171,"Top Quartile",114.99812769144356,"Top Quartile",142.59310054296949,"2nd Quartile",2020,"Platinum",2022,"Non-Residential Buildings NRB: 2015",37387,37387,1,0,"Water Cooled Chilled Water Plant",4,0.60399999999999998,"2022-01-14"]
["MAPLETREE BUSINESS CITY","10 PASIR PANJANG ROAD,, SINGAPORE 117438","Commercial Building","Office","Large",142.07589759660274,"2nd Quartile",137.33452501247106,"2nd Quartile",142.2540802752587,"2nd Quartile",2010,"Platinum",2022,"Existing Building for Non-Residential buildings (version 3)",184167,171504,0.93124175340859117,0,"Water Cooled Chilled Water Plant",13,0.61,"2022-11-24"]
["ISTANA","ORCHARD RD SINGAPORE 238823, SINGAPORE 238823","Commercial Building","Office","Large",138.0130965439192,"2nd Quartile",141.97589623052144,"2nd Quartile",141.6148589710107,"2nd Quartile",1959,"Platinum",2022,"New Non-Residential Buildings (NRB: 2015) (R3)",22974,10038,0.43692870201096889,0,"Water Cooled Chilled Water Plant",3,"",""]
["VISIONCREST","103 PENANG ROAD, SINGAPORE 238467","Commercial Building","Office","Large",132.86577774973182,"2nd Quartile",131.10091499968451,"2nd Quartile",140.90329715403544,"2nd Quartile",2008,null,null,null,15847,14047,0.88641383227109227,0,"Others","","",""]
["INTERNATIONAL PLAZA","10 ANSON ROAD #36-05 INTERNATIONAL PLAZA, SINGAPORE 079903","Commercial Building","Office","Large",139.98052512536211,"2nd Quartile",137.90103042377694,"2nd Quartile",140.55920952078461,"2nd Quartile",1976,"Gold",2023,"GM:2021 In Operation",103899,102370,0.98528378521448712,0,"Water Cooled Chilled Water Plant",5,0.63,"2019-07-17"]
["MINISTRY OF MANPOWER HQ","18 HAVELOCK ROAD, SINGAPORE 059764","Commercial Building","Office","Large",134.68654738321936,"2nd Quartile",131.99126333951051,"2nd Quartile",137.51068822288963,"2nd Quartile",2009,"Platinum",2019,"Existing Building for Non-Residential buildings (version 2.1)",31298,25632,0.81896606811936867,0,"Water Cooled Chilled Water Plant",14,"",""]
["6 BATTERY ROAD","6 BATTERY ROAD, SINGAPORE 049909","Commercial Building","Office","Large",127.09465124683773,"2nd Quartile",128.00234911456451,"2nd Quartile",137.17142512950247,"2nd Quartile",1984,null,null,null,66408,55000,0.8282134682568365,0,"Water Cooled Chilled Water Plant",6,0.65,"2021-01-21"]
["THE URA CENTRE","45 MAXWELL ROAD, SINGAPORE 069118","Commercial Building","Office","Large",138.49605053413842,"2nd Quartile",130.26498169995355,"2nd Quartile",135.73540083604274,"2nd Quartile",1998,"Platinum",2017,"Existing Building for Non-Residential buildings (version 3)",53825,50622,0.9404923362749652,0,"Water Cooled Chilled Water Plant",7,0.6,"2020-11-20"]
["TOURISM COURT","1 ORCHARD SPRING LANE, SINGAPORE 247729","Commercial Building","Office","Large",143.34403918578744,"2nd Quartile",136.12335377111592,"2nd Quartile",134.55464932905389,"2nd Quartile",1995,"Platinum",2022,"Existing Non-Residental Buildings ENRB: 2017",17824.830000000002,10572,0.59310523578625984,0,"Water Cooled Chilled Water Plant",1,0.61,"2021-10-07"]
["TONG ENG BUILDING","101 CECIL STREET, SINGAPORE 069533","Commercial Building","Office","Large",135.79821460137885,"2nd Quartile",133.60474191267454,"2nd Quartile",133.99266900679308,"2nd Quartile",1979,"Platinum",2020,"Existing Building for Non-Residential buildings (version 3)",15839.6,17842,1.1264173337710548,0,"Water Cooled Chilled Water Plant",11,0.66,"2020-09-06"]
["PARK AVENUE CHANGI","2 CHANGI BUSINESS PARK AVE 1, SINGAPORE 486015, SINGAPORE 486015","Commercial Building","Office","Large",195.8739158678855,null,132.27498608166997,null,132.46677874609173,null,2012,"GoldPlus",2020,"New Building for Non-Residential buildings (version 3)",72781.72,0,0,251,"District Cooling System (DCS)","","",""]
["CITI CAMPUS BLOCK 1 & 2","3 & 5 CHANGI BUSINESS PARK CRESENT, SINGAPORE 486026","Commercial Building","Office","Large",145.85393700040322,null,121.97443630067126,null,132.09647406247777,null,2009,null,null,null,42159,37589,0.89160084442230603,0,"District Cooling System (DCS)","","",""]
["ONE MARINA BOULEVARD","1 MARINA BOULEVARD, SINGAPORE 018989","Commercial Building","Office","Large",118.97436641316285,null,120.09601094141782,null,131.65392792755455,null,2004,"GoldPlus",2022,"GM:2021 In Operation",48257,35268,0.73083697701887806,0,"District Cooling System (DCS)","",24506,"2022-09-01"]
["OLD HILL STREET POLICE STATION","140 HILL STREET, SINGAPORE 179369, SINGAPORE 179369","Commercial Building","Office","Large",130.40231204805448,"2nd Quartile",131.01195470023339,"2nd Quartile",131.38419941079695,"2nd Quartile",2002,"Platinum",2023,"Existing Non-Residential Buildings Re-Cert (GM:2021 In Operation)",26137,24225,0.92684699850786245,0,"Water Cooled Chilled Water Plant",3,0.75,"2021-05-14"]
["NEXUS @ ONE NORTH","1&3 FUSIONPOLIS LINK, SINGAPORE 138542","Commercial Building","Office","Large",179.47997569580556,"3rd Quartile",165.40901136809094,"3rd Quartile",131.21245864366915,"2nd Quartile",2013,"Platinum",2022,"Existing Non-Residential Buildings (RECERT 2017)",25510,2148,8.4202273618188939E-2,0,"Water Cooled Chilled Water Plant",10,0.60299999999999998,"2022-10-14"]
["MANULIFE TOWER","8 CROSS STREET, SINGAPORE 048424","Commercial Building","Office","Large",124.06687460351026,"2nd Quartile",124.54461831253965,"2nd Quartile",130.90780291816452,"2nd Quartile",1999,"Gold",2022,"Existing Non-Residential Buildings (RECERT 2017)",42561,34616,0.81332675454054182,0,"Water Cooled Chilled Water Plant",4,0.36899999999999999,"2022-11-06"]
["THE STRATEGY","2 INTERNATIONAL BUSINESS PARK, SINGAPORE 609930","Commercial Building","Office","Large",131.25676116966008,"2nd Quartile",139.39557666617188,"2nd Quartile",130.15033397654742,"2nd Quartile",2002,"GoldPlus",2021,"Existing Building for Non-Residential buildings (version 3)",67370,51680,0.76710702092919703,0,"Water Cooled Chilled Water Plant",5,0.62,"2021-03-21"]
["61 ROBINSON","61 ROBINSON AND 61 ROBINSON ROAD, SINGAPORE 068893","Commercial Building","Office","Large",196.20115247776366,"3rd Quartile",153.49997204574333,"2nd Quartile",129.82691613722997,"2nd Quartile",2000,"Gold",2021,"Existing Non-Residental Buildings ENRB: 2017",15740,12800,0.81321473951715373,0,"Air Cooled Chilled Water Plant","","",""]
["51 CUPPAGE ROAD","51 CUPPAGE ROAD, SINGAPORE 229469","Commercial Building","Office","Large",128.76074268154619,"2nd Quartile",131.65897978327672,"2nd Quartile",129.33787643538736,"2nd Quartile",1997,"Gold",2021,"Existing Building for Non-Residential buildings (version 2.1)",30915,25701,0.8313440077632217,0,"Water Cooled Chilled Water Plant",25,"",""]
["GREAT EASTERN CENTRE","1 PICKERING STREET, SINGAPORE 048659","Commercial Building","Office","Large",127.6473050272055,"2nd Quartile",125.37829605171372,"2nd Quartile",128.82546621401664,"2nd Quartile",2000,"Platinum",2019,"Existing Building for Non-Residential buildings (version 3)",26020,20206,0.77655649500384316,0,"Water Cooled Chilled Water Plant",3,"",""]
["MARINA ONE","5, 7, 9 STRAITS VIEW, SINGAPORE 018935","Commercial Building","Office","Large",113.97036579719092,null,117.68888276409498,null,127.3786585231407,null,2017,"Platinum",2022,"Existing Non-Residential Buildings (RECERT 2017)",226765,195173,0.86068396798447733,0,"District Cooling System (DCS)","",0.32,"2022-09-19"]
["SINGAPORE LAND TOWER","50 RAFFLES PLACE, SINGAPORE 048623","Commercial Building","Office","Large",182.7730512699589,"3rd Quartile",167.04484268678837,"3rd Quartile",126.85591861483528,"2nd Quartile",1982,"Platinum",2022,"Existing Non-Residental Buildings ENRB: 2017",74215,61495,0.82860607693862431,0,"Water Cooled Chilled Water Plant",7,0.63,"2022-10-24"]
["SINGAPORE AVIATION ACADEMY","1 AVIATION DRIVE, SINGAPORE 499867","Commercial Building","Office","Large",129.43065987124464,"2nd Quartile",123.21812410586553,"2nd Quartile",126.74568580114449,"2nd Quartile",1992,"Platinum",2022,"Existing Non-Residental Buildings ENRB: 2017",22368,11813,0.52812052932761089,0,"Water Cooled Chilled Water Plant",4,0.63,"2014-12-01"]
["JTC SUMMIT","8 JURONG TOWN HALL ROAD, SINGAPORE 609434","Commercial Building","Office","Large",127.70125116911076,"2nd Quartile",125.23245204439972,"2nd Quartile",126.31761960223763,"2nd Quartile",2000,"Platinum",2021,"Existing Building for Non-Residential buildings (version 2.1)",56667,54238,0.95713554626149255,0,"Water Cooled Chilled Water Plant",11,0.59199999999999997,"2021-09-24"]
["KEPPEL BAY TOWER","1 HARBOURFRONT AVENUE, SINGAPORE 098632","Commercial Building","Office","Large",125.19226639305144,"2nd Quartile",122.21223871337214,"2nd Quartile",126.26280185167509,"2nd Quartile",2002,"Platinum",2020,"Existing Non-Residental Buildings ENRB: 2017",41908,38443,0.91731888899494129,0,"Water Cooled Chilled Water Plant",8,0.59,"2018-05-22"]
["UE BIZHUB TOWER","79 ANSON ROAD, SINGAPORE 079906","Commercial Building","Office","Large",128.23615164147995,"2nd Quartile",121.51477704161394,"2nd Quartile",125.51179930023078,"2nd Quartile",1992,"GoldPlus",2019,"Existing Building for Non-Residential buildings (version 3)",26866,25505,0.94934117471897561,0,"Water Cooled Chilled Water Plant",3,0.67900000000000005,"2022-09-25"]
["KECK SENG TOWER","133 CECIL STREET, SINGAPORE 069535","Commercial Building","Office","Large",120.4363137327875,"Top Quartile",115.72683289914403,"Top Quartile",125.44982818508869,"2nd Quartile",1985,"Certified",2018,"Existing Building for Non-Residential buildings (version 2.1)",16122,11438,0.70946532688252073,0,"Water Cooled Chilled Water Plant",12,"",""]
["CENTRO PROPERTY HOLDING PTE LTD","NO. 1 MAGAZINE ROAD, SINGAPORE 059567","Commercial Building","Office","Large",139.96833978058214,"2nd Quartile",134.69222842285498,"2nd Quartile",123.04261525778426,"2nd Quartile",1999,"Platinum",2017,"Existing Building for Non-Residential buildings (version 3)",15769,12000,0.76098674614750461,0,"Water Cooled Chilled Water Plant",2016,0.6,"2020-11-01"]
["ROBINSON 77","77 ROBINSON ROAD, SINGAPORE 068896","Commercial Building","Office","Large",128.4581387772831,"2nd Quartile",123.77452492127267,"2nd Quartile",122.72218481919862,"2nd Quartile",1997,"Gold",2021,"Existing Building for Non-Residential buildings (version 3)",36836,30882,0.83836464328374416,0,"Water Cooled Chilled Water Plant",5,0.65,"2022-11-18"]
["THE TREASURY","100 HIGH STREET, SINGAPORE 179434","Commercial Building","Office","Large",115.66143975485384,"Top Quartile",118.68425462641545,"Top Quartile",122.35230183620214,"2nd Quartile",2000,"Platinum",2023,"GM:2021 In Operation",41771,27343,0.65459289937995258,0,"Water Cooled Chilled Water Plant",6,0.69099999999999995,"2022-02-28"]
["HAW PAR CENTRE","180 CLEMENCEAU AVENUE, SINGAPORE 239922","Commercial Building","Office","Large",151.76884799321994,"2nd Quartile",116.41664749682185,"Top Quartile",122.18032568557419,"2nd Quartile",2001,null,null,null,12291,11003,0.89520787568139293,0,"Water Cooled Chilled Water Plant",2.5,0.67600000000000005,"2021-01-11"]
["WINSLAND HOUSE I","3 KILLINEY ROAD, SINGAPORE 239519","Commercial Building","Office","Large",116.96446924462136,"Top Quartile",116.66892237702588,"Top Quartile",120.58553454648849,"Top Quartile",1997,"GoldPlus",2020,"Existing Building for Non-Residential buildings (version 3)",21102,19862,0.94123779736517865,0,"Water Cooled Chilled Water Plant",16,0.63800000000000001,"2020-08-26"]
["PARLIAMENT HOUSE","1 PARLIAMENT PLACE, SINGAPORE 178880","Commercial Building","Office","Large",126.45226410321276,"2nd Quartile",124.13450543890715,"2nd Quartile",120.29020996711358,"Top Quartile",1999,"Platinum",2022,"Existing Non-Residential Buildings (RECERT 2017)",19765,16269,0.82312167973690864,0,"Water Cooled Chilled Water Plant",9,"",""]
["GERMAN CENTRE","25 INTERNATIONAL BUSINESS PARK #01-78 GERMAN CENTRE, SINGAPORE 609916","Commercial Building","Office","Large",119.65272492046658,"Top Quartile",117.53799278897138,"Top Quartile",120.0632309650053,"Top Quartile",1995,"Platinum",2023,"GM:2021 In Operation",23575,19806,0.84012725344644745,0,"Water Cooled Chilled Water Plant",9,0.61,"2021-11-15"]
["31 INTERNATIONAL BUSINESS PARK","31 INTERNATIONAL BUSINESS PARK, SINGAPORE 609921","Commercial Building","Office","Large",116.42712133527399,"Top Quartile",110.47348921611251,"Top Quartile",118.61712946335747,"Top Quartile",1997,null,null,null,52903,352002,6.6537247415080429,0,"Air Cooled Chilled Water Plant","","",""]
["18 SPD","18 SCIENCE PARK DRIVE, SINGAPORE 118229","Commercial Building","Office","Large",580.14989216391086,"Bottom Quartile",171.11295830337886,"3rd Quartile",118.37571890726096,"Top Quartile",1996,null,null,null,16692,15504,0.92882818116462973,0,"Water Cooled Chilled Water Plant",11,"",""]
["THE CONCOURSE","300 BEACH ROAD, SINGAPORE 199555","Commercial Building","Office","Large",110.67829096679063,"Top Quartile",121.51745095525067,"2nd Quartile",117.00378189511476,"Top Quartile",1992,"Platinum",2022,"Existing Building for Non-Residential buildings (version 3)",62392,58287,0.93420630850108988,0,"Water Cooled Chilled Water Plant",9,0.65,"2018-03-15"]
["20 HARBOUR DRIVE","20 HARBOUR DRIVE, SINGAPORE 117612","Commercial Building","Office","Large",122.5276998579362,"Top Quartile",120.73207628395542,"Top Quartile",116.42705325240001,"Top Quartile",1998,"Certified",2022,"Existing Non-Residential Buildings (RECERT 2017)",23229,14631,0.62985922768952607,0,"Air Cooled Chilled Water Plant","",0.88200000000000001,"2022-10-01"]
["CINTECH II","75 SCIENCE PARK DRIVE, SINGAPORE 118255","Commercial Building","Office","Large",123.52416375273501,null,118.12589943357258,null,116.2012171032452,null,1990,"GoldPlus",2022,"Existing Non-Residential Buildings (RECERT 2017)",13207,10564,0.79987885212387366,0,"District Cooling System (DCS)","",0.59,"2019-03-01"]
["SUPREME COURT BUILDING","1 SUPREME COURT LANE, SINGAPORE 178879","Commercial Building","Office","Large",144.8529171766626,"2nd Quartile",143.97137222902217,"2nd Quartile",116.15036379708962,"Top Quartile",2005,"Platinum",2022,"Existing Non-Residental Buildings ENRB: 2017",58824,43516,0.73976608187134507,0,"Water Cooled Chilled Water Plant",0.6,0.83,"2021-02-16"]
["CIVIL DEFENCE ACADEMY","101 JALAN BAHAR, SINGAPORE 649734","Commercial Building","Office","Large",130.14368469851016,"2nd Quartile",118.37872785983758,"Top Quartile",116.08007737067588,"Top Quartile",1999,"Platinum",2022,"Existing Non-Residental Buildings ENRB: 2017",31278,25585,0.81798708357311845,0,"Water Cooled Chilled Water Plant",2,"",""]
["SOLARIS","1 FUSIONOPOLIS WALK, SINGAPORE 138628","Commercial Building","Office","Large",107.79466760299623,null,106.60274598158551,null,115.90108302122347,null,2010,"Platinum",2022,"New Building for Non-Residential buildings (version 3)",51264,41113,0.80198579900124844,0,"District Cooling System (DCS)","","",""]
["MAS BUILDING","10 SHENTON WAY, SINGAPORE 079117","Commercial Building","Office","Large",116.54781671745755,"Top Quartile",108.4524060368597,"Top Quartile",114.64304817878391,"Top Quartile",1985,"Platinum",2022,"Existing Non-Residential Buildings (RECERT 2017)",55128,40706,0.73839065447685381,0,"Water Cooled Chilled Water Plant",5,0.54200000000000004,"2022-03-15"]
["ALEXANDRA POINT","438 ALEXANDRA ROAD, SINGAPORE 119958","Commercial Building","Office","Large",108.6566461626018,"Top Quartile",106.56819603865075,"Top Quartile",113.41262701599842,"Top Quartile",1996,"Platinum",2021,"Existing Building for Non-Residential buildings (version 3)",24388.66,19990,0.81964322763120234,0,"Water Cooled Chilled Water Plant",10,0.57499999999999996,"2021-10-13"]
["CENTRIUM SQUARE","320 SERANGOON ROAD, SINGAPORE 218108","Commercial Building","Office","Large",35.544588155207627,"Top Quartile",86.811900298476189,"Top Quartile",111.4915269414044,"Top Quartile",2020,null,null,null,19097,15880,0.8315442216054878,0,"Water Cooled Chilled Water Plant",3,0.495,"2022-03-13"]
["REVENUE HOUSE","55 NEWTON ROAD, SINGAPORE 307987","Commercial Building","Office","Large",137.42628101464678,"2nd Quartile",112.52722820311416,"Top Quartile",111.15912766252367,"Top Quartile",1996,"Platinum",2022,"Existing Non-Residential Buildings (RECERT 2017)",86572,83381,0.96314050732338397,0,"Water Cooled Chilled Water Plant",10,0.61199999999999999,"2023-01-01"]
["THE SIGNATURE","51 CHANGI BUSINESS PARK CENTRAL 2, SINGAPORE 486066","Commercial Building","Office","Large",121.99931892005905,null,111.94946150601139,null,110.70700084370387,null,2002,"Gold",2023,"GM:2021 In Operation",47410,32745,0.690677072347606,0,"District Cooling System (DCS)","","",""]
["PLAZA 8","1 CHANGI BUSINESS PARK CRESCENT, SINGAPORE 486025","Commercial Building","Office","Large",129.10284118877678,null,115.50069222249569,null,109.54987478464189,null,2009,"Gold",2023,"Existing Non-Residential Buildings (RECERT 2017)",32504,32504,1,0,"District Cooling System (DCS)","","",""]
["NORDIC EUROPEAN CENTRE","3 INTERNATIONAL BUSINESS PARK, SINGAPORE 609927","Commercial Building","Office","Large",101.5154850996297,"Top Quartile",92.300747310879913,"Top Quartile",107.22704249691412,"Top Quartile",2000,"GoldPlus",2022,"Existing Non-Residential Buildings (RECERT 2017)",28355,27042,0.95369423382119556,0,"Water Cooled Chilled Water Plant",8,0.61799999999999999,"2002-07-18"]
["SOUTHPOINT","200 CANTONMENT ROAD, SINGAPORE 089763","Commercial Building","Office","Large",124.31016270248143,"2nd Quartile",116.39034219127986,"Top Quartile",107.0895206014025,"Top Quartile",1986,"Certified",2019,"Existing Building for Non-Residential buildings (version 3)",33735.81,27000,0.80033649703386411,0,"Water Cooled Chilled Water Plant",3,0.69,"2018-07-10"]
["MND BUILDING","5 MAXWELL ROAD, SINGAPORE 069110","Commercial Building","Office","Large",138.6674125301262,"2nd Quartile",120.89996557005306,"Top Quartile",106.50164052760925,"Top Quartile",1970,"Platinum",2022,"Existing Non-Residental Buildings ENRB: 2017",43687,24638,0.56396639732643583,0,"Water Cooled Chilled Water Plant",2,0.57999999999999996,"2020-12-17"]
["JALAN BESAR PLAZA","101 KITCHENER ROAD,\n#05-00\nJALAN BESAR PLAZA, SINGAPORE 208511","Commercial Building","Office","Large",105.73278620279511,"Top Quartile",103.3980808801665,"Top Quartile",106.32703716919417,"Top Quartile",1985,null,null,null,16815,0,0,0,"Water Cooled Chilled Water Plant",8,"",""]
["ENVIRONMENT BUILDING","40 SCOTTS ROAD, SINGAPORE 228231","Commercial Building","Office","Large",98.394222547941865,"Top Quartile",97.094468873417213,"Top Quartile",106.31471642034118,"Top Quartile",1986,"Platinum",2023,"GM:2021 In Operation",49122,30300,0.61683156223280811,0,"Water Cooled Chilled Water Plant",4,0.57999999999999996,"2016-11-30"]
["BEDOK CAMPUS","71 CHAI CHEE STREET, SINGAPORE 468981","Commercial Building","Office","Large",103.67295599225019,"Top Quartile",103.72616246886244,"Top Quartile",104.24680597841129,"Top Quartile",2017,"Gold",2023,"GM:2021 In Operation",21678,13750,0.63428360549866225,0,"Others","","",""]
["COLLEGE OF MEDICINE BUILDING","16 COLLEGE ROAD, SINGAPORE 169854","Commercial Building","Office","Large",144.72188130944738,"2nd Quartile",108.54570519927643,"Top Quartile",103.66396568827682,"Top Quartile",1926,"Platinum",2022,"Existing Non-Residential Buildings (RECERT 2017)",11277,6555,0.58127161479116785,0,"Water Cooled Chilled Water Plant",4,0.625,"2022-11-06"]
["AFRO-ASIA BUILDING","63 ROBINSON ROAD, SINGAPORE 068894","Commercial Building","Office","Large","",null,75.910811450201095,"Top Quartile",103.27898036432458,"Top Quartile",2021,null,null,null,16908,13,7.6886680861130822E-4,0,"Water Cooled Chilled Water Plant",2,0.60099999999999998,"2022-09-28"]
["MOUNTBATTEN SQUARE","229 MOUNTBATTEN ROAD, SINGAPORE 398007, SINGAPORE 398007","Commercial Building","Office","Large",98.54848413336012,"Top Quartile",102.19678248644306,"Top Quartile",101.56330186784494,"Top Quartile",2009,null,null,null,19916,17415,0.8744225748142197,0,"Others","","",""]
["STATE COURTS","1 HAVELOCK SQUARE, SINGAPORE 059724","Commercial Building","Office","Large",114.18552182823557,"Top Quartile",111.01193689339161,"Top Quartile",101.51868837245271,"Top Quartile",2019,"Platinum",2023,"GM:2021 In Operation",103444,72091,0.69690847221685159,0,"Water Cooled Chilled Water Plant",4,0.6,"2022-09-15"]
["CITY HOUSE","36 ROBINSON ROAD B1-01 CITY HOUSE S068877, SINGAPORE 068877","Commercial Building","Office","Large",99.330549711586713,"Top Quartile",87.795914797236023,"Top Quartile",100.93325292441408,"Top Quartile",1983,"Platinum",2021,"GM:2021 In Operation",21722.3,157771,7.2630890835684987,0,"Water Cooled Chilled Water Plant",5,0.57999999999999996,"2021-04-28"]
["CUSTOMS OPERATIONS COMMAND","1 BULIM DRIVE, SINGAPORE 648171","Commercial Building","Office","Large",89.914813614262556,"Top Quartile",95.065624913174346,"Top Quartile",100.19962491317435,"Top Quartile",2019,"Platinum",2019,"New Building for Non-Residential buildings (version 4.1)",21595,12000,0.55568418615420234,0,"Water Cooled Chilled Water Plant",4,"",""]
["HANSAPOINT","10 CHANGI BUSINESS PARK CENTRAL 2, SINGAPORE 486030","Commercial Building","Office","Large",146.77760637614088,null,132.45355444144491,null,99.375819514076355,null,2008,"Certified",2022,"Existing Non-Residential Buildings (RECERT 2017)",19447.5,16640,0.85563697133307626,0,"District Cooling System (DCS)","","",""]
["7 CBP","7 CHANGI BUSINESS PARK CENTRAL 1, SINGAPORE 486072","Commercial Building","Office","Large",176.66478744686171,null,161.88771005251314,null,95.925937109277328,null,2003,"GoldPlus",2022,"Existing Building for Non-Residential buildings (version 3)",15996,14000,0.8752188047011753,0,"District Cooling System (DCS)","","",""]
["HIGH STREET CENTRE","1 NORTH BRIDGE ROAD #B1-05A, SINGAPORE 179094","Commercial Building","Office","Large",92.421358604651161,"Top Quartile",93.930988604651162,"Top Quartile",95.55705534883721,"Top Quartile",1976,"Platinum",2022,"GM:2021 In Operation",43000,41000,0.95348837209302328,0,"Water-Cooled Package Units","","",""]
["GOODMAN ARTS CENTRE","90 GOODMAN ROAD BLOCK L #01-47, SINGAPORE 439053","Commercial Building","Office","Large",78.092002723952206,"Top Quartile",92.731066055841026,"Top Quartile",94.16780164675292,"Top Quartile",2010,null,null,null,16153,2843,0.17600445737633877,0,"Others","","",""]
["1A INTERNATIONAL BUSINESS PARK","1A INTERNATIONAL BUSINESS PARK, SINGAPORE 609933","Commercial Building","Office","Large",94.672339465637378,"Top Quartile",102.2135069427039,"Top Quartile",93.985036843952074,"Top Quartile",2009,"Gold",2022,"New Building for Non-Residential buildings (version 3)",19949,14913,0.74755626848463586,0,"Water Cooled Chilled Water Plant",12,0.7,"2023-01-16"]
["PLUS","20 CECIL STREET, SINGAPORE 049705","Commercial Building","Office","Large",73.05321377894515,"Top Quartile",79.729010053437193,"Top Quartile",89.350916281737767,"Top Quartile",2018,null,null,null,33123,29000,0.87552455997343237,0,"Others","","",""]
["THE OCTAGON","105 CECIL STREET, SINGAPORE 069534","Commercial Building","Office","Large",94.354800858573782,"Top Quartile",91.259751013594084,"Top Quartile",89.064597185785829,"Top Quartile",1982,"Certified",2018,"Existing Building for Non-Residential buildings (version 3)",20965,15000,0.71547817791557355,0,"Water Cooled Chilled Water Plant",8,0.72099999999999997,"2023-04-24"]
["17CBP","17 CHANGI BUSINESS PARK CENTRAL 1, SINGAPORE 486073","Commercial Building","Office","Large",103.33721346786078,null,104.92554132184559,null,88.550527717945812,null,2000,"GoldPlus",2022,"Existing Non-Residental Buildings ENRB: 2017",17642,12224,0.69289196236254391,0,"District Cooling System (DCS)","",0.18,"2022-12-08"]
["ICON","3A INTERNATIONAL BUSINESS PARK, SINGAPORE 609935","Commercial Building","Office","Large",84.607528259231358,"Top Quartile",81.801605124340611,"Top Quartile",88.439069450859321,"Top Quartile",2009,"GoldPlus",2022,"Existing Non-Residential Buildings (RECERT 2017)",41137,40137,0.97569098378588615,0,"Water Cooled Chilled Water Plant",14,"",""]
["STANDARD CHARTERED @ CHANGI 2","9 CHANGI BUSINESS PARK CRESCENT, SINGAPORE 486005","Commercial Building","Office","Large",89.714211815954258,null,85.572774298938199,null,85.743642798802071,null,2014,"Gold",2020,"New Building for Non-Residential buildings (version 4)",18365,15073,0.82074598420909339,0,"District Cooling System (DCS)","","",""]
["INTERPOL GOBAL COMPLEX SINGAPORE","18 NAPIER ROAD, SINGAPORE 258510","Commercial Building","Office","Large",82.200676484123335,"Top Quartile",80.42523305502597,"Top Quartile",85.328502399579264,"Top Quartile",2015,"Platinum",2014,"New Building for Non-Residential buildings (version 4)",15211,12160,0.79942147130366181,0,"Water Cooled Chilled Water Plant",6,"",""]
["ACER BUILDING","29 INTERNATIONAL BUSINESS PARK, SINGAPORE 609923","Commercial Building","Office","Large",102.88712897762726,"Top Quartile",85.225602994919342,"Top Quartile",83.679580622158838,"Top Quartile",1998,null,null,null,22438,22337,0.9954987075496925,0,"Water Cooled Chilled Water Plant",12,"",""]
["SINGAPORE GIRLS HOME","1 DEFU AVE 1, SINGAPORE 539540, SINGAPORE 539540","Commercial Building","Office","Large",83.448384402541507,"Top Quartile",80.148342898134871,"Top Quartile",83.673820967411359,"Top Quartile",2004,null,null,null,19516,1090,5.585160893625743E-2,0,"Others","","",""]
["NATIONAL SERVICE TRAINING CENTRE","91 JALAN BAHAR, SINGAPORE 649735","Commercial Building","Office","Large",91.94971443374375,"Top Quartile",87.891266305010362,"Top Quartile",82.853594111910269,"Top Quartile",2005,null,null,null,32812,34622,1.0551627453370718,0,"Others","","",""]
["SINGAPORE BOYS' HOME","3 BULIM DR, SINGAPORE 648172, SINGAPORE 648172","Commercial Building","Office","Large",81.873754058650732,"Top Quartile",81.058350770499402,"Top Quartile",81.116729887130845,"Top Quartile",2019,"GoldPlus",2022,"Existing Non-Residential Buildings (RECERT 2017)",19403,4910,0.25305365149719117,0,"Others","","",""]
["1KAY SIANG ROAD","1 KAY SIANG ROAD, SINGAPORE 248922","Commercial Building","Office","Large",83.392564442382863,"Top Quartile",78.123525279968206,"Top Quartile",80.243548472599556,"Top Quartile",1960,null,null,null,15091,9500,0.62951428003445764,0,"Others","","",""]
["HOME TEAM ACADEMY","501 OLD CHOA CHU KANG ROAD, SINGAPORE 698928","Commercial Building","Office","Large",87.042146675476005,"Top Quartile",80.244224878371085,"Top Quartile",77.289569944140794,"Top Quartile",2005,"Platinum",2019,"Existing Building for Non-Residential buildings (version 3)",133192,57969,0.43522884257312749,0,"Water Cooled Chilled Water Plant",5,1.6049,"2023-01-31"]
["HSBC BUILDING","21 COLLYER QUAY, SINGAPORE 049320, SINGAPORE 049320","Commercial Building","Office","Large",83.410487267668771,"Top Quartile",41.210324973917075,"Top Quartile",75.913839406468568,"Top Quartile",1982,null,null,null,25879,20000,0.77282738900266623,0,"Water Cooled Chilled Water Plant",12,0.72,"2016-10-26"]
["MITSUBISHI ELECTRIC BUILDING","307 ALEXANDRA ROAD, SINGAPORE 159943","Commercial Building","Office","Large",77.487132220487567,"Top Quartile",77.565716944878105,"Top Quartile",75.130189744205595,"Top Quartile",1991,"Platinum",2021,"Existing Building for Non-Residential buildings (version 3)",16654,6662,0.40002401825387296,0,"Others","","",""]
["AKZONOBLE HOUSE","3 CHANGI BUSINESS PARK VISTA, SINGAPORE 486051","Commercial Building","Office","Large",85.460403120936277,null,78.859115734720419,null,73.628516514954484,null,2003,"Gold",2022,"Existing Non-Residential Buildings (RECERT 2017)",19225,19225,1,0,"District Cooling System (DCS)","","",""]
["NKF CENTRE","81 KIM KEAT ROAD, SINGAPORE 328836","Commercial Building","Office","Large",67.676824989526594,"Top Quartile",68.829058441558445,"Top Quartile",71.671325408462494,"Top Quartile",1999,null,null,null,19096,9096,0.4763301214914118,0,"Others","","",""]
["HAITE BUILDING","15 CHANGI BUSINESS PARK CRESCENT, SINGAPORE 486006","Commercial Building","Office","Large",68.841721927092863,null,72.240245466202595,null,71.161432496794291,null,2014,null,null,null,16377,11180,0.68266471270684492,0,"District Cooling System (DCS)","","",""]
["RAZER SEA HQ","1 ONE-NORTH CRESCENT, SINGAPORE 138538","Commercial Building","Office","Large","",null,31.078368757198199,null,69.72086273688619,null,2021,null,null,null,19102,16784,0.87865145010993617,0,"District Cooling System (DCS)","","",""]
["ONE RAFFLES QUAY PTE LTD","1 RAFFLES QUAY, SINGAPORE 048583","Commercial Building","Office","Large",186.9554510797085,null,138.74708013956058,null,69.669917691592687,null,2006,"Platinum",2022,"Existing Non-Residential Buildings (RECERT 2017)",148466,140000,0.94297684318295094,0,"District Cooling System (DCS)","","",""]
["EIGHTRIUM","15A CHANGI BUSINESS PARK CENTRAL 1, SINGAPORE 486035","Commercial Building","Office","Large",76.705804324324319,null,65.978946486486478,null,68.855042162162164,null,2007,null,null,null,18500,18000,0.97297297297297303,0,"District Cooling System (DCS)","","",""]
["SINGAPORE EXAMINATIONS AND ASSESSMENT BOARD","298 JALAN BUKIT HO SWEE, SINGAPORE 169565","Commercial Building","Office","Large",57.388453701607425,"Top Quartile",69.030095087163232,"Top Quartile",63.736701381027849,"Top Quartile",2020,"Platinum",2021,"Non-Residential Buildings NRB: 2015",22085,11905,0.53905365632782432,0,"Water Cooled Chilled Water Plant",3,0.56000000000000005,"2021-12-09"]
["ALICE @ MEDIAPOLIS","29 MEDIA CIRCLE, SINGAPORE 138565","Commercial Building","Office","Large",53.290293670886079,null,54.689286075949362,null,62.387091139240511,null,2018,"Platinum",2022,"Existing Non-Residential Buildings (RECERT 2017)",39500,16035,0.40594936708860757,0,"District Cooling System (DCS)","","",""]
["JURONG TOWN HALL (JTH)","9 JURONG TOWN HALL ROAD, SINGAPORE 609431","Commercial Building","Office","Large",65.2726310576044,"Top Quartile",65.987356370009138,"Top Quartile",62.203838768668092,"Top Quartile",2002,"Platinum",2020,"Existing Building for Non-Residential buildings (version 3)",26248,21823,0.83141572691252663,0,"Water Cooled Chilled Water Plant",5,"",""]
["MOEHQ (GRANGE ROAD)","51 GRANGE ROAD, SINGAPORE 249564","Commercial Building","Office","Large",51.812814113597248,"Top Quartile",48.306804360298337,"Top Quartile",56.758608720596676,"Top Quartile",1978,"Certified",2017,"New Building for Non-Residential buildings (version 4.1)",20916,14101,0.67417288200420733,0,"Others","","",""]
["9 CBP","9 CHANGI BUSINESS PARK CENTRAL 1, SINGAPORE 486048","Commercial Building","Office","Large",56.469148779137711,null,52.155671320499422,null,50.973583246202104,null,2003,"GoldPlus",2022,"Existing Building for Non-Residential buildings (version 3)",16259,15500,0.95331816224860078,0,"District Cooling System (DCS)","","",""]
["RIGEL INNOVATION CENTRE","20 CHANGI BUSINESS PARK CENTRAL 2, SINGAPORE 486031","Commercial Building","Office","Large",37.414474671669794,null,45.861412132582863,null,40.951581613508445,null,2015,"Gold",2016,"New Building for Non-Residential buildings (version 4.1)",15990,13141,0.82182614133833642,0,"District Cooling System (DCS)","","",""]
["BCA BRADDELL CAMPUS","200 BRADDELL ROAD, SINGAPORE 579700","Commercial Building","Office","Large",37.803363529674471,"Top Quartile",39.004127655486492,"Top Quartile",39.996559746174185,"Top Quartile",1994,"Platinum",2022,"New Non-Residential Buildings (NRB: 2015) (R3)",46217.52,18758,0.40586340418092537,0,"Water Cooled Chilled Water Plant",3,"",""]
["15 CBP","15 CHANGI BUSINESS PARK CENTRAL 1, SINGAPORE 486057","Commercial Building","Office","Large",33.62480829831933,null,43.10006302521009,null,39.210755252100839,null,2003,"Gold",2022,"Existing Building for Non-Residential buildings (version 2.1)",19040,14000,0.73529411764705888,0,"District Cooling System (DCS)","","",""]
["HDB CENTRE OF BUILDING RESEARCH","10 WOODLANDS AVENUE 8 SINGAPORE 738973\n1 WOODLANDS INDUSTRIAL PARK E3 SINGAPORE 757780\nPLEASE NOTE THAT THERE ARE 2 ADDRESSES FOR THIS PREMISE, SINGAPORE 738973","Commercial Building","Office","Large",53.525284371669407,"Top Quartile",34.921141846720275,"Top Quartile",38.274605173917259,"Top Quartile",2000,"Platinum",2014,"Existing Building for Non-Residential buildings (version 3)",20642,5300,0.25675806607886831,0,"Others","","",""]
["MOEHQ (BALESTIER)","565 BALESTIER ROAD, SINGAPORE 329927","Commercial Building","Office","Large","",null,"",null,36.996613496932518,"Top Quartile",2022,null,null,null,16300,5670,0.34785276073619631,0,"Others","","",""]
["BISHAN SPORT HALL","5, BISHAN STREET 14, SINGAPORE 579783","Commercial Building","Office","Large",24.311255208641004,"Top Quartile",29.546806199930018,"Top Quartile",35.210308678720565,"Top Quartile",1998,"Gold",2022,"Existing Non-Residental Buildings ENRB: 2017",2372,0,0,0,"Others","","",""]
["JURONG EAST ACTIVESG SPORT CENTRE","21 JURONG EAST ST 31, SINGAPORE 609517","Commercial Building","Office","Large",32.553856416563264,"Top Quartile",27.471991347220236,"Top Quartile",25.549601401135401,"Top Quartile",2000,"Gold",2022,"Existing Non-Residental Buildings ENRB: 2017",91069,8,8.7845479801029985E-5,0,"Others","","",""]
["CONNECTION ONE","BLK 167, 168 & 169 \nJALAN BUKIT MERAH, SINGAPORE 150168","Commercial Building","Office","Large",284.66703329844415,"Bottom Quartile",72.638258617325121,"Top Quartile",1.0427717362380031,"Top Quartile",1986,"Platinum",2020,"Existing Building for Non-Residential buildings (version 3)",56369,64356,1.1416913551774912,0,"Water Cooled Chilled Water Plant",20,"",""]
["THE MANAGEMENT CORPORATION- STRATA TITLE PLAN NO. 4728","9 TAMPINES GRANDE, SINGAPORE 528735","Commercial Building","Office","Large",0,null,0,null,0,null,2009,"Platinum",2021,"Existing Building for Non-Residential buildings (version 2.1)",33599,2601,7.7413018244590612E-2,0,"Water Cooled Chilled Water Plant",14,0.64,"2021-05-12"]
["UOB TAMPINES CENTRE","1 TAMPINES CENTRAL 1, SINGAPORE 529539","Commercial Building","Office","Medium",1508.8210443571029,"Bottom Quartile",1515.5967209432904,"Bottom Quartile",1528.2336889387984,"Bottom Quartile",1997,null,null,null,8905,8904,0.99988770353733858,0,"Water Cooled Chilled Water Plant",25,1.18,"2018-09-05","Office Building with Non-Typical Activity (e.g. Industrial Function)"]
["M1 , MAIN OPERATION CENTER","10 INTERNATIONAL BUSINESS PARK, SINGAPORE 609928","Commercial Building","Office","Medium",1221.8770311442113,"Bottom Quartile",1312.2011255924172,"Bottom Quartile",1292.4828622207176,"Bottom Quartile",1997,null,null,null,11816,11816,1,0,"Water Cooled Chilled Water Plant",26,"","","Office Building with Non-Typical Activity (e.g. Industrial Function)"]
["THE ARIES","51 SCIENCE PARK ROAD, SINGAPORE 117586","Commercial Building","Office","Medium",946.61479804894759,"Bottom Quartile",958.52610217354095,"Bottom Quartile",1007.7821376005477,"Bottom Quartile",1999,"Gold",2023,"GM:2021 In Operation",11686,11683,0.99974328256032863,0,"Others","","","","Office Building with Non-Typical Activity (e.g. Industrial Function)"]
["MENICON SINGAPORE PTE LTD","8 INTERNATIONAL BUSINESS PARK, SINGAPORE 609925","Commercial Building","Office","Medium",1056.8227557915059,"Bottom Quartile",1052.297689430502,"Bottom Quartile",983.44230212355205,"Bottom Quartile",1995,null,null,null,8288,5942,0.71694015444015446,0,"Air Cooled Chilled Water Plant","","","","Office Building with Non-Typical Activity (e.g. Industrial Function)"]
["TECHSQ","722 UPPER CHANGI ROAD EAST, SINGAPORE 486854","Commercial Building","Office","Medium",263.06255666364461,"Bottom Quartile",186.04104508365614,"3rd Quartile",787.21173658616999,"Bottom Quartile",1983,null,null,null,12133,8736,0.72001978076320783,0,"Water Cooled Chilled Water Plant",20,1.3779999999999999,"2022-09-30"]
["HI-P BUILDING","11 INTERNATIONAL BUSINESS PARK, SINGAPORE 609926","Commercial Building","Office","Medium",926.21018507244617,"Bottom Quartile",970.33553512723734,"Bottom Quartile",733.09742237915498,"Bottom Quartile",1997,null,null,null,8213,3413,0.41556069645683674,0,"Water Cooled Chilled Water Plant",2,"","","Office Building with Non-Typical Activity (e.g. Industrial Function)"]
["M1 LIMITED","9 INTERNATIONAL BUSINESS PARK, SINGAPORE 609915","Commercial Building","Office","Medium",805.5617244525547,"Bottom Quartile",747.00843978102193,"Bottom Quartile",731.16576186131385,"Bottom Quartile",2003,"Gold",2019,"New Building for Non-Residential buildings (version 4)",10960,10960,1,0,"Water Cooled Chilled Water Plant",9,0.6,"2019-05-22","Office Building with Non-Typical Activity (e.g. Industrial Function)"]
["CPF BISHAN BUILDING","3 BISHAN PLACE, SINGAPORE 579838","Commercial Building","Office","Medium",654.72073449131517,"Bottom Quartile",567.97196401985116,"Bottom Quartile",506.44168734491313,"Bottom Quartile",1997,"GoldPlus",2021,"Existing Non-Residental Buildings ENRB: 2017",8060,6500,0.80645161290322576,0,"Water Cooled Chilled Water Plant",2020,0.56599999999999995,"2020-02-27","Office Building with Non-Typical Activity (e.g. Industrial Function)"]
["SUNSHINE PLAZA","10 PRINSEP LINK, SINGAPORE 187948","Commercial Building","Office","Medium",136.52317479867364,"2nd Quartile",397.42179346281387,"Bottom Quartile",398.33542302226431,"Bottom Quartile",2001,null,null,null,10555,10552,0.99971577451444815,0,"Others","","",""]
["NATIONAL ARCHIVES SINGAPORE","1 CANNING RISE, SINGAPORE 179868","Commercial Building","Office","Medium",440.84401022644266,"Bottom Quartile",422.72503652300952,"Bottom Quartile",397.60390796201608,"Bottom Quartile",1997,null,null,null,8214,5679,0.69138056975894813,0,"Air Cooled Chilled Water Plant","","",""]
["NEW WORLD CENTRE","1 JALAN BERSEH, SINGAPORE 209037","Commercial Building","Office","Medium",283.80390691532949,"Bottom Quartile",277.37057927475746,"Bottom Quartile",344.07889937910693,"Bottom Quartile",2000,null,null,null,8724.5300000000007,100,1.1461935485349926E-2,0,"Others","","",""]
["OCBC CENTRE SOUTH","18 CHURCH STREET, SINGAPORE 049479","Commercial Building","Office","Medium",361.59347334117859,"Bottom Quartile",344.620553091337,"Bottom Quartile",325.84723273286863,"Bottom Quartile",1986,"Gold",2022,"Existing Non-Residential Buildings (RECERT 2017)",11047,8824,0.79876889653299543,0,"Water Cooled Chilled Water Plant",12,0.69599999999999995,"2016-06-07","Office Building with Non-Typical Activity (e.g. Industrial Function)"]
["SULTAN-LINK","53 MOHD SULTAN ROAD, SINGAPORE 238993","Commercial Building","Office","Medium",346.56835855112331,"Bottom Quartile",317.69989454378725,"Bottom Quartile",300.71985327831271,"Bottom Quartile",2011,null,null,null,2181,1486,0.68133883539660711,0,"Others","","",""]
["THE CAVENDISH","85 SCIENCE PARK DRIVE, SINGAPORE 118259","Commercial Building","Office","Medium",430.40304337899533,"Bottom Quartile",277.7588287671233,"Bottom Quartile",290.04740296803652,"Bottom Quartile",1992,null,null,null,8760,0,0,0,"Others","","",""]
["GUTHRIE HOUSE","1 FIFTH AVENUE, SINGAPORE 268802","Commercial Building","Office","Medium",265.09362370902562,"Bottom Quartile",273.01206780422092,"Bottom Quartile",277.61321284238886,"Bottom Quartile",1998,null,null,null,8908,8907,0.99988774135608438,0,"Water Cooled Chilled Water Plant",5,"",""]
["CPIB BUILDING","2 LENGKOK BAHRU, SINGAPORE 159047","Commercial Building","Office","Medium",231.49383802816902,"Bottom Quartile",246.97183098591549,"Bottom Quartile",259.96742957746477,"Bottom Quartile",2004,null,null,null,5680,4202,0.73978873239436616,0,"Others","","",""]
["UOB KAY HIAN","8 ANTHONY ROAD, SINGAPORE 229957","Commercial Building","Office","Medium",273.33120000000002,"Bottom Quartile",266.70848932038831,"Bottom Quartile",259.69975922330099,"Bottom Quartile",2009,null,null,null,12875,12763,0.99130097087378644,0,"Air Cooled Chilled Water Plant","","",""]
["NEW BRIDGE CENTRE","336 SMITH STREET, SINGAPORE 050336","Commercial Building","Office","Medium",211.89316913279643,"3rd Quartile",241.12633451957299,"Bottom Quartile",257.26115471061996,"Bottom Quartile",1986,"Gold",2019,"Existing Building for Non-Residential buildings (version 3)",10678,9000,0.84285446712867573,0,"Water-Cooled Package Units","","",""]
["LAND TRANSPORT AUTHORITY","SIN MING OFFICE\n10 SIN MING DRIVE, SINGAPORE 575701","Commercial Building","Office","Medium",282.87021567106285,"Bottom Quartile",270.53065011636926,"Bottom Quartile",257.17409231962762,"Bottom Quartile",1990,"Platinum",2011,"New Building for Non-Residential buildings (version 3)",12890,9670,0.75019394879751744,0,"Water Cooled Chilled Water Plant","",0.7,"2023-01-31","Office Building with Non-Typical Activity (e.g. Industrial Function)"]
["MAYBANK TOWER","2 BATTERY ROAD, SINGAPORE 049907","Commercial Building","Office","Medium",315.97618253385815,"Bottom Quartile",276.77396757622256,"Bottom Quartile",256.37247314697447,"Bottom Quartile",2001,"Certified",2020,"Existing Non-Residental Buildings ENRB: 2017",14989,14873,0.99226099139368873,0,"Water Cooled Chilled Water Plant",1,"",""]
["TAN CHONG TOWER","15 QUEEN STREET, SINGAPORE 188537","Commercial Building","Office","Medium",227.94052144016806,"Bottom Quartile",242.90866201890938,"Bottom Quartile",250.43400821316015,"2nd Quartile",1980,null,null,null,10471,7202,0.68780441218603761,0,"Others","","",""]
["THE CRIMSON","31 SCIENCE PARK ROAD, SINGAPORE 117611","Commercial Building","Office","Medium",256.61915950757242,"Bottom Quartile",257.49486759365863,"Bottom Quartile",249.88562571959969,"2nd Quartile",1997,null,null,null,11291,10627,0.94119209990257724,0,"Water Cooled Chilled Water Plant",2,0.7,"2017-06-03","Office Building with Non-Typical Activity (e.g. Industrial Function)"]
["ARC 380","380 JALAN BESAR, SINGAPORE 209000","Commercial Building","Office","Medium",141.96703980099502,"2nd Quartile",224.15980528392518,"Bottom Quartile",234.92660319094182,"2nd Quartile",2018,null,null,null,11658,11559,0.99150797735460627,0,"Water Cooled Chilled Water Plant",5,"",""]
["BEA BUILDING","60 ROBINSON ROAD, SINGAPORE 068892","Commercial Building","Office","Medium",262.95053064371064,"Bottom Quartile",249.72294616471797,"Bottom Quartile",233.00322369266351,"2nd Quartile",2009,null,null,null,7783,5867,0.75382243350892975,0,"Air Cooled Chilled Water Plant","","",""]
["1CBP","1 CHANGI BUSINESS PARK AVENUE 1, SINGAPORE 486058","Commercial Building","Office","Medium","",null,"",null,230.99279469548134,null,45149,"Certified",2022,"Existing Non-Residential Buildings (RECERT 2017)",10180,11695,1.1488212180746562,0,"District Cooling System (DCS)","","",""]
["223 @MOUNTBATTEN","223 MOUNTBATTEN RD, #01-05, SINGAPORE 398008, SINGAPORE 398008","Commercial Building","Office","Medium",205.89045943817277,null,182.05873457600418,null,226.41768443160933,null,2012,null,null,null,3809,1000,0.26253609871357314,0,"District Cooling System (DCS)","","",""]
["INCOME CENTRE","75 BRAS BASAH ROAD, SINGAPORE 189557","Commercial Building","Office","Medium",229.55747440273038,"Bottom Quartile",212.09093060295791,"3rd Quartile",225.31584072810011,"2nd Quartile",1990,"GoldPlus",2022,"GM:2021 In Operation",8790,6539,0.7439135381114903,0,"Others","","",""]
["OCBC TAMPINES CENTRE TWO","31 TAMPINES AVENUE 4, SINGAPORE 529680","Commercial Building","Office","Medium",314.06721710526318,"Bottom Quartile",301.07987236842104,"Bottom Quartile",224.50304605263156,"2nd Quartile",1998,"Gold",2022,"Existing Non-Residential Buildings (RECERT 2017)",7600,7419,0.97618421052631577,0,"Water Cooled Chilled Water Plant",10,0.79700000000000004,"2022-08-31"]
["SINGAPORE POOLS BUILDING","210 MIDDLE ROAD, SINGAPORE 188994","Commercial Building","Office","Medium",227.25874552244494,"Bottom Quartile",224.25443944821279,"Bottom Quartile",222.12190381830652,"2nd Quartile",2013,"GoldPlus",2022,"Existing Non-Residential Buildings (RECERT 2017)",13121,12587,0.95930188247846959,0,"Water Cooled Chilled Water Plant",10,0.67,"2016-09-23"]
["AIA ALEXANDRA","371 ALEXANDRA ROAD, AIA ALEXANDRA #01-01. SINGAPORE 159963, SINGAPORE 159963","Commercial Building","Office","Medium",234.11232349165596,"Bottom Quartile",234.8556516451591,"Bottom Quartile",221.12451861360719,"2nd Quartile",1995,null,null,null,14801,17642,1.19194649010202,0,"Air Cooled Chilled Water Plant","","",""]
["HPL HOUSE","50 CUSCADEN ROAD, SINGAPORE 249724","Commercial Building","Office","Medium",216.26585322843189,"3rd Quartile",212.43017498643516,"3rd Quartile",220.36118149755831,"2nd Quartile",1980,null,null,null,7372,7163,0.97164948453608246,0,"Others","","",""]
["IOB BUILDING","IOB BUILDING @ 64 CECIL STREET, SINGAPORE 049711","Commercial Building","Office","Medium",242.3744864018783,"Bottom Quartile",237.84151829387596,"Bottom Quartile",220.08530620230874,"2nd Quartile",1984,null,null,null,5111,2100,0.41087849735863824,0,"Water Cooled Chilled Water Plant",30,"",""]
["3RD SCDF DIVISION HQ / YISHUN FIRE STATION","533 YISHUN INDUSTRIAL PARK A, SINGAPORE 768774","Commercial Building","Office","Medium",214.44621392579018,"3rd Quartile",203.4183005038937,"3rd Quartile",220.01164223545581,"2nd Quartile",2005,null,null,null,13098,9195,0.70201557489693078,0,"Air Cooled Chilled Water Plant","",2,"2019-11-01"]
["RHB BANK BUILDING","90 CECIL STREET, SINGAPORE 069531","Commercial Building","Office","Medium",222.4462405883383,"3rd Quartile",208.86382419891439,"3rd Quartile",216.73091227455788,"2nd Quartile",1974,null,null,null,5711,5711,1,0,"Water-Cooled Package Units","","",""]
["SULTAN PLAZA","100 JALAN SULTAN, SINGAPORE 199001","Commercial Building","Office","Medium",202.54317846757283,"3rd Quartile",201.73386352877526,"3rd Quartile",215.06336849935752,"2nd Quartile",1980,"Gold",2017,"Existing Building for Non-Residential buildings (version 3)",14787,18000,1.2172854534388313,0,"Water Cooled Chilled Water Plant",6,0.77,"2023-03-13"]
["OCBC TAMPINES CENTRE ONE","11 TAMPINES CENTRAL 1, SINGAPORE 529542","Commercial Building","Office","Medium",236.91848350193814,"Bottom Quartile",240.97801834168479,"Bottom Quartile",214.7826226718351,"2nd Quartile",1998,"Gold",2022,"Existing Non-Residential Buildings (RECERT 2017)",10577,9171,0.86707005767230783,0,"Water Cooled Chilled Water Plant",3,0.68,"2022-07-25"]
["SEMBCORP HQ BUILDING","30 HILL STREET, SINGAPORE 179360","Commercial Building","Office","Medium",188.51090612577718,"3rd Quartile",207.91122209764549,"3rd Quartile",210.97344817042097,"2nd Quartile",2000,"Gold",2020,"Existing Building for Non-Residential buildings (version 3)",9811,9809,0.99979614718173482,0,"Water Cooled Chilled Water Plant",7,"",""]
["BURLINGTON SQUARE","175 BENCOOLEN STREET, SINGAPORE 189649","Commercial Building","Office","Medium",239.15601353790612,"Bottom Quartile",224.4811489169675,"Bottom Quartile",207.78184476534295,"2nd Quartile",1998,null,null,null,11080,11080,1,0,"Others","","",""]
["CHOA CHU KANG CENTRE","309 CHOA CHU KANG AVE 4, SINGAPORE 680309","Commercial Building","Office","Medium","",null,199.39217703132093,"3rd Quartile",207.1978765320018,"2nd Quartile",2021,"GoldPlus",2022,"Existing Non-Residential Buildings (RECERT 2017)",11015,7800,0.70812528370403993,0,"Others","","",""]
["ST JAMES POWER STATION","3 SENTOSA GATEWAY, SINGAPORE 098544","Commercial Building","Office","Medium","",null,52.536740331491714,"Top Quartile",205.71665131982812,"2nd Quartile",2021,null,null,null,13032,8650,0.66375076734192762,0,"Water Cooled Chilled Water Plant",1,0.65600000000000003,"2022-11-16"]
["50 SCOTTS ROAD","50 SCOTTS ROAD, SINGAPORE 228242","Commercial Building","Office","Medium",202.68195233527632,"3rd Quartile",199.96352468088244,"3rd Quartile",204.106493027374,"2nd Quartile",2008,"Gold",2020,"Existing Building for Non-Residential buildings (version 2.1)",13553,11791,0.86999188371578251,0,"Others","",0.85,"2020-11-10"]
["TAMPINES PLAZA 2","5 TAMPINES CENTRAL 1, SINGAPORE 529541","Commercial Building","Office","Medium",189.6582989344341,"3rd Quartile",196.07641355476625,"3rd Quartile",201.60631659786887,"2nd Quartile",1999,null,null,null,10417,8463,0.81242200249592011,0,"Water Cooled Chilled Water Plant",6,0.63800000000000001,"2022-04-25"]
["JURONG REGIONAL LIBRARY","21 JURONG EAST CENTAL 1, SINGAPORE 609732","Commercial Building","Office","Medium",168.53292987272275,"3rd Quartile",201.38285500374343,"3rd Quartile",200.79274436402963,"2nd Quartile",1988,null,null,null,12021,12021,1,0,"Water Cooled Chilled Water Plant",20,"",""]
["137 TELOK AYER","137 TELOK AYER STREET SINGAPORE 068602, SINGAPORE 068602","Commercial Building","Office","Medium","",null,190.27352214881404,"3rd Quartile",200.57217914004116,"2nd Quartile",2021,null,null,null,9233,9233,1,0,"Others","","",""]
["SIF BUILDING","96 ROBINSON ROAD, SINGAPORE 068899","Commercial Building","Office","Medium",222.86959204487508,"3rd Quartile",206.67533911269763,"3rd Quartile",199.04083758286589,"2nd Quartile",2007,null,null,null,7844,5473,0.69773074961754211,0,"Others","","",""]
["RAFFLES FINANCIAL CENTRE PTE LTD","25 NORTH BRIDGE\n25 NORTH BRIDGE ROAD, SINGAPORE 179104","Commercial Building","Office","Medium",198.62418187394573,"3rd Quartile",141.33872258856005,"2nd Quartile",197.39390430915503,"2nd Quartile",2009,null,null,null,6521,5800,0.88943413586873177,0,"Others","","",""]
["SENTOSA DEVELOPMENT CORPORATION","33 ARTILLERY AVENUE SENTOSA, SINGAPORE 099958","Commercial Building","Office","Medium",202.93681288678559,"3rd Quartile",194.10442300691662,"3rd Quartile",197.25412267928647,"2nd Quartile",2014,"Gold",2021,"Existing Building for Non-Residential buildings (version 3)",5494,5200,0.94648707681106659,0,"Others","","",""]
["2ND SCDF DIVISION HQ / TAMPINES FIRE STATION","1 TAMPINES INDUSTRIAL AVENUE 3, SINGAPORE 528777","Commercial Building","Office","Medium",170.55528060701349,"3rd Quartile",174.3173648232962,"3rd Quartile",192.59160844897124,"2nd Quartile",2006,null,null,null,14629,10960,0.74919680087497431,0,"Air Cooled Chilled Water Plant","",1.44,"2019-11-01"]
["KEBUN BARU COMMUNITY CLUB","216 ANG MO KIO AVENUE 4, SINGAPORE 569897","Commercial Building","Office","Medium",176.90104244023584,"3rd Quartile",205.67220642941768,"3rd Quartile",190.47221022890164,"2nd Quartile",2018,null,null,null,5790.26,2290,0.39549173957646117,0,"Water-Cooled Package Units",null,"",""]
["ORCHARD BUILDING","1 GRANGE ROAD, SINGAPORE 239693","Commercial Building","Office","Medium",186.4623083015336,"3rd Quartile",188.43703650370796,"3rd Quartile",190.4671322629419,"2nd Quartile",1997,"Gold",2022,"Existing Building for Non-Residential buildings (version 3)",13889,10279,0.74008207934336523,0,"Water Cooled Chilled Water Plant",5,0.62,"2022-02-17"]
["MAXWELL CHAMBERS PTE LTD","32 MAXWELL ROAD, SINGAPORE 069115","Commercial Building","Office","Medium",180.60005131128847,"3rd Quartile",190.08262257696691,"3rd Quartile",185.95952109464082,"2nd Quartile",2009,null,null,null,7016,6694,0.95410490307867735,0,"Others","","",""]
["TAMPINES PLAZA 1","3 TAMPINES CENTRAL 1, SINGAPORE 529540","Commercial Building","Office","Medium",129.775633640553,"2nd Quartile",161.03677035330261,"3rd Quartile",181.91436251920123,"2nd Quartile",1999,null,null,null,10416,8436,0.80990783410138245,0,"Water Cooled Chilled Water Plant",6,0.65300000000000002,"2022-04-25"]
["NATIONAL DESIGN CENTRE","111 MIDDLE ROAD, SINGAPORE 188969, SINGAPORE 188969","Commercial Building","Office","Medium",148.40462011577426,"3rd Quartile",160.47621804148577,"3rd Quartile",181.569825132658,"2nd Quartile",1900,"Platinum",2022,"Existing Non-Residential Buildings (RECERT 2017)",8292,5981,0.72129763627592858,0,"Others"]
["INCOME AT TAMPINES POINT","2 TAMPINES CENTRAL 6, SINGAPORE 529483","Commercial Building","Office","Medium",175.07399229178415,"3rd Quartile",177.15365200225608,"3rd Quartile",180.87973115247229,"2nd Quartile",1998,"GoldPlus",2022,"Existing Non-Residental Buildings ENRB: 2017",10638,8697,0.8175408911449521,0,"Others","","",""]
["BHARAT BUILDING","3 RAFFLES PLACE, SINGAPORE 048817, SINGAPORE 048617","Commercial Building","Office","Medium",177.51607673267327,null,177.49898652365235,null,179.43916941694167,null,1987,null,null,null,7272,5417,0.74491199119911988,0,"District Cooling System (DCS)","","",""]
["TECHQUEST BUILDING","7 INTERNATIONAL BUSINESS PARK, SINGAPORE 609919","Commercial Building","Office","Medium",89.911425221191763,"Top Quartile",27.046402302526381,"Top Quartile",179.11255729666345,"2nd Quartile",1997,null,null,null,9381,6944,0.74021959279394522,0,"Air Cooled Chilled Water Plant","","",""]
["4TH SCDF DIVISION HQ / BUKIT BATOK FIRE STATION","80 BUKIT BATOK ROAD, SINGAPORE 658072","Commercial Building","Office","Medium",173.82110260336907,"3rd Quartile",167.26818529862175,"3rd Quartile",178.07670750382846,"2nd Quartile",2005,null,null,null,13060,7671,0.58736600306278719,0,"Air Cooled Chilled Water Plant","",1.56,"2019-11-01"]
["ENABLING VILLAGE","20 LENGKOK BAHRU, SINGAPORE 159053","Commercial Building","Office","Medium",169.0493452460328,"3rd Quartile",171.3109081210828,"3rd Quartile",176.35836244832646,"2nd Quartile",2015,null,null,null,14998,11858,0.79063875183357779,0,"Others","","",""]
["KING'S CENTRE","390 HAVELOCK ROAD, SINGAPORE 169662","Commercial Building","Office","Medium",167.31504331797234,"3rd Quartile",162.02150967741935,"3rd Quartile",176.18051059907833,"2nd Quartile",1998,"Platinum",2021,"Existing Building for Non-Residential buildings (version 3)",10850,8800,0.81105990783410142,0,"Water Cooled Chilled Water Plant",10,0.65,"2012-08-15"]
["ROYAL GROUP BUILDING","3 PHILLIP STREET, SINGAPORE 048693","Commercial Building","Office","Medium",173.08972117202268,"3rd Quartile",171.57270793950852,"3rd Quartile",169.25713610586013,"2nd Quartile",1996,null,null,null,10580,1000,9.4517958412098299E-2,0,"Others","","",""]
["GREAT EASTERN CHANGI","200 CHANGI ROAD, SINGAPORE 419734","Commercial Building","Office","Medium",155.56537508034157,"3rd Quartile",148.53824258562116,"2nd Quartile",165.87560830043154,"2nd Quartile",2005,"GoldPlus",2021,"Existing Non-Residental Buildings ENRB: 2017",10891,9574,0.87907446515471488,0,"Air Cooled Chilled Water Plant","",0.82,"2021-03-31"]
["83 CURIE","83 SCIENCE PAR DRIVE, SINGAPORE 118258","Commercial Building","Office","Medium",165.294252814739,"3rd Quartile",162.96750383828049,"3rd Quartile",165.5667400204708,"2nd Quartile",1992,"Certified",2022,"Existing Non-Residental Buildings ENRB: 2017",7816,0,0,0,"Others","","",""]
["NORTH BRIDGE CENTRE","420 NORTH BRIDGE ROAD, SINGAPORE 188727","Commercial Building","Office","Medium",137.50059789957652,"2nd Quartile",149.97630567172538,"2nd Quartile",163.9327776732022,"2nd Quartile",1993,"Gold",2014,"Existing Building for Non-Residential buildings (version 3)",8797.4639999999999,8797467,1000.0003410073631,0,"Water Cooled Chilled Water Plant",2012,"",""]
["TONG BUILDING","302 ORCHARD ROAD, SINGAPORE 238862","Commercial Building","Office","Medium",146.58366467228717,"3rd Quartile",154.35365379385368,"3rd Quartile",163.78156377481645,"2nd Quartile",1998,null,null,null,14708,14362,0.97647538754419361,0,"Water Cooled Chilled Water Plant",40,"",""]
["SCOTTS SPAZIO PTE LTD","51 SCOTTS ROAD, SINGAPORE 228241","Commercial Building","Office","Medium",150.85209663686678,"3rd Quartile",156.46504895700298,"3rd Quartile",157.26624095359728,"2nd Quartile",2009,null,null,null,14094,10000,0.70952178231871721,0,"Others","","",""]
["TOKIO MARINE CENTRE","20 MCCALLUM STREET, SINGAPORE 069046","Commercial Building","Office","Medium",151.95572217299434,"3rd Quartile",147.1908254379388,"2nd Quartile",156.67880853384227,"2nd Quartile",2010,"GoldPlus",2020,"Existing Building for Non-Residential buildings (version 2.1)",14671,13192,0.89918887601390496,0,"Water Cooled Chilled Water Plant",13,"",""]
["DAS SPEKTRUM@CBP","9 CHANGI BUSINESS PARK VISTA  #01-01, SINGAPORE 486041","Commercial Building","Office","Medium",148.65995222056867,null,152.57132450849849,null,156.28293491031565,null,2015,"Platinum",2020,"New Building for Non-Residential buildings (version 4)",12767,10352,0.8108404480300776,0,"District Cooling System (DCS)","","",""]
["ALFA CENTRE","99 BUKIT TIMAH ROAD, SINGAPORE 229835","Commercial Building","Office","Medium",192.21174594738238,"3rd Quartile",178.48479271857562,"3rd Quartile",155.39230799893701,"2nd Quartile",1994,null,null,null,7526,7526,1,0,"Water Cooled Chilled Water Plant",28,"",""]
["STAMFORD COURT","61 STAMFORD ROAD, SINGAPORE 178892","Commercial Building","Office","Medium",146.6377049180328,"3rd Quartile",148.2336943793911,"2nd Quartile",154.51087529274005,"2nd Quartile",1996,"Platinum",2022,"GM:2021 In Operation",6832,6354,0.93003512880562056,0,"Water Cooled Chilled Water Plant",4,0.52,"2020-02-22"]
["HILLVIEW COMMUNITY CLUB","1 HILLVIEW RISE, SINGAPORE 667970","Commercial Building","Office","Medium",117.35596555138723,"2nd Quartile",131.95117625310579,"2nd Quartile",152.49812166637795,"2nd Quartile",2017,"Gold",2017,"New Building for Non-Residential buildings (version 4.1)",3867.79,2800,0.72392761758006507,0,"Water Cooled Chilled Water Plant",0,"",""]
["ONE FINLAYSON GREEN","1 FINLAYSON GREEN, SINGAPORE 049246","Commercial Building","Office","Medium",161.27151783139482,"3rd Quartile",141.67391617802556,"2nd Quartile",150.4273219263674,"2nd Quartile",1995,null,null,null,10403,8299,0.79775064885129288,0,"Air Cooled Chilled Water Plant","",1.1299999999999999,"2018-02-21"]
["CENTROPOD","80 CHANGI ROAD, #01-44, SINGAPORE 419715","Commercial Building","Office","Medium",132.69070483843964,"2nd Quartile",153.52880462079355,"3rd Quartile",148.81558011049722,"2nd Quartile",2015,null,null,null,5973,3360,0.56253139126067297,0,"Others","","",""]
["FAR EASTERN BANK BUILDING","156 CECIL STREET, SINGAPORE 069544","Commercial Building","Office","Medium",135.44652728845759,"2nd Quartile",130.83636825815887,"2nd Quartile",148.13671521713923,"2nd Quartile",1991,"Platinum",2022,"Existing Non-Residental Buildings ENRB: 2017",11211.7,10239,0.91324241640429193,0,"Water Cooled Chilled Water Plant",1,0.65,"2022-12-21"]
["ABI PLAZA","11 KEPPEL ROAD, SINGAPORE 089057","Commercial Building","Office","Medium",143.55639202288256,"3rd Quartile",134.40050452884157,"2nd Quartile",145.72866677260447,"2nd Quartile",1994,null,null,null,12586,1341,0.1065469569362784,0,"Water Cooled Chilled Water Plant",7,"",""]
["HOUGANG COMMUNITY CLUB","35 HOUGANG AVENUE 3 , SINGAPORE 538840, SINGAPORE 538840","Commercial Building","Office","Medium","",null,151.44246959775492,"3rd Quartile",144.07787652011226,"2nd Quartile",2021,null,null,null,4276,3498,0.81805425631431239,0,"Others","","",""]
["ERA APAC CENTRE","450 LOR 6 TOA PAYOH, SINGAPORE 319394","Commercial Building","Office","Medium",237.15504731861196,"Bottom Quartile",160.75725066731377,"3rd Quartile",141.62402329531668,"2nd Quartile",2012,"Certified",2022,"Existing Non-Residental Buildings ENRB: 2017",4121,4121,1,0,"Others","","",""]
["BEACH CENTRE","NO 15 BEACH ROAD, SINGAPORE 189677","Commercial Building","Office","Medium",125.60511018385709,"2nd Quartile",130.54360151258314,"2nd Quartile",141.58556526274612,"2nd Quartile",1985,"Platinum",2022,"Existing Non-Residential Buildings (RECERT 2017)",7669,7110,0.92710914069630979,0,"Water Cooled Chilled Water Plant",6,"",""]
["ROYAL ONE PHILLIP","1 PHILLIP STREET, SINGAPORE 048692","Commercial Building","Office","Medium",151.123088,"3rd Quartile",151.487664,"3rd Quartile",141.03904800000001,"2nd Quartile",1992,null,null,null,5000,3500,0.7,0,"Water Cooled Chilled Water Plant",6,"",""]
["158 CECIL STREET","158 CECIL STREET, SINGAPORE 069545","Commercial Building","Office","Medium",137.50714118727561,"2nd Quartile",132.94245303498371,"2nd Quartile",140.43137931034482,"2nd Quartile",2009,"Gold",2022,"Existing Building for Non-Residential buildings (version 3)",11977,9975,0.83284628872004673,0,"Others","","",""]
["PHILIPPINES AIRLINES BUILDING","135 CECIL STREET, SINGAPORE 069536","Commercial Building","Office","Medium",167.29440580328568,"3rd Quartile",131.0791423085129,"2nd Quartile",139.63385534457009,"2nd Quartile",2007,null,null,null,9374,604,6.4433539577554932E-2,0,"Air Cooled Chilled Water Plant","","",""]
["AETOS SECURITY","145 WEST COAST ROAD, SINGAPORE 127367","Commercial Building","Office","Medium",170.08430128128367,"3rd Quartile",146.17518860016764,"2nd Quartile",139.47470362830799,"2nd Quartile",2012,null,null,null,3340.4,110071,32.951442940965151,0,"Others","","",""]
["GRACE GLOBAL RAFFLES","137 MARKET STREET, SINGAPORE 048943, SINGAPORE 048943","Commercial Building","Office","Medium",115.42385685884692,"2nd Quartile",110.518986083499,"Top Quartile",138.86707753479126,"2nd Quartile",2011,null,null,null,5030,4024,0.8,0,"Others"]
["ANSON HOUSE","72 ANSON ROAD, SINGAPORE 079911","Commercial Building","Office","Medium",164.91198180502431,"3rd Quartile",140.80622350873566,"2nd Quartile",136.38831799855268,"2nd Quartile",1998,"Certified",2021,"Existing Non-Residental Buildings ENRB: 2017",9673,8369,0.86519177090871502,0,"Air Cooled Chilled Water Plant","",0.96,"2021-05-21"]
["HOUGANG SPORT CENTRE","93 HOUGANG AVENUE 4, SINGAPORE 538832","Commercial Building","Office","Medium",135.60251821349382,"2nd Quartile",137.77605321507761,"2nd Quartile",136.28606271777005,"2nd Quartile",1993,"Gold",2022,"Existing Non-Residental Buildings ENRB: 2017",9471,956,0.10093971069580826,0,"Others","","",""]
["JIT POH BUILDING","19 KEPPEL ROAD, SINGAPORE 089058","Commercial Building","Office","Medium",137.19249722222222,"2nd Quartile",137.805575,"2nd Quartile",135.69198611111111,"2nd Quartile",1975,null,null,null,7200,7200,1,0,"Water Cooled Chilled Water Plant",12,"",""]
["CECIL COURT","138 CECIL STREET, SINGAPORE 069538","Commercial Building","Office","Medium",138.5858154859967,"2nd Quartile",128.84291231923851,"2nd Quartile",134.01545945451215,"2nd Quartile",1986,null,null,null,10926,7985,0.73082555372505953,0,"Water Cooled Chilled Water Plant",36,"",""]
["TUNG ANN ASSOCIATION BUILDING","141 CECIL ST, SINGAPORE 069541","Commercial Building","Office","Medium",144.45477295326484,"3rd Quartile",140.46771461716938,"2nd Quartile",133.79293172025191,"2nd Quartile",1988,null,null,null,6034,800,0.1325820351342393,0,"Air Cooled Chilled Water Plant","","",""]
["HIGH STREET PLAZA","77 HIGH STREET, SINGAPORE 179433","Commercial Building","Office","Medium",129.53842580149743,"2nd Quartile",135.02324438471874,"2nd Quartile",133.57248416202725,"2nd Quartile",1975,null,null,null,10418,10418,1,0,"Water Cooled Chilled Water Plant",39,0.8,"2023-01-03"]
["MAJLIS UGAMA ISLAM SINGAPURA","273 BRADDELL ROAD, SINGAPORE 579702","Commercial Building","Office","Medium",127.54254187716033,"2nd Quartile",107.71536825312417,"Top Quartile",133.2650890720553,"2nd Quartile",2009,null,null,null,7522,5165,0.68665248604094653,0,"Others","","",""]
["MEWAH BUILDING","5 INTERNATIONAL BUSINESS PARK, SINGAPORE 609914","Commercial Building","Office","Medium",111.63808018296784,"2nd Quartile",117.45466164401991,"2nd Quartile",133.15497914704696,"2nd Quartile",1995,null,null,null,7433,5865,0.78904883627068478,0,"Others","","",""]
["991G","991G ALEXANDRA ROAD SINGAPORE 119975, SINGAPORE 119975","Commercial Building","Office","Medium",131.89431740614336,"2nd Quartile",124.7835532802427,"2nd Quartile",130.79071482745545,"2nd Quartile",2009,"Gold",2021,"Existing Non-Residental Buildings ENRB: 2017",5274,4701,0.891353811149033,0,"Others","","",""]
["251 NORTH BRIDGE ROAD","251 NORTH BRIDGE ROAD, SINGAPORE 179102","Commercial Building","Office","Medium",114.20809015898571,"2nd Quartile",129.25135842221775,"2nd Quartile",129.25135842221775,"2nd Quartile",1990,null,null,null,9938,5454,0.54880257597102033,0,"Water Cooled Chilled Water Plant",13,"",""]
["BANGKOK BANK BUILDING","180 CECIL STREET, SINGAPORE 069546","Commercial Building","Office","Medium",130.79402161344314,"2nd Quartile",129.01265291883394,"2nd Quartile",128.67045574810186,"2nd Quartile",1978,null,null,null,12755.95,12992,1.0185050897816312,0,"Water Cooled Chilled Water Plant",35,"",""]
["EXYTE","16 INTERNATIONAL BUSINESS PARK, SINGAPORE 609929","Commercial Building","Office","Medium",118.81854065104577,"2nd Quartile",142.5506447554647,"2nd Quartile",128.12886145620382,"2nd Quartile",2002,null,null,null,6359,5543,0.87167793678251293,0,"Air Cooled Chilled Water Plant","","",""]
["SULTAN LINK","55 MOHD SULTAN ROAD, SINGAPORE 238995","Commercial Building","Office","Medium",94.929167767503316,"Top Quartile",59.186116248348746,"Top Quartile",126.48895640686922,"2nd Quartile",2011,null,null,null,757,755,0.99735799207397624,0,"Others","","",""]
["SULTAN LINK","61 MOHD SULTAN ROAD, SINGAPORE 239001","Commercial Building","Office","Medium",120.33521739130434,"2nd Quartile",114.48308195459794,"2nd Quartile",124.33958830319355,"2nd Quartile",2011,null,null,null,2599,1904,0.73258945748364757,0,"Others","","",""]
["METTA BUILDING","32 SIMEI STREET 1, SINGAPORE 529950","Commercial Building","Office","Medium",108.82635914332785,"Top Quartile",117.59210140948197,"2nd Quartile",121.29372139849899,"2nd Quartile",2005,null,null,null,5463,3405,0.62328390993959359,0,"Others","","",""]
["10 RAEBURN PARK","10 RAEBURN PARK, SINGAPORE 088702","Commercial Building","Office","Medium",112.28723225676492,"2nd Quartile",129.18163902504534,"2nd Quartile",117.99944806284832,"2nd Quartile",2013,null,null,null,14893,10000,0.67145638890754045,0,"Others"]
["THE GLOBE","100 CECIL STREET, SINGAPORE 069532","Commercial Building","Office","Medium",138.01088942307692,"2nd Quartile",119.05404532967033,"2nd Quartile",117.98011160714286,"2nd Quartile",1993,null,null,null,5824,4070,0.69883241758241754,0,"Air Cooled Chilled Water Plant","","",""]
["FAMILY JUSTICE COURTS","3 HAVELOCK SQUAR, SINGAPORE 059725","Commercial Building","Office","Medium",125.3849308411215,"2nd Quartile",112.96692803738317,"Top Quartile",117.85892523364485,"2nd Quartile",2001,null,null,null,10700,9095,0.85,0,"Others","","",""]
["THONG TECK BUILDING","15 SCOTTS ROAD, SINGAPORE 228218, SINGAPORE 228218","Commercial Building","Office","Medium",89.433233167842516,"Top Quartile",95.582127863426521,"Top Quartile",117.35444908980054,"2nd Quartile",1973,null,null,null,11481,10000,0.87100426792091279,0,"Water Cooled Chilled Water Plant",1]
["CIVIL SERVICE COLLEGE","31 NORTH BUONA VISTA ROAD, SINGAPORE 275983","Commercial Building","Office","Medium",122.17760642064678,"2nd Quartile",97.501455661342362,"Top Quartile",117.33556377370367,"2nd Quartile",1999,"Platinum",2021,"Existing Non-Residental Buildings ENRB: 2017",12709,9578,0.75363915335588949,0,"Water Cooled Chilled Water Plant",21,0.55200000000000005,"2019-12-01"]
["PIXEL","10 CENTRAL EXCHANGE GREEN, SINGAPORE 138649, SINGAPORE 138649","Commercial Building","Office","Medium",109.79854627274506,"Top Quartile",102.13342594404226,"Top Quartile",115.78262570925455,"2nd Quartile",2009,null,null,null,5111,3967,0.77616904715319901,0,"Others","","",""]
["150 CECIL STREET","150 CECIL STREET, SINGAPORE 069543","Commercial Building","Office","Medium",129.97086265192362,"2nd Quartile",120.15827835145755,"2nd Quartile",114.1044274878918,"2nd Quartile",1995,null,null,null,10943,7432,0.67915562460020107,0,"Water Cooled Chilled Water Plant",26]
["TAMPINES CONCOURSE","11 TAMPINES CONCOURSE, SINGAPORE 528729","Commercial Building","Office","Medium",147.07425781250001,"3rd Quartile",136.88418663194446,"2nd Quartile",111.7706640625,"2nd Quartile",2009,"GoldPlus",2021,"Existing Building for Non-Residential buildings (version 2.1)",11520,10260,0.890625,0,"Others","","",""]
["BOON SIEW BUILDING","75 BUKIT TIMAH ROAD, SINGAPORE 229833","Commercial Building","Office","Medium",117.47417824267784,"2nd Quartile",105.40931548117155,"Top Quartile",111.02458158995816,"2nd Quartile",1984,null,null,null,11950,18945,1.5853556485355649,0,"Water Cooled Chilled Water Plant",38,"",""]
["PEC LTD.","14 INTERNATIONAL BUSINESS PARK, SINGAPORE 609922","Commercial Building","Office","Medium",114.68669103843494,"2nd Quartile",111.1259262918684,"Top Quartile",109.77467641537397,"2nd Quartile",1999,null,null,null,10121,6471,0.63936369923920566,0,"Air Cooled Chilled Water Plant","",0.9,"2023-03-10"]
["KEMBANGAN-CHAI CHEE COMMUNITY HUB","11 JALAN UBI, SINGAPORE 409074","Commercial Building","Office","Medium",117.98298359987774,"2nd Quartile",125.66494983192419,"2nd Quartile",109.33907507385148,"2nd Quartile",2014,null,null,null,7853.6,852,0.10848528063563206,0,"Others","","",""]
["FAR EAST FINANCE BUILDING","14 ROBINSON ROAD, SINGAPORE 048545","Commercial Building","Office","Medium",103.46575781748564,"Top Quartile",104.02469208679005,"Top Quartile",109.17107370772177,"2nd Quartile",1985,null,null,null,6268,4765,0.7602105934907466,0,"Water-Cooled Package Units","","",""]
["EASTGATE","46 EAST COAST ROAD #B1-01, SINGAPORE 428766","Commercial Building","Office","Medium",58.329647982669918,"Top Quartile",86.57671405361495,"Top Quartile",108.76219740048741,"Top Quartile",1998,null,null,null,7386,6950,0.94096940157053888,0,"Air Cooled Chilled Water Plant","","",""]
["GENTING CENTRE","3 LIM TECK LIM ROAD, SINGAPORE 088934","Commercial Building","Office","Medium",140.57826691380907,"2nd Quartile",134.37455514365152,"2nd Quartile",108.00736329935125,"Top Quartile",1986,null,null,null,12948,10762,0.83117083719493356,0,"Water Cooled Chilled Water Plant",4,0.54900000000000004,"2020-07-20"]
["ROBINSON 112","112 ROBINSON ROAD, SINGAPORE 068902","Commercial Building","Office","Medium",133.90452425373135,"2nd Quartile",106.49783115671642,"Top Quartile",106.56548507462686,"Top Quartile",2003,"Platinum",2023,"GM:2021 In Operation",10720,8988,0.83843283582089556,0,"Water-Cooled Package Units","",1.63,"2022-05-10"]
["TAHIR BUILDING","140 ROBINSON ROAD, SINGAPORE 068907","Commercial Building","Office","Medium",105.16824711731725,"Top Quartile",116.39131281074792,"2nd Quartile",106.45288797207236,"Top Quartile",2016,null,null,null,9453,629,6.653972283931027E-2,0,"Others","","",""]
["MACDONALD HOUSE","40A ORCHARD ROAD, SINGAPORE 238838, SINGAPORE 238838","Commercial Building","Office","Medium",132.92385888888887,null,95.731499999999997,null,105.88695,null,1999,null,null,null,9000,8200,0.91111111111111109,0,"District Cooling System (DCS)","","",""]
["PEOPLE'S ASSOCIATION HEADQUARTERS","9 KING GEORGE AVENUE SINGAPORE 208581, SINGAPORE 208581","Commercial Building","Office","Medium",114.86032070568929,"2nd Quartile",98.402026121444194,"Top Quartile",104.43766411378556,"Top Quartile",2009,"GoldPlus",2007,"New Building (version 1)",14624,12774,0.87349562363238509,0,"Water-Cooled Package Units",null,"",""]
["ISEAS - YUSOF ISHAK INSTITUTE","30 HENG MUI KENG TERRACE, SINGAPORE 119614","Commercial Building","Office","Medium",100.55605139756612,"Top Quartile",101.71753600926111,"Top Quartile",103.91138392540917,"Top Quartile",1998,"Platinum",2022,"Existing Non-Residential Buildings (RECERT 2017)",9882.18,5739,0.5807423058474952,0,"Water Cooled Chilled Water Plant",4,0.89,"2023-02-27"]
["THE OXLEY","9 OXLEY RISE, SINGAPORE 238697","Commercial Building","Office","Medium",106.09061594693381,"Top Quartile",113.07850683633413,"2nd Quartile",103.484005685664,"Top Quartile",1996,null,null,null,7387,3667,0.49641261675917153,0,"Others","","",""]
["PEK CHUAN BUILDING","116 LAVENDER STREET, SINGAPORE 338730","Commercial Building","Office","Medium",101.73197289156627,"Top Quartile",107.37929384203481,"Top Quartile",103.13032128514057,"Top Quartile",1983,null,null,null,5976,4621,0.77325970548862111,0,"Water-Cooled Package Units","","",""]
["FAMILY LINK @ LENGKOK BAHRU","8 LENGKOK BAHRU, SINGAPORE 159052, SINGAPORE 159052","Commercial Building","Office","Medium",109.78212960278341,"Top Quartile",109.06811829515802,"Top Quartile",103.06209915917657,"Top Quartile",2009,"Gold",2023,"GM:2021 In Operation",6898,1275,0.18483618440127572,0,"Others","","",""]
["ANSON CENTRE","51 ANSON ROAD, SINGAPORE 079904","Commercial Building","Office","Medium",119.98643919308358,"2nd Quartile",119.11958155619595,"2nd Quartile",99.40051873198847,"Top Quartile",1974,null,null,null,8675,6960,0.80230547550432274,0,"Water Cooled Chilled Water Plant",20,"",""]
["MAXWELL CHAMBER SUITES","28 MAXWELL RD, SINGAPORE 069120","Commercial Building","Office","Medium",94.705872718764624,"Top Quartile",93.170467945718286,"Top Quartile",98.491965372016836,"Top Quartile",2020,null,null,null,10685,7000,0.65512400561534867,0,"Others","","",""]
["CES CENTRE","171 CHIN SWEE ROAD, SINGAPORE 169877","Commercial Building","Office","Medium",94.672356157675665,"Top Quartile",92.973072716885667,"Top Quartile",97.614995511303363,"Top Quartile",2015,null,null,null,12253,11184,0.91275605974047169,0,"Water Cooled Chilled Water Plant",7.5,0.68559999999999999,"2019-04-14"]
["SULTAN LINK","63 MOHD SULTAN ROAD, SINGAPORE 239002","Commercial Building","Office","Medium",119.96989651928504,"2nd Quartile",91.565380997177797,"Top Quartile",95.458137347130759,"Top Quartile",2011,null,null,null,1063,887,0.83443085606773282,0,"Others","","",""]
["THE KINGSMEN EXPERIENCE","22 CHANGI BUSINESS PARK 2, SINGAPORE 486032","Commercial Building","Office","Medium",85.557023301378479,"Top Quartile",94.024853404240432,"Top Quartile",93.435769365334835,"Top Quartile",2018,null,null,null,14291,10245,0.71688475264152263,0,"Others","","",""]
["TEMPCO TECHNOMINIUM","16 AYER RAJAH CRESCENT, SINGAPORE 139965","Commercial Building","Office","Medium",135.84196948561464,"2nd Quartile",154.89880122057542,"3rd Quartile",92.429634699215342,"Top Quartile",1999,null,null,null,11470,4500,0.39232781168265041,0,"Air Cooled Chilled Water Plant","","",""]
["SENJA CASHEW COMMUNITY CLUB","101 BUKIT PANJANG ROAD, SINGAPORE 679910","Commercial Building","Office","Medium",62.693162757127389,"Top Quartile",100.03952002887044,"Top Quartile",91.780203536629372,"Top Quartile",2019,"Gold",2019,"Existing Building for Non-Residential buildings (version 3)",13855,1200,8.6611331649224105E-2,0,"Others","","",""]
["REGISTRY OF MARRIAGES","7 CANNING RISE, SINGAPORE 179869, SINGAPORE 179869","Commercial Building","Office","Medium",84.562081107814052,"Top Quartile",86.971501483679532,"Top Quartile",91.01416221562809,"Top Quartile",1983,"Gold",2012,"New Building for Non-Residential buildings (version 3)",5055,4044,0.8,0,"Others","","",""]
["36 ARMENIAN STREET","36 ARMENIAN STREET, SINGAPORE 179934","Commercial Building","Office","Medium",82.203665480427034,"Top Quartile",82.730893068971355,"Top Quartile",84.467149635654977,"Top Quartile",2010,"Certified",2009,"New Building for A/C buildings (version 2)",5901,297,5.0330452465683781E-2,0,"Others","","",""]
["N/A","10 SCIENCE CENTRE ROAD, SINGAPORE 609079","Commercial Building","Office","Medium",82.839123952860987,"Top Quartile",81.819771404231162,"Top Quartile",83.397422973164851,"Top Quartile",2014,null,null,null,7043,5200,0.73832173789578304,0,"Others","","",""]
["CREATIVE INNOVATIVE DEVELOPMENT CENTRE","90 EU TONG SEN STREET, SINGAPORE 059811","Commercial Building","Office","Medium",75.121058426966286,"Top Quartile",86.210120224719105,"Top Quartile",82.960017977528096,"Top Quartile",1930,null,null,null,8900,4000,0.449438202247191,0,"Others","","",""]
["120 ROBINSON ROAD","120 ROBINSON ROAD, SINGAPORE 068913","Commercial Building","Office","Medium",92.240517998244073,"Top Quartile",83.747124670763824,"Top Quartile",78.924363476733973,"Top Quartile",2006,null,null,null,11390,5900,0.51799824407374895,0,"Others","","",""]
["ICON @ CHANGI","228 CHANGI ROAD, SINGAPORE 419741","Commercial Building","Office","Medium",66.238601387449179,"Top Quartile",76.838724982058864,"Top Quartile",76.702352284506816,"Top Quartile",2012,null,null,null,2508.1999999999998,2513,1.0019137229885975,0,"Others","","",""]
["NATIONAL COMMUNITY LEADERSHIP INSTITUTE","70 SOUTH BUONA VISTA ROAD, SINGAPORE 118176","Commercial Building","Office","Medium",87.274351193298557,"Top Quartile",79.954074600916698,"Top Quartile",75.691778093883357,"Top Quartile",2000,"Gold",2020,"Existing Non-Residental Buildings ENRB: 2017",6327,5400,0.8534850640113798,33,"Others","","",""]
["JTC LAUNCHPAD@JURONG INNOVATION DISTRICT","2 CLEANTECH LOOP, SINGAPORE 637144","Commercial Building","Office","Medium",62.034559643255292,"Top Quartile",69.81605351170569,"Top Quartile",73.938127090301009,"Top Quartile",2017,"Platinum",2022,"New Building for Non-Residential buildings (version 4.1)",5382,3438,0.6387959866220736,0,"Water Cooled Chilled Water Plant",11,"",""]
["LENG KEE COMMUNITY CENTRE","400 LENGKOK BAHRU, SINGAPORE 159049, SINGAPORE 159049","Commercial Building","Office","Medium",64.54537003932785,"Top Quartile",67.557509831962818,"Top Quartile",70.283212370396853,"Top Quartile",2017,null,null,null,5594,5594,1,0,"Water Cooled Chilled Water Plant",1]
["ICB ENTERPRISE HOUSE","116 MIDDLE ROAD, SINGAPORE 188972, SINGAPORE 188972","Commercial Building","Office","Medium",52.954921351814356,"Top Quartile",55.098012770596476,"Top Quartile",69.362904532004364,"Top Quartile",1979,null,null,null,6421,5821,0.90655661111976327,0,"Water-Cooled Package Units"]
["UNITED HOUSE","20 KRAMAT LAME, SINGAPORE 228773","Commercial Building","Office","Medium",56.068978231025689,"Top Quartile",62.16589919592078,"Top Quartile",64.110462835850171,"Top Quartile",1976,null,null,null,5099,3570,0.70013728181996471,0,"Others","","",""]
["UPPER THOMSON COMMUNITY HUB","600 UPPER THOMSON ROAD, SINGAPORE 574421","Commercial Building","Office","Medium",53.705720006160476,"Top Quartile",66.243935006930542,"Top Quartile",63.733143385184043,"Top Quartile",2017,null,null,null,6493,4142,0.63791775758509162,0,"Others","","",""]
["YUHUA COMMUNITY CLUB","90 BOON LAY WAY, SINGAPORE 609958","Commercial Building","Office","Medium",53.72459009192044,null,86.529316801563851,null,54.206705689842622,null,1989,null,null,null,4552.8500000000004,4118,0.90448839737746678,0,"District Cooling System (DCS)","","",""]
["55 MARKET STREET","55 MARKET STREET, SINGAPORE 048941","Commercial Building","Office","Medium",25.077632570997736,"Top Quartile",45.811158582558434,"Top Quartile",51.954888162854992,"Top Quartile",2020,"Gold",2022,"Existing Non-Residential Buildings (RECERT 2017)",7958,7724,0.97059562704197033,0,"Water-Cooled Package Units",null,"",""]
["108RR","108 ROBINSON ROAD, SINGAPORE 068900","Commercial Building","Office","Medium","",null,"",null,48.793561316900508,"Top Quartile",2023,"Platinum",2022,"Existing Non-Residential Buildings (ENRB: 2017)",5568.53,4900,0.87994497650187753,0,"Others","","",""]
["SULTAN LINK","57 MOHD SULTAN ROAD, SINGAPORE 238997","Commercial Building","Office","Medium",41.083785488958995,"Top Quartile",30.980785138450752,"Top Quartile",47.333683841570277,"Top Quartile",2011,null,null,null,2853,2125,0.74483000350508233,0,"Others","","",""]
["BISHAN FIRE STATION","1 MARYMOUNT LANE, SINGAPORE 574029","Commercial Building","Office","Medium",51.216135915955356,"Top Quartile",45.793933026920556,"Top Quartile",44.482042022324357,"Top Quartile",2001,null,null,null,6092,3802,0.62409717662508213,0,"Others","",0.99,"2019-11-01"]
["DIOCESAN CENTRE BUILDING","1 FRANCIS THOMAS DRIVE, SINGAPORE 359340","Commercial Building","Office","Medium",45.211046181437752,"Top Quartile",47.812983111642502,"Top Quartile",43.761345090419965,"Top Quartile",2009,null,null,null,6691,3316,0.49559109251233002,0,"Others","","",""]
["SOOKEE HQ","7 CHANGI BUSINESS PARK VISTA, SINGAPORE 486042","Commercial Building","Office","Medium",46.217094615384617,"Top Quartile",39.48430384615385,"Top Quartile",42.64066230769231,"Top Quartile",2014,null,null,null,13000,6000,0.46153846153846156,0,"Air Cooled Chilled Water Plant","","",""]
["MOE EVANS ROAD","21 EVANS ROAD, SINGAPORE 259366","Commercial Building","Office","Medium",2.0021139923654072,"Top Quartile",29.856390680531788,"Top Quartile",41.776490720021059,"Top Quartile",1984,null,null,null,7597,2170,0.2856390680531789,0,"Others","","",""]
["THE CHADWICK","81 SCIENCE PARK DRIVE, SINGAPORE 118257","Commercial Building","Office","Medium",50.116790226294604,"Top Quartile",41.236849229487717,"Top Quartile",41.413343051506317,"Top Quartile",1992,null,null,null,14406,0,0,0,"Others","","",""]
["SINGAPORE BOYS' HOSTEL","149 COMPASSVALE BOW, SINGAPORE 544690, SINGAPORE 544690","Commercial Building","Office","Medium",38.824394213381552,"Top Quartile",43.074390596745026,"Top Quartile",40.094115732368898,"Top Quartile",2016,null,null,null,5530,689,0.12459312839059675,0,"Others","","",""]
["SENGKANG FIRE STATION","50 BUANGKOK DRIVE, SINGAPORE 545064","Commercial Building","Office","Medium",55.195208105147863,"Top Quartile",48.824746714129247,"Top Quartile",39.158064074479739,"Top Quartile",2001,null,null,null,7304,2658,0.36391018619934284,0,"Others","",1.1100000000000001,"2019-11-01"]
["HUB SYNERGY POINT","70 ANSON ROAD, SINGAPORE 079905","Commercial Building","Office","Medium","",null,"",null,35.264772030259664,"Top Quartile",2022,null,null,null,14673,11262,0.76753220200368022,0,"Water Cooled Chilled Water Plant",1,"",""]
["SULTAN LINK","59 MOHD SULTAN ROAD, SINGAPORE 238999","Commercial Building","Office","Medium",27.177702955480733,"Top Quartile",29.617283950617285,"Top Quartile",33.548447437336328,"Top Quartile",2011,null,null,null,2673,1980,0.7407407407407407,0,"Others","","",""]
["450 ALEXANDRA","450 ALEXANDRA, SINGAPORE 119960","Commercial Building","Office","Medium",4.9812922822035066,"Top Quartile",9.3262460306502835,"Top Quartile",10.780753831285379,"Top Quartile",1976,"Certified",2022,"Existing Non-Residental Buildings ENRB: 2017",14486,10888,0.75162225597128263,0,"Water Cooled Chilled Water Plant",6,0.67,"2022-12-01"]
["UNILEVER ASIA PTE LTD","18 NEPAL PARK, SINGAPORE 139407","Commercial Building","Office","Medium",0,null,0,null,0,null,2013,"Platinum",2022,"Existing Non-Residental Buildings ENRB: 2017",9606,6077,0.6326254424318134,0,"Water Cooled Chilled Water Plant",11,"",""]
["MAPLETREE BUSINESS CITY","20 PASIR PANJANG ROAD, SINGAPORE 117439","Commercial Building","Office",null,null,"",null,null,null,null,2017,"Platinum",2022,"Existing Building for Non-Residential buildings (version 3)",128557,110438,0.85905862769044083,0,"Water Cooled Chilled Water Plant",13,0.61,"2022-11-24"]
["NOVENA SQUARE","238A THOMSON ROAD, SINGAPORE 307684","Commercial Building","Office",null,null,"",null,null,null,null,2000,"GoldPlus",2022,"Existing Building for Non-Residential buildings (version 3)",33837,32589,0.96311729763276888,0,"Water Cooled Chilled Water Plant",4,0.65,"2021-11-10"]
["NOVENA SQUARE","238B THOMSON ROAD, SINGAPORE 307685","Commercial Building","Office",null,null,"",null,null,null,null,2000,"GoldPlus",2022,"Existing Building for Non-Residential buildings (version 3)",13951,11465,0.82180488853845601,0,"Water Cooled Chilled Water Plant",4,0.65,"2021-11-10"]
["DNV TECHNOLOGY CENTRE","16 SCIENCE PARK DRIVE, SINGAPORE 118227","Commercial Building","Office",null,null,"",null,null,null,"",2013,"Platinum",2021,"Existing Building for Non-Residential buildings (version 3)",7251,7251,1,0,"Water Cooled Chilled Water Plant",10,0.65,"2021-02-22"]
["CENTRAL PLAZA","298 TIONG BAHRU ROAD, SINGAPORE 168730","Commercial Building","Office",null,null,"",null,"",null,"",1996,"Platinum",2021,"Existing Building for Non-Residential buildings (version 3)",18784,18784,1,0,"Water Cooled Chilled Water Plant",6,0.57899999999999996,"2021-11-11"]
["ROYAL MERUKH S.E.A","21 MERCHANT ROAD S058267, SINGAPORE 058267","Commercial Building","Office",null,null,"",null,"",null,"",2010,null,null,null,4605,4134,0.89771986970684037,0,"Others","","",""]
["AMNIOS","1 BIOPOLIS DRIVE, SINGAPORE 138622","Commercial Building","Office",null,null,null,null,null,null,null,2011,"Gold",2011,"New Building for Non-Residential buildings (version 3)",9518,7660,0.80479092246270223,0,"District Cooling System (DCS)","","",""]
["HAW PAR GLASS TOWER","178 CLEMENCEAU AVENUE, SINGAPORE 239926","Commercial Building","Office",null,null,"",null,"",null,"",2001,null,null,null,4228,3580,0.84673604541154213,0,"Water-Cooled Package Units","","",""]
["HARBOURFRONT TOWER TWO","3 HARBOURFRONT PLACE, SINGAPORE 099254, SINGAPORE 099254","Commercial Building","Office",null,null,"",null,"",null,"",2002,"Gold",2022,"Existing Building for Non-Residential buildings (version 2.1)",19190,14313,0.74585721730067744,0,"Water Cooled Chilled Water Plant",9,0.80900000000000005,"2022-10-01"]
["NANKIN ROW","3 PICKERING STREET, SINGAPORE 048660","Commercial Building","Office",null,null,"",null,"",null,"",2002,"Platinum",2019,"Existing Building for Non-Residential buildings (version 3)",16986,14936,0.879312374896974,0,"Water Cooled Chilled Water Plant",2,"",""]
["CENTROS","20 BIOPOLIS WAY, SINGAPORE 138668","Commercial Building","Office",null,null,null,null,null,null,null,2008,"GoldPlus",2022,"Existing Building for Non-Residential buildings (version 3)",21087,17180,0.81471996964954707,0,"District Cooling System (DCS)","",0.05,"2010-08-01"]
["CHROMOS","10 BIOPOLIS ROAD, SINGAPORE 138670","Commercial Building","Office",null,null,null,null,null,null,null,2008,"GoldPlus",2022,"Existing Building for Non-Residential buildings (version 3)",15141,13134,0.86744600752922529,0,"District Cooling System (DCS)","",0.05,"2010-08-01"]
["GENOME","60 BIOPOLIS STREET, SINGAPORE 138672","Commercial Building","Office",null,null,null,null,null,null,null,2008,"GoldPlus",2022,"Existing Building for Non-Residential buildings (version 3)",17652,11887,0.67340811239519605,0,"District Cooling System (DCS)","",0.05,"2010-08-01"]
["MATRIX","30 BIOPOLIS STREET, SINGAPORE 138671","Commercial Building","Office",null,null,null,null,null,null,null,2008,"GoldPlus",2022,"Existing Non-Residential Buildings (RECERT 2017)",27611,26341,0.95400383904965413,0,"District Cooling System (DCS)","",0.05,"2010-08-01"]
["NANOS","31 BIOPOLIS WAY, SINGAPORE 138669","Commercial Building","Office",null,null,null,null,null,null,null,2008,"GoldPlus",2022,"Existing Building for Non-Residential buildings (version 3)",19872,19872,1,0,"District Cooling System (DCS)","",0.05,"2010-08-01"]
["PROTEOS","61 BIOPOLIS DRIVE, SINGAPORE 138673","Commercial Building","Office",null,null,null,null,null,null,null,2008,"GoldPlus",2022,"Existing Building for Non-Residential buildings (version 3)",33486,29813,0.89031236934838442,0,"District Cooling System (DCS)","",0.05,"2010-08-01"]
["CREATE","1 CREATE WAY, SINGAPORE 138602","Commercial Building","Office",null,null,null,null,null,null,null,2011,"Platinum",2020,"Existing Building for Non-Residential buildings (version 3)",61999,53783,0.86748173357634806,0,"District Cooling System (DCS)","","",""]
["MARINA BAY FINANCIAL CENTRE TOWER 3","12 MARINA BOULEVARD, SINGAPORE 018982","Commercial Building","Office",null,null,null,null,null,null,null,2012,"Platinum",2019,"Existing Building for Non-Residential buildings (version 3)",151777,147045,0.96882268064331223,0,"District Cooling System (DCS)","","",""]
["MARINA BAY FINANCIAL CENTRE TOWER 2","10 MARINA BOULEVARD, SINGAPORE 018983","Commercial Building","Office",null,null,null,null,null,null,null,2009,"Platinum",2020,"Existing Building for Non-Residential buildings (version 3)",113150,108000,0.95448519664162612,0,"District Cooling System (DCS)","","",""]
["TAN TECK GUAN BUILDING","16A COLLEGE ROAD, SINGAPORE 169855","Commercial Building","Office",null,null,"",null,"",null,"",1911,null,null,null,599,504,0.84140233722871449,0,"Others","","",""]
["MACALISTER HALL","8A COLLEGE ROAD, SINGAPORE 169858","Commercial Building","Office",null,null,"",null,"",null,"",2010,null,null,null,2105,2043,0.97054631828978621,0,"Others","","",""]
["KING EDWARD VII HALL","12 COLLEGE ROAD, SINGAPORE 169852","Commercial Building","Office",null,null,"",null,"",null,"",1957,null,null,null,2126,1930,0.90780809031044218,0,"Others","","",""]
["HARROWER HALL","14 COLLEGE ROAD, SINGAPORE 169853","Commercial Building","Office",null,null,"",null,"",null,"",1931,null,null,null,1030,1024,0.99417475728155336,0,"Others","","",""]
["SUNTEC TOWER ONE","7 TEMASEK BOULEVARD, SINGAPORE 038987","Commercial Building","Office",null,null,"",null,"",null,"",1995,"GoldPlus",2022,"Existing Non-Residental Buildings ENRB: 2017",58854,48484,0.82380127094165223,0,"Water Cooled Chilled Water Plant",9,0.61,"2023-04-08"]
["SUNTEC TOWER TWO","9 TEMASEK BOULEVARD, SINGAPORE 038989","Commercial Building","Office",null,null,"",null,"",null,"",1995,"GoldPlus",2022,"Existing Non-Residental Buildings ENRB: 2017",58854,48484,0.82380127094165223,0,"Water Cooled Chilled Water Plant",9,0.61,"2023-04-08"]
["SUNTEC TOWER THREE","8 TEMASEK BOULEVARD, SINGAPORE 038988","Commercial Building","Office",null,null,"",null,"",null,"",1997,"GoldPlus",2022,"Existing Non-Residental Buildings ENRB: 2017",58854,48484,0.82380127094165223,0,"Water Cooled Chilled Water Plant",9,0.61,"2022-04-08"]
["SUNTEC TOWER FOUR","6 TEMASEK BOULEVARD, SINGAPORE 038986","Commercial Building","Office",null,null,"",null,"",null,"",1997,"GoldPlus",2022,"Existing Non-Residental Buildings ENRB: 2017",58854,48484,0.82380127094165223,0,"Water Cooled Chilled Water Plant",9,0.61,"2022-04-08"]
["SUNTEC TOWER FIVE","5 TEMASEK BOULEVARD, SINGAPORE 038985","Commercial Building","Office",null,null,"",null,"",null,"",1994,"GoldPlus",2022,"Existing Non-Residental Buildings ENRB: 2017",48792,37672,0.77209378586653554,0,"Water Cooled Chilled Water Plant",9,0.61,"2022-04-08"]
["DSO NATIONAL LABORATORIES","27 MEDICAL DRIVE, SINGAPORE 117510","Commercial Building","Office",null,null,"",null,"",null,"",2003,null,null,null,16180,13980,0.8640296662546354,0,"Water Cooled Chilled Water Plant",1,"",""]
["MSF BUILDING","MCST 1334 ,514 THOMSON ROAD,SLF BUILDING ANNEXE SINGAPORE 298179, SINGAPORE 298179","Commercial Building","Office",null,null,"",null,"",null,"",1986,null,null,null,4316.07,44615,10.336950049466298,0,"Water Cooled Chilled Water Plant",16,-3.32,"2011-01-31"]
["MILLENIA TOWER","1 TEMASEK AVENUE SINGAPORE 039192, SINGAPORE 039192","Commercial Building","Office",null,null,null,null,null,null,null,1998,"Gold",2022,"Existing Building for Non-Residential buildings (version 3)",73019,62802,0.86007751407167998,0,"District Cooling System (DCS)","",0.67,"2013-03-20"]
["CINTECH III","77 SCIENCE PARK DRIVE, SINGAPORE SCIENCE PARK 1, SINGAPORE 118256","Commercial Building","Office",null,null,"",null,"",null,null,1994,"GoldPlus",2022,"Existing Non-Residential Buildings (RECERT 2017)",8394,10962,1.3059328091493925,0,"Water Cooled Chilled Water Plant",9,0.6,"2017-02-01"]
["CINTECH I","73 SCIENCE PARK DRIVE, 118254, SINGAPORE 118254","Commercial Building","Office",null,null,"",null,"",null,null,1988,"Certified",2022,"Existing Non-Residential Buildings (RECERT 2017)",15192,14693,0.96715376513954709,0,"Water Cooled Chilled Water Plant",8,0.59,"2019-03-01"]
["CINTECH IV","79 SCIENCE PARK DRIVE, SCIENCE PARK 1, SINGAPORE 118264","Commercial Building","Office",null,null,"",null,"",null,null,2009,"GoldPlus",2022,"Existing Non-Residential Buildings (RECERT 2017)",12110,10380,0.8571428571428571,0,"Water Cooled Chilled Water Plant",8,0.63,"2022-10-01"]
["IMMUNOS","8A BIOMEDICAL GROVE, SINGAPORE 138648, SINGAPORE 138648","Commercial Building","Office",null,null,null,null,null,null,null,2006,null,null,null,22604,20000,0.88479915059281544,0,"District Cooling System (DCS)","","",""]
["DSO NATIONAL LABORATORIES","14 SCIENCE PARK DRIVE, SINGAPORE 118226","Commercial Building","Office",null,null,"",null,"",null,null,2013,"GoldPlus",2013,"New Building for Non-Residential buildings (version 4)",23379,14451,0.61811882458616707,0,"Water Cooled Chilled Water Plant",10,0.65,"2020-10-20"]
["SOUTH BEACH COMPLEX (MCST NO. 4622)","38 BEACH ROAD, SINGAPORE 189767","Commercial Building","Office",null,null,"",null,"",null,null,2015,"Platinum",2021,"New Building for Non-Residential buildings (version 3)",71830.399999999994,67523,0.94003374615761581,0,"Water Cooled Chilled Water Plant",7,0.85,"2023-06-30"]
["MND BUILDING ANNEXE A","9 MAXWELL ROAD, SINGAPORE 069112","Commercial Building","Office",null,null,"",null,"",null,null,1970,"Platinum",2022,"Existing Non-Residental Buildings ENRB: 2017",28366,4695,0.16551505323274343,0,"Water Cooled Chilled Water Plant",2,0.57999999999999996,"2020-12-17"]
["MND BUILDING ANNEXE B","7 MAXWELL ROAD, SINGAPORE 069111","Commercial Building","Office",null,null,"",null,"",null,null,1983,"Platinum",2022,"Existing Non-Residental Buildings ENRB: 2017",12176,5383,0.44209921156373194,0,"Others","",0.57999999999999996,"2020-12-17"]
["THE CENTRAL","8 EU TONG SEN STREET, SINGAPORE 059818","Commercial Building","Office",null,null,"",null,"",null,null,2008,null,null,null,31412,29843,0.95005093594804535,0,"Water Cooled Chilled Water Plant",13,"",""]
["THE CENTRAL","12 EU TONG SEN STREET, SINGAPORE 059819, SINGAPORE 059819","Commercial Building","Office",null,null,"",null,"",null,null,2008,null,null,null,4292,3523,0.82082945013979491,0,"Others","","",""]
["RAFFLES CITY TOWER","250 NORTH BRIDGE ROAD, SINGAPORE 179101, SINGAPORE 179101","Commercial Building","Office",null,null,null,null,null,null,null,1986,null,null,null,44934,41000,0.91244937018738592,0,"Water Cooled Chilled Water Plant",15,0.75,"2016-12-09"]
["SYMBIOSIS","3 FUSIONOPOLIS WAY, SINGAPORE 138633, SINGAPORE 138633","Commercial Building","Office",null,null,null,null,null,null,null,2008,null,null,null,1,1,1,0,"District Cooling System (DCS)"]
["THE CAPITOL KEMPINSKI HOTEL SINGAPORE","15 STAMFORD ROAD, SINGAPORE 178906","Commercial Building","Hotel",null,509.62366294271453,null,527.93962443546468,null,603.4870454005229,null,2015,null,null,null,12621,12210,0.96743522700261464,157,"District Cooling System (DCS)"]
["VALUE HOTEL THOMSON","592 BALESTIER ROAD, SINGAPORE 329901","Commercial Building","Hotel",null,523.02237500000001,"Bottom Quartile",575.52592968750002,"Bottom Quartile",529.61853125000005,"Bottom Quartile",2009,null,null,null,6400,6310,0.98593750000000002,366,"Others","","",""]
["THE SINGAPORE RESORT & SPA","2 BUKIT MANIS ROAD, SINGAPORE 099891","Commercial Building","Hotel",null,363.3336060209424,"Bottom Quartile",410.12418266433974,"Bottom Quartile",445.96515052356023,"Bottom Quartile",1990,null,null,null,13752,12790,0.93004653868528209,215,"Water Cooled Chilled Water Plant",11,"",""]
["OASIA RESORT SENTOSA","23 BEACH VIEW, SINGAPORE 098679","Commercial Building","Hotel",null,305.92673873529128,null,214.34177748014926,null,431.69406868841475,null,2011,null,null,null,10453,6998,0.66947287859944515,191,"District Cooling System (DCS)","","",""]
["STUDIO M HOTEL REPUBLIC ICONIC HOTEL PTE LTD","3 NANSON ROAD, SINGAPORE 238910","Commercial Building","Hotel",null,364.82681475996549,"Bottom Quartile",298.75243490065407,"Bottom Quartile",421.55671973343209,"Bottom Quartile",2010,"Gold",2021,"Existing Building for Non-Residential buildings (version 3)",8103,8103,1,360,"Others","",1,"2022-01-12"]
["THE ST REGIS HOTEL SINGAPORE","29 TANGLIN ROAD, SINGAPORE 247911","Commercial Building","Hotel",null,340.02834250064598,"Bottom Quartile",358.50493595186242,"Bottom Quartile",406.1484399571782,"Bottom Quartile",2006,"GoldPlus",2006,"New Building (version 1)",27089,6940,0.25619255048174538,298,"Water Cooled Chilled Water Plant",16,0.3,"2013-08-02"]
["HOTEL 81 DICKSON","3 DICKSON ROAD, SINGAPORE 209530","Commercial Building","Hotel",null,334.49351593625499,"Bottom Quartile",373.7397609561753,"Bottom Quartile",386.95610557768924,"Bottom Quartile",2008,null,null,null,5020,5021,1.0001992031872511,235,"Others","","",""]
["HILTON GARDEN INN SINGAPORE","3 BELILIOS ROAD, SINGAPORE 219924, SINGAPORE 219924","Commercial Building","Hotel",null,323.81933907247986,"Bottom Quartile",313.3960122188281,"Bottom Quartile",385.23185041192261,"Bottom Quartile",2015,null,null,null,10803,8964,0.82976950846986952,328,"Others","","",""]
["INTERCONTINENTAL SINGAPORE ROBERTSON QUAY","1 NANSON ROAD, SINGAPORE 238909","Commercial Building","Hotel",null,377.75658078969474,"Bottom Quartile",363.16985788294596,"Bottom Quartile",380.74760221226546,"Bottom Quartile",2017,null,null,null,14284,12367,0.86579389526743211,225,"Water Cooled Chilled Water Plant",7,0.68200000000000005,"2022-10-01"]
["W SINGAPORE SENTOSA COVE HOTEL","21 OCEAN WAY, SINGAPORE 098374","Commercial Building","Hotel",null,335.26718487394959,"Bottom Quartile",348.08420168067227,"Bottom Quartile",369.72537815126049,"Bottom Quartile",2012,null,null,null,23800,13296,0.55865546218487394,240,"Water Cooled Chilled Water Plant",10,"",""]
["IBIS SINGAPORE ON BENCOOLEN","170 BENCOOLEN STREET, SINGAPORE 189657","Commercial Building","Hotel",null,323.80303887631476,"Bottom Quartile",315.73921581680202,"Bottom Quartile",364.58609905471974,"Bottom Quartile",2017,null,null,null,15022,12568,0.83663959526028486,537,"Air Cooled Chilled Water Plant","",1.55,"2022-07-01"]
["V HOTEL BENCOOLEN","48 BENCOOLEN STREET, SINGAPORE 189627","Commercial Building","Hotel",null,289.22777038585821,"Bottom Quartile",323.32874928720776,"Bottom Quartile",348.91471203193311,"Bottom Quartile",2013,"GoldPlus",2015,"New Building for Non-Residential buildings (version 4)",5261,5000,0.95038965976050183,273,"Air Cooled Chilled Water Plant","","",""]
["V HOTEL LAVENDER","70 JELLICOE ROAD, SINGAPORE 208767","Commercial Building","Hotel",null,330.75861160855368,"Bottom Quartile",311.46460549878856,"Bottom Quartile",346.72111029179393,"Bottom Quartile",2011,"GoldPlus",2012,"New Building for Non-Residential buildings (version 3)",18986,18000,0.94806699673443595,888,"Water Cooled Chilled Water Plant",11,0.7,"2015-12-10"]
["ALOFT SINGAPORE NOVENA ( WEST WING)","WEST WING 16 AH HOOD ROAD, SINGAPORE 329982","Commercial Building","Hotel",null,321.82263055172086,"Bottom Quartile",318.06867948778978,"Bottom Quartile",344.06095587185223,"Bottom Quartile",2012,"Gold",2022,"Existing Non-Residential Buildings (RECERT 2017)",14304,13715,0.95882270693512306,382,"Others","",0.95,"2023-01-20"]
["HOTEL RE! PTE LTD","175A CHIN SWEE ROAD,\nSINGAPORE 169879, SINGAPORE 169879","Commercial Building","Hotel",null,271.89157574761748,"Bottom Quartile",323.28019224449554,"Bottom Quartile",343.22393197502464,"Bottom Quartile",2008,"Certified",2018,"Existing Building for Non-Residential buildings (version 2.1)",6086,5400,0.88728228721656255,140,"Water-Cooled Package Units","","",""]
["HOTEL G SINGAPORE","200 MIDDLE ROAD, SINGAPORE 188980","Commercial Building","Hotel",null,327.08294171220399,"Bottom Quartile",312.64549180327867,"Bottom Quartile",338.33960837887071,"Bottom Quartile",2013,null,null,null,8784,8702,0.99066484517304187,306,"Others","","",""]
["CARLTON CITY HOTEL SINGAPORE","1 GOPENG STREET, SINGAPORE 078862","Commercial Building","Hotel",null,295.67560543414061,"Bottom Quartile",313.24268556802519,"Bottom Quartile",338.15073833431779,"Bottom Quartile",2014,"Platinum",2023,"GM:2021 In Operation",15237,15237,1,386,"Water Cooled Chilled Water Plant",10,0.622,"2017-06-27"]
["VILLAGE HOTEL BUGIS","390 VICTORIA STREET, SINGAPORE 188061","Commercial Building","Hotel",null,308.29312988964301,"Bottom Quartile",317.23007098077818,"Bottom Quartile",329.91605305424588,"Bottom Quartile",1983,"GoldPlus",2021,"Existing Building for Non-Residential buildings (version 3)",19301,11520,0.59686026630744526,393,"Water Cooled Chilled Water Plant",4,0.60299999999999998,"2021-05-01"]
["SHANGRI-LA SINGAPORE","22 ORANGE GROVE ROAD, SINGAPORE 258350","Commercial Building","Hotel",null,264.73595202549274,"3rd Quartile",285.47155277321258,"Bottom Quartile",326.30209888469307,"Bottom Quartile",1971,"Gold",2022,"Existing Non-Residential Buildings (RECERT 2017)",79709,67101,0.84182463711751498,792,"Water Cooled Chilled Water Plant",25,0.7,"2022-12-02"]
["M SOCIAL SINGAPORE NOVEL DEVELOPMENT PTE LTD","90 ROBERTSON QUAY 238259, SINGAPORE 238259","Commercial Building","Hotel",null,326.72907447686191,"Bottom Quartile",303.10207755193881,"Bottom Quartile",310.07947073676843,"Bottom Quartile",2016,"Goldplus",2023,"Existing Non-Residential Buildings Re-Cert (GM:2021 In Operation)",7999.8,7669,0.95864896622415563,293,"Water Cooled Chilled Water Plant","","",""]
["PARKROYAL COLLECTION PICKERING","3 UPPER PICKERING STREET, SINGAPORE 058289, SINGAPORE 058289","Commercial Building","Hotel",null,264.79581362584281,"3rd Quartile",280.52664284995473,"Bottom Quartile",308.9318707859515,"Bottom Quartile",2012,"Platinum",2021,"New Building for Non-Residential buildings (version 3)",29811,22438,0.75267518701150582,367,"Water Cooled Chilled Water Plant",11,0.64600000000000002,"2020-11-02"]
["TRAVELODGE HARBOURFRONT SINGAPORE","50 TELOK BLANGAH ROAD, SINGAPORE 098828","Commercial Building","Hotel",null,"","Bottom Quartile","","Bottom Quartile",307.99111020073741,"Bottom Quartile",2023,null,null,null,7323,7017,0.95821384678410493,328,"Others","","",""]
["HOTEL FORT CANNING","11 CANNING  WALK, SINGAPORE 178881","Commercial Building","Hotel",null,246.82689979825153,"3rd Quartile",258.58760143465594,"3rd Quartile",300.9817753866846,"Bottom Quartile",2012,"GoldPlus",2015,"Existing Building for Non-Residential buildings (version 3)",8922,8922,1,86,"Water Cooled Chilled Water Plant",8,0.65,"2015-03-31"]
["HOTEL TELEGRAPH SINGAPORE","35 ROBINSON ROAD, SINGAPORE 068876","Commercial Building","Hotel",null,281.89373154362414,"Bottom Quartile",286.00008053691278,"Bottom Quartile",298.52590604026847,"Bottom Quartile",2014,"Platinum",2022,"Existing Non-Residential Buildings (RECERT 2017)",7450,7450,1,134,"Water Cooled Chilled Water Plant",2014,"",""]
["HOTEL TRAVELTINE","700 BEACH ROAD, SINGAPORE 199598","Commercial Building","Hotel",null,254.89115747920485,"3rd Quartile",276.46253207387565,"Bottom Quartile",290.9781418299732,"Bottom Quartile",2016,null,null,null,7093,7093,1,300,"Others","","",""]
["HILTON SINGAPORE ORCHARD","333 ORCHARD ROAD SINGAPORE 238867, SINGAPORE 238867","Commercial Building","Hotel",null,268.65041277859632,"3rd Quartile",248.94010617647746,"3rd Quartile",287.30011927313552,"Bottom Quartile",1970,"Gold",2020,"Existing Building for Non-Residential buildings (version 2.1)",67268,67169,0.99852827495986207,1080,"Water Cooled Chilled Water Plant",15,"",""]
["PARK REGIS INVESTMENTS PTE LTD","23 MERCHANT ROAD, SINGAPORE 058268","Commercial Building","Hotel",null,240.22021516989284,"3rd Quartile",220.7880310708648,"3rd Quartile",284.57792639361969,"Bottom Quartile",2010,null,null,null,7432,6890,0.92707212055974164,202,"Others","","",""]
["MERCURE SINGAPORE BUGIS","122 MIDDLE ROAD, SINGAPORE 188973","Commercial Building","Hotel",null,335.74257207699418,"Bottom Quartile",313.68045557703624,"Bottom Quartile",283.79880221904682,"3rd Quartile",2016,null,null,null,11897,11526,0.96881566781541562,395,"Others","","",""]
["FOUR SEASONS HOTEL","190 ORCHARD BOULEVARD, SINGAPORE 248646","Commercial Building","Hotel",null,221.95150810089947,"3rd Quartile",242.34035127543058,"3rd Quartile",283.66479868342651,"3rd Quartile",1994,"Certified",2019,"Existing Non-Residental Buildings ENRB: 2017",35243,34020,0.96529807337627327,259,"Water Cooled Chilled Water Plant",9,"",""]
["MARINA BAY SANDS","1 BAYFRONT AVENUE, SINGAPORE 018971","Commercial Building","Hotel",null,243.10061169485434,null,260.80238840318469,null,283.27218976231552,null,2010,"Platinum",2021,"Existing Building for Non-Residential buildings (version 3)",260570,260570,1,2561,"District Cooling System (DCS)","","",""]
["HOTEL GRAND CENTRAL","22 CAVENAGH ROAD, SINGAPORE 229617","Commercial Building","Hotel",null,266.64503071253068,"3rd Quartile",259.63511056511055,"3rd Quartile",282.95531941031936,"3rd Quartile",2015,null,null,null,8140,7815,0.96007371007371012,263,"Others","","",""]
["HOTEL CHANCELLOR @ ORCHARD","28 CAVENAGH ROAD, SINGAPORE 229635","Commercial Building","Hotel",null,228.42455610537039,"3rd Quartile",265.29837359918497,"3rd Quartile",282.93319749672537,"3rd Quartile",2015,null,null,null,13742,12690,0.92344636879639064,488,"Others","","",""]
["BEACH ROAD HOTEL 1886(LTD)","1 BEACH ROAD, SINGAPORE 189673","Commercial Building","Hotel",null,"","Bottom Quartile","","Bottom Quartile",280.93410977859776,"3rd Quartile",2022,null,null,null,43360,17612,0.4061808118081181,128,"Water Cooled Chilled Water Plant",12,"",""]
["THE MANAGEMENT CORPORATION STRATA TITLE PLAN NO. 3837","8 SINARAN DRIVE, SINGAPORE 307470","Commercial Building","Hotel",null,293.06410562250647,"Bottom Quartile",293.32781639452145,"Bottom Quartile",279.4985234236828,"3rd Quartile",2011,null,null,null,24313,8397,0.3453707892896804,428,"Others","","",""]
["IBIS NOVENA HOTEL","6 IRRAWADDY ROAD, SINGAPORE 329543","Commercial Building","Hotel",null,294.16178745644601,"Bottom Quartile",308.10326655052268,"Bottom Quartile",277.39837108013938,"3rd Quartile",2011,"Platinum",2015,"Existing Building for Non-Residential buildings (version 3)",5740,17,2.961672473867596E-3,251,"Water-Cooled Package Units","","",""]
["ORCHID HOTEL","1 TRAS LINK, SINGAPORE 078867","Commercial Building","Hotel",null,391.19030121922066,"Bottom Quartile",256.35176667463543,"3rd Quartile",275.8865455414774,"3rd Quartile",2012,null,null,null,12549,12147,0.96796557494621083,272,"Others","","",""]
["PS100","100 PECK SEAH STREET, SINGAPORE 079333","Commercial Building","Hotel",null,276.1335568089313,"Bottom Quartile",263.75459879055705,"3rd Quartile",271.81892661937439,"3rd Quartile",2017,null,null,null,17198,15478,0.89998837074078386,314,"Water Cooled Chilled Water Plant",6,"",""]
["PAN PACIFIC SERVICED SUITES ORCHARD","96 SOMERSET ROAD, SINGAPORE 238163","Commercial Building","Hotel",null,249.67204964600995,"3rd Quartile",256.64860763919239,"3rd Quartile",269.44637706494188,"3rd Quartile",2008,null,null,null,11441,9152,0.79993007604230404,126,"Water Cooled Chilled Water Plant",15,"",""]
["AM HOTEL","51 JOO CHIAT ROAD, SINGAPORE 427373","Commercial Building","Hotel",null,244.90137628111273,"3rd Quartile",183.03132259638849,"Top Quartile",266.86573938506592,"3rd Quartile",2016,null,null,null,2049,1954,0.95363591996095654,70,"Others","","",""]
["THE ROBERTSON HOUSE BY THE CREST COLLECTION","1 UNITY STREET, SINGAPORE 237983","Commercial Building","Hotel",null,240.67544410550869,"3rd Quartile",257.39312309348645,"3rd Quartile",257.39083527722948,"3rd Quartile",2009,null,null,null,11146,2950,0.26466893952987619,336,"Water Cooled Chilled Water Plant","","",""]
["ORCHARD HOTEL SINGAPORE","442 ORCHARD ROAD, SINGAPORE 238879","Commercial Building","Hotel",null,244.56313580126277,"3rd Quartile",224.97020479398458,"3rd Quartile",257.09150932742131,"3rd Quartile",1996,"GoldPlus",2022,"Existing Non-Residential Buildings (RECERT 2017)",49940.92,49832,0.99781902295752667,656,"Water Cooled Chilled Water Plant",2019,0.61799999999999999,"2022-12-05"]
["FOUR POINTS BY SHERATON SINGAPORE, RIVERVIEW","382 HAVELOCK ROAD, SINGAPORE 169629","Commercial Building","Hotel",null,218.93830907107971,"2nd Quartile",219.42211579496421,"3rd Quartile",255.98985252975484,"3rd Quartile",1985,"Gold",2021,"Existing Building for Non-Residential buildings (version 2.1)",21089,17815,0.84475318886623363,476,"Water Cooled Chilled Water Plant",0,0.87,"2016-12-26"]
["GOODWOOD PARK HOTEL","22 SCOTTS ROAD, SINGAPORE 228221","Commercial Building","Hotel",null,203.07229558436015,"2nd Quartile",218.09992963177564,"2nd Quartile",254.89862788715692,"3rd Quartile",1900,"Gold",2022,"GM:2021 In Operation",29615.64,26654,0.89999743378836317,233,"Water Cooled Chilled Water Plant",7,"",""]
["CAPELLA HOTEL SINGAPORE","1 THE KNOLLS, SINGAPORE 098297","Commercial Building","Hotel",null,243.9234119553096,"3rd Quartile",250.70760830685717,"3rd Quartile",253.6218412691733,"3rd Quartile",2009,"Gold",2022,"Existing Non-Residental Buildings ENRB: 2017",47527,38020,0.7999663349254108,110,"Water Cooled Chilled Water Plant",14,0.75,"2022-09-26"]
["ROBERTSON WALK","11 UNITY STREET, SINGAPORE 237995","Commercial Building","Hotel",null,230.93982976225419,"3rd Quartile",234.46838208916284,"3rd Quartile",245.49721162312886,"3rd Quartile",1999,null,null,null,30663,22118,0.72132537586015721,160,"Water Cooled Chilled Water Plant",23,"",""]
["HOTEL JEN BY SHANGRI-LA","1A CUSCADEN ROAD, SINGAPORE 249716","Commercial Building","Hotel",null,211.12115756358261,"2nd Quartile",204.96704317173939,"2nd Quartile",244.63847932380699,"3rd Quartile",1995,"Platinum",2021,"Existing Building for Non-Residential buildings (version 3)",26383,21108,0.80006064511238295,565,"Water Cooled Chilled Water Plant",2012,0.61,"2022-06-01"]
["DORSETT SINGAPORE","333 NEW BRIDGE ROAD, SINGAPORE 088765","Commercial Building","Hotel",null,230.83429730662982,"3rd Quartile",234.44617575966851,"3rd Quartile",243.96382941988949,"3rd Quartile",2012,null,null,null,11584,10227,0.88285566298342544,285,"Water Cooled Chilled Water Plant",10,0.8,"2022-06-15"]
["SHANGRI-LA'S RASA SENTOSA RESORT & SPA","101 SILOSO ROAD, SINGAPORE 098970, SINGAPORE 098970","Commercial Building","Hotel",null,200.17809278964032,"2nd Quartile",220.85445975862316,"3rd Quartile",243.5667833083387,"3rd Quartile",1993,null,null,null,42009,36000,0.85695922302363781,454,"Water Cooled Chilled Water Plant",10,0.73,"2017-07-31"]
["HOLIDAY INN EXPRESS CLARKE QUAY","2 MAGAZINE ROAD, SINGAPORE 059573","Commercial Building","Hotel",null,228.91327335992531,"3rd Quartile",213.78857676313331,"2nd Quartile",239.16642620724772,"3rd Quartile",2014,"Platinum",2021,"New Building for Non-Residential buildings (version 4)",11783,9351,0.79360095052193835,442,"Water Cooled Chilled Water Plant",10,0.55000000000000004,"2021-06-18"]
["SHERATON TOWERS SINGAPORE HOTEL","39 SCOTTS ROAD, SINGAPORE 228230","Commercial Building","Hotel",null,206.18938957212401,"2nd Quartile",229.55204330002562,"3rd Quartile",236.43934153215474,"3rd Quartile",1985,"Platinum",2022,"GM:2021 In Operation",31224,25000,0.80066615424032794,417,"Water Cooled Chilled Water Plant",5,0.60299999999999998,"2022-07-20"]
["FONTAINE INVESTMENT PTE LTD","10 ARTILLERY AVENUE, SINGAPORE 099951","Commercial Building","Hotel",null,202.06616912631168,"2nd Quartile",222.32848886145558,"3rd Quartile",234.05425060322091,"3rd Quartile",2020,"Gold",2022,"New Non-Residential Buildings (NRB: 2015) (R3)",35642,25000,0.70141967341900002,839,"Water Cooled Chilled Water Plant",4,0.67,"2020-09-21"]
["HOTEL MI","41 BENCOOLEN STREET, SINGAPORE 189623","Commercial Building","Hotel",null,215.38915228807201,"2nd Quartile",222.14285671417852,"3rd Quartile",233.9048912228057,"3rd Quartile",2017,"GoldPlus",2018,"New Building for Non-Residential buildings (version 4.1)",6665,6666,1.0001500375093773,342,"Water Cooled Chilled Water Plant",6,0.64,"2020-08-20"]
["SILOSO BEACH RESORT","51 IMBIAH WALK, SINGAPORE 099538","Commercial Building","Hotel",null,217.24846260547912,"2nd Quartile",203.83139521442607,"2nd Quartile",231.66502138481101,"2nd Quartile",2006,null,null,null,8651,6728,0.77771355912611262,194,"Water Cooled Chilled Water Plant",8,1.05,"2019-01-11"]
["VILLAGE HOTEL KATONG","25 MARINE PARADE, SINGAPORE 449536","Commercial Building","Hotel",null,199.27502218278616,"2nd Quartile",197.63984250221827,"2nd Quartile",230.51456965394854,"2nd Quartile",2013,null,null,null,22540,21363,0.94778172138420591,229,"Water Cooled Chilled Water Plant",9,0.65,"2020-11-30"]
["ORCHARD RENDEZVOUS HOTEL","1 TANGLIN ROAD, SINGAPORE 247905","Commercial Building","Hotel",null,219.60178564729713,"3rd Quartile",195.77146715684435,"2nd Quartile",227.10169936602017,"2nd Quartile",1977,"Gold",2022,"Existing Non-Residential Buildings (RECERT 2017)",26657,26307,0.98687024046216754,388,"Water Cooled Chilled Water Plant",11,0.78400000000000003,"2022-10-13"]
["PULLMAN SINGAPORE ORCHARD","270 ORCHARD ROAD, SINGAPORE 238857","Commercial Building","Hotel",null,269.51972927541362,"3rd Quartile",243.99946916747766,"3rd Quartile",225.09271874723524,"2nd Quartile",2010,null,null,null,22606,22058,0.97575864814650981,308,"Water-Cooled Package Units","","",""]
["COPTHORNE KINGS HOTEL SINGAPORE","403 HAVELOCK ROAD, SINGAPORE 169632","Commercial Building","Hotel",null,"","Bottom Quartile","","Bottom Quartile",219.51471621563826,"2nd Quartile",2022,"Platinum",2022,"Existing Non-Residential Buildings (RECERT 2017)",16366.3,10222,0.62457611066643048,311,"Water Cooled Chilled Water Plant",2012,-0.53,"2021-05-20"]
["VIBE HOTEL SINGAPORE ORCHARD","24 MOUNT ELIZABETH, SINGAPORE 228518, SINGAPORE 228518","Commercial Building","Hotel",null,224.07443542172959,"3rd Quartile",239.58914112974927,"3rd Quartile",218.89130460553613,"2nd Quartile",1993,null,null,null,12052,12052,1,256,"Water Cooled Chilled Water Plant",15,"",""]
["CAPRI BY FRASER CHANGI CITY","3 CHANGI BUSINESS PARK CENTRAL 1, SINGAPORE 486037","Commercial Building","Hotel",null,244.10290307278763,"3rd Quartile",241.29452379697466,"3rd Quartile",217.47361408317082,"2nd Quartile",2012,"GoldPlus",2022,"Existing Non-Residential Buildings (RECERT 2017)",18973,16224,0.85510989300585039,313,"Water Cooled Chilled Water Plant",11,0.69699999999999995,"2022-11-03"]
["HOTEL ROYAL","36 NEWTON ROAD, SINGAPORE 307964","Commercial Building","Hotel",null,221.09124297872341,"3rd Quartile",209.78268297872339,"2nd Quartile",217.09955957446809,"2nd Quartile",1971,null,null,null,23500,23354,0.9937872340425532,362,"Water Cooled Chilled Water Plant",25,"",""]
["HOLIDAY INN SINGAPORE ORCHARD CITY CENTER","11 CAVANAGH ROAD, SINGAPORE 229616","Commercial Building","Hotel",null,194.44439697265625,"2nd Quartile",205.02693684895834,"2nd Quartile",215.60577392578125,"2nd Quartile",1985,"Gold",2020,"Existing Building for Non-Residential buildings (version 3)",24576,24000,0.9765625,324,"Water Cooled Chilled Water Plant",4,0.65,"2019-05-05"]
["CONRAD SINGAPORE ORCHARD (FORMERLY REGENT SINGAPORE)","1 CUSCADEN ROAD, SINGAPORE 249715","Commercial Building","Hotel",null,237.73025462906344,"3rd Quartile",229.69331996184232,"3rd Quartile",215.18237409192085,"2nd Quartile",1982,"GoldPlus",2020,"Existing Building for Non-Residential buildings (version 2.1)",40883,37160,0.90893525426216271,440,"Water Cooled Chilled Water Plant",1,0.55800000000000005,"2023-05-09"]
["GRAND COPTHORNE WATERFRONT HOTEL SINGAPORE","392 HAVELOCK ROAD, SINGAPORE 169663","Commercial Building","Hotel",null,179.0201755403472,"Top Quartile",190.03264895797085,"2nd Quartile",215.0158914279086,"2nd Quartile",1999,"Platinum",2021,"Existing Building for Non-Residential buildings (version 3)",51726,38713,0.74842439005529138,574,"Water Cooled Chilled Water Plant",4,0.6,"2021-01-01"]
["RENDEZVOUS HOTEL SINGAPORE","9 BRAS BASAH ROAD, SINGAPORE 189559","Commercial Building","Hotel",null,245.60192697768764,"3rd Quartile",241.09355983772821,"3rd Quartile",212.63417849898579,"2nd Quartile",1998,"GoldPlus",2017,"Existing Building for Non-Residential buildings (version 2.1)",19720,12584,0.63813387423935086,298,"Water Cooled Chilled Water Plant",20,"",""]
["AMARA SANCTUARY RESORT SENTOSA","1LARKHILL ROAD, SINGAPORE 099394","Commercial Building","Hotel",null,209.33640479360852,"2nd Quartile",214.53970705725698,"2nd Quartile",211.51041278295605,"2nd Quartile",2007,"Platinum",2022,"GM:2021 In Operation",15020,11092,0.73848202396804263,140,"Water Cooled Chilled Water Plant",5,"",""]
["CARLTON HOTEL SINGAPORE","76 BRAS BASAH ROAD, SINGAPORE 189558","Commercial Building","Hotel",null,212.78805980212039,"2nd Quartile",208.60083264508083,"2nd Quartile",208.75222572435067,"2nd Quartile",1988,"Gold",2022,"Existing Non-Residential Buildings (Version 2.1)",59329,57735,0.97313286925449616,939,"Water Cooled Chilled Water Plant",23,0.78,"2022-08-29"]
["TRISTAR INN","1 ONAN ROAD, SINGAPORE 424780","Commercial Building","Hotel",null,219.39445789865871,"3rd Quartile",224.07382637853951,"3rd Quartile",208.51942995529063,"2nd Quartile",1999,null,null,null,5368,5316,0.99031296572280181,117,"Others","","",""]
["FURAMA SINGAPORE HOTEL & SHOPPING CENTRE","60 EU TONG SEN STREET, SINGAPORE 059804","Commercial Building","Hotel",null,194.83412615539314,"2nd Quartile",178.50096685617046,"Top Quartile",206.52689793866264,"2nd Quartile",1987,"Platinum",2021,"Existing Building for Non-Residential buildings (version 3)",25857,25857,1,445,"Water Cooled Chilled Water Plant",12,0.59,"2021-04-26"]
["HOTEL ROYAL @ QUEENS","12 QUEEN STREET, SINGAPORE 188553","Commercial Building","Hotel",null,192.90708316752884,"2nd Quartile",193.06995622761639,"2nd Quartile",206.09725427775567,"2nd Quartile",1986,"Gold",2023,"GM:2021 In Operation",12565,11500,0.91524074810982892,236,"Water Cooled Chilled Water Plant",9,1.24,"2022-12-15"]
["LINK HOTEL","50 TIONG BAHRU ROAD, SINGAPORE 168733","Commercial Building","Hotel",null,215.11722189523249,"2nd Quartile",202.63402001177164,"2nd Quartile",205.47969393761036,"2nd Quartile",2016,null,null,null,10194,10194,1,274,"Others","","",""]
["HOTEL BOSS","500 JALAN SULTAN, SINGAPORE 199020","Commercial Building","Hotel",null,185.49586656441718,"Top Quartile",218.96962423312883,"2nd Quartile",204.53888036809815,"2nd Quartile",2015,"Platinum",2016,"New Building for Non-Residential buildings (version 4.1)",32600,29200,0.89570552147239269,1500,"Water Cooled Chilled Water Plant",7,0.62,"2020-07-20"]
["NOVOTEL & MERCURE","28 STEVENS ROAD, SINGAPORE 257878, SINGAPORE 257878","Commercial Building","Hotel",null,215.38729063039284,"2nd Quartile",197.97600243630089,"2nd Quartile",200.59729976652116,"2nd Quartile",2017,"GoldPlus",2022,"Existing Non-Residental Buildings ENRB: 2017",29553,26700,0.90346157750482181,772,"Water Cooled Chilled Water Plant",7,0.68100000000000005,"2023-07-20"]
["FURAMA RIVERFRONT","405 HAVELOCK ROAD, SINGAPORE 169633","Commercial Building","Hotel",null,209.12587170614853,"2nd Quartile",205.94141602342293,"2nd Quartile",199.93269896193772,"2nd Quartile",1973,"Platinum",2021,"Existing Building for Non-Residential buildings (version 3)",37570,26873,0.71527814745807827,663,"Water Cooled Chilled Water Plant",12,0.54800000000000004,"2021-01-24"]
["ASCOTT RAFFLES PLACE SINGAPORE","2 FINLAYSON GREEN, SINGAPORE 049247","Commercial Building","Hotel",null,181.58843379635528,"Top Quartile",195.26631833821844,"2nd Quartile",199.47249776984833,"2nd Quartile",2016,"Certified",2007,"New Building for A/C buildings (version 2)",15694,10338,0.65872307888364978,146,"Others","","",""]
["KATONG SQUARE","86, 88 EAST COAST ROAD, SINGAPORE 428788","Commercial Building","Hotel",null,187.05124603174605,"2nd Quartile",189.55533333333335,"2nd Quartile",198.54680952380951,"Top Quartile",2016,"Platinum",2023,"GM:2021 In Operation",25200,23604,0.93666666666666665,582,"Water Cooled Chilled Water Plant",6,0.65,"2020-10-20"]
["TANG PLAZA","320 ORCHARD ROAD, SINGAPORE 238865","Commercial Building","Hotel",null,200.65847537383667,"2nd Quartile",205.83225713688174,"2nd Quartile",198.53267802990695,"Top Quartile",1982,"Gold",2021,"Existing Building for Non-Residential buildings (version 3)",58999,54035,0.91586298072848693,403,"Water Cooled Chilled Water Plant","",0.68,"2021-08-27"]
["CONCORDE SHOPPING CENTRE","317 OUTRAM ROAD, SINGAPORE 169075","Commercial Building","Hotel",null,169.19411309722071,"Top Quartile",183.78944265571224,"Top Quartile",196.91373468783542,"Top Quartile",1986,"GoldPlus",2022,"Existing Building for Non-Residential buildings (version 3)",54042,42053,0.7781540283483217,515,"Water Cooled Chilled Water Plant",1,0,"2022-09-15"]
["8 ON CLAYMORE","8 CLAYMORE HILL, SINGAPORE 229572","Commercial Building","Hotel",null,215.22106211684763,"2nd Quartile",202.52669768816014,"2nd Quartile",196.09764015067583,"Top Quartile",2011,"Gold",2012,"Existing Building for Non-Residential buildings (version 2.1)",13539,13128,0.96964325282517172,85,"Water Cooled Chilled Water Plant",10,"",""]
["HOLIDAY INN EXPRESS SINGAPORE ORCHARD ROAD","20 BIDEFORD ROAD, SINGAPORE 229921","Commercial Building","Hotel",null,172.75411300373909,"Top Quartile",180.001454092231,"Top Quartile",194.66768868577759,"Top Quartile",2013,"Platinum",2018,"New Building for Non-Residential buildings (version 3)",7221,4747,0.65738817338318789,221,"Water Cooled Chilled Water Plant",10,0.55000000000000004,"2023-01-06"]
["CROWNE PLAZA CHANGI AIRPORT","75 AIRPORT BOULEVARD, SINGAPORE 819664","Commercial Building","Hotel",null,193.43793899854759,"2nd Quartile",176.64706302531013,"Top Quartile",192.13076501821473,"Top Quartile",2008,"Gold",2023,"GM:2021 In Operation",41999,41999,1,563,"Water Cooled Chilled Water Plant",15,0.65800000000000003,"2020-02-03"]
["VILLAGE HOTEL ALBERT COURT","180 ALBERT STREET, SINGAPORE 189971","Commercial Building","Hotel",null,179.93439348853491,"Top Quartile",188.94620864694556,"Top Quartile",183.62515315946087,"Top Quartile",1993,"Gold",2023,"GM:2021 In Operation",11426,8761,0.76676002100472607,210,"Water Cooled Chilled Water Plant",9,0.65,"2014-03-01"]
["PARADOX SINGAPORE MERCHANT COURT AT CLARKE QUAY","20 MERCHANT ROAD, SINGAPORE 058281","Commercial Building","Hotel",null,159.57061018552582,"Top Quartile",165.58566773532348,"Top Quartile",181.0940374205077,"Top Quartile",1997,"Platinum",2021,"Existing Building for Non-Residential buildings (version 3)",38054,38054,1,476,"Water Cooled Chilled Water Plant",5,0.62,"2017-12-28"]
["MERCURE SINGAPORE TYRWHITT","165 TYRWHITT ROAD, SINGAPORE 207569","Commercial Building","Hotel",null,213.44375179546105,"2nd Quartile",227.02459063487504,"3rd Quartile",177.77014507325481,"Top Quartile",2014,null,null,null,6962,6000,0.86182131571387532,270,"Others","",6.42,"2022-12-09"]
["HOTEL GRAND PACIFIC","101 VICTOR STREET, SINGAPORE 188018","Commercial Building","Hotel",null,181.03785953177257,"Top Quartile",161.70140468227424,"Top Quartile",174.23958193979934,"Top Quartile",1971,null,null,null,14950,13000,0.86956521739130432,240,"Water Cooled Chilled Water Plant",8,0.83,"2022-06-21"]
["PARK AVENUE ROCHESTER","31 ROCHESTER DRIVE, SINGAPORE 138637, SINGAPORE 138637","Commercial Building","Hotel",null,153.16625178751124,null,152.83862083576082,null,170.76023515703616,null,2011,"Gold",2009,"New Building for A/C buildings (version 2)",18881,18881,1,351,"District Cooling System (DCS)","","",""]
["M HOTEL SINGAPORE","81 ANSON ROAD, SINGAPORE 079908","Commercial Building","Hotel",null,154.52998486673462,"Top Quartile",161.97514592791623,"Top Quartile",170.75650915716977,"Top Quartile",1985,"GoldPlus",2021,"Existing Building for Non-Residential buildings (version 3)",32379,31033,0.95842984650545104,415,"Water Cooled Chilled Water Plant",13,0.67,"2022-07-11"]
["HOTEL MIRAMAR (S) LTD","401 HAVELOCK ROAD, SINGAPORE 169631","Commercial Building","Hotel",null,164.65800118875774,"Top Quartile",154.12203235119301,"Top Quartile",163.61631145453001,"Top Quartile",1971,"Gold",2019,"Existing Building for Non-Residential buildings (version 3)",23554,21262,0.90269168718688975,342,"Water Cooled Chilled Water Plant",6,0.68,"2018-12-11"]
["GENTING HOTEL JURONG","2 TOWN HALL LINK, SINGAPORE 608516","Commercial Building","Hotel",null,202.57873296077713,"2nd Quartile",187.76013213558261,"Top Quartile",162.14246409359168,"Top Quartile",2015,"Platinum",2020,"New Building for Non-Residential buildings (version 4.1)",19147,15755,0.82284430981354784,557,"Water Cooled Chilled Water Plant",7,0.62,"2019-05-30"]
["GRAND PARK CITY HALL","10  COLEMAN STREET , SINGAPORE 179809, SINGAPORE 179809","Commercial Building","Hotel",null,148.19918564005667,"Top Quartile",146.75225555030704,"Top Quartile",162.12335852621635,"Top Quartile",2018,"Platinum",2017,"New Building for Non-Residential buildings (version 4.1)",21170,19800,0.93528578176665089,343,"Water Cooled Chilled Water Plant",2018,0.61,"2021-03-15"]
["CAPRI BY FRASER CHINA SQUARE, SINGAPORE","181 SOUTH BRIDGE ROAD, SINGAPORE 058743","Commercial Building","Hotel",null,174.31764816204051,"Top Quartile",149.93752188047011,"Top Quartile",146.30482620655164,"Top Quartile",2019,"GoldPlus",2022,"Existing Non-Residental Buildings ENRB: 2017",15996,15326,0.95811452863215807,304,"Water Cooled Chilled Water Plant",4,0.61,"2020-08-14"]
["PARKROYAL KITCHENER HOTEL PTE LTD","181 KITCHENER ROAD, SINGAPORE 208533","Commercial Building","Hotel",null,159.73232655549958,"Top Quartile",163.16034649134434,"Top Quartile",144.77700829776518,"Top Quartile",1988,"Platinum",2019,"Existing Building for Non-Residential buildings (version 3)",37721,29829,0.79077967180085362,540,"Water Cooled Chilled Water Plant",2014,0.64600000000000002,"2023-01-13"]
["METRO-Y STEVENS","60 STEVENS ROAD, SINGAPORE 257854","Commercial Building","Hotel",null,140.64235172329802,"Top Quartile",135.91046522957009,"Top Quartile",139.48870539520155,"Top Quartile",1980,null,null,null,8211,7800,0.94994519546949219,98,"Water Cooled Chilled Water Plant",5,"",""]
["VILLAGE HOTEL CHANGI","1 NETHERAVON ROAD, SINGAPORE 508502","Commercial Building","Hotel",null,175.53351441338825,"Top Quartile",161.09594322264084,"Top Quartile",138.42512923858757,"Top Quartile",2004,"Certified",2020,"Existing Building for Non-Residential buildings (version 2.1)",22826,22826,1,380,"Water Cooled Chilled Water Plant",2003,0.95,"2020-04-01"]
["30 BENCOOLEN","30 BENCOOLEN STREET, SINGAPORE 189621","Commercial Building","Hotel",null,147.88518694860664,"Top Quartile",145.39675395602856,"Top Quartile",135.34958969332027,"Top Quartile",1988,"Gold",2022,"Existing Non-Residental Buildings ENRB: 2017",7141,6765,0.94734631004061054,130,"Water Cooled Chilled Water Plant",5,0.65,"2022-12-13"]
["YORK HOTEL","21 MOUNT ELIZABETH SINGAPORE 228516, SINGAPORE 228516","Commercial Building","Hotel",null,117.67603899435608,"Top Quartile",112.73057978450487,"Top Quartile",127.70464340687532,"Top Quartile",1971,"Gold",2022,"Existing Non-Residential Buildings (RECERT 2017)",31184,27181,0.87163288866085176,407,"Water Cooled Chilled Water Plant",7,"",""]
["GRAND HYATT SINGAPORE","10 SCOTTS ROAD, SINGAPORE 228211","Commercial Building","Hotel",null,159.26518529927492,"Top Quartile",163.41495367518127,"Top Quartile",100.37686069380599,"Top Quartile",1971,"Platinum",2022,"Existing Non-Residental Buildings ENRB: 2017",84404,70830,0.83917823799819913,677,"Water Cooled Chilled Water Plant",22,"",""]
["SEAMEO REGIONAL LANGUAGE CENTRE BUILDING","30 ORANGE GROVE ROAD, SINGAPORE 258352","Commercial Building","Hotel",null,79.563560980154662,"Top Quartile",78.201273176185595,"Top Quartile",88.62695238982576,"Top Quartile",1972,"GoldPlus",2020,"Existing Building for Non-Residential buildings (version 3)",21466,19767,0.92085157924159133,151,"Water Cooled Chilled Water Plant",7,0.6,"2019-09-11"]
["MOMENTUS HOTEL ALEXANDRA","323 ALEXANDRA ROAD SINGAPORE 159972, SINGAPORE 159972","Commercial Building","Hotel",null,99.796771247606429,"Top Quartile",86.64202091618796,"Top Quartile",73.028727353071147,"Top Quartile",2014,null,null,null,13578,12000,0.88378258948298716,442,"Water Cooled Chilled Water Plant",8,"",""]
["CHANGI COVE HOTEL","351 CRANWELL ROAD, SINGAPORE 509866","Commercial Building","Hotel",null,36.365433333333335,"Top Quartile",35.092941777777774,"Top Quartile",38.977075111111105,"Top Quartile",2012,"Platinum",2022,"Existing Non-Residental Buildings ENRB: 2017",45000,3100,6.8888888888888888E-2,140,"Others","","",""]
["QUALITY HOTEL MARLOW","201 BALESTIER ROAD, SINGAPORE 329926, SINGAPORE 329926","Commercial Building","Hotel",null,207.50963891081295,"2nd Quartile",171.87321921862667,"Top Quartile",30.728324782951855,"Top Quartile",1997,null,null,null,10136,9977,0.9843133385951065,240,"Air Cooled Chilled Water Plant"]
["YOTEL SINGAPORE ORCHARD ROAD","366 ORCHARD ROAD, SINGAPORE 238904","Commercial Building","Hotel",null,null,null,null,null,null,null,2017,"Gold",2016,"New Building for Non-Residential buildings (version 4.1)",14835,14273,0.96211661611054933,610,"Air Cooled Chilled Water Plant","",0.876,"2022-05-31"]
["JW MARRIOTT SINGAPORE SOUTH BEACH","30 BEACH ROAD, SINGAPORE 189763","Commercial Building","Hotel",null,null,null,null,null,null,null,2015,"Platinum",2021,"New Building for Non-Residential buildings (version 3)",44927,40554,0.90266432212255432,634,"Water Cooled Chilled Water Plant","","",""]
["RC HOTEL (PTE) LTD","80 BREAS BASAH ROAD, SINGAPORE 189560","Commercial Building","Hotel",null,null,null,null,null,null,null,1986,null,null,null,54696,54696,1,769,"District Cooling System (DCS)","",0.79500000000000004,"2022-08-05"]
["RC HOTEL (PTE} LTD","2 STAMFORD ROAD, SINGAPORE 178882","Commercial Building","Hotel",null,null,null,null,null,null,null,1986,null,null,null,82044,82044,1,1261,"District Cooling System (DCS)","",0.79500000000000004,"2022-08-05"]
["THE FULLERTON HOTEL","1 FULLERTON SQUARE, SINGAPORE 049178","Commercial Building","Hotel",null,null,null,null,null,null,null,1999,"Gold",2022,"Existing Non-Residental Buildings ENRB: 2017",50804,49142,0.96728604046925437,396,"Water Cooled Chilled Water Plant",2,0.56999999999999995,"2023-02-23"]
["THE PAN PACIFIC HOTEL SINGAPORE","7 RAFFLES BOULEVARD, SINGAPORE 039595","Commercial Building","Hotel",null,null,null,null,null,null,null,1986,"Gold",2023,"GM:2021 In Operation",83384,60000,0.71956250599635418,790,"District Cooling System (DCS)","","",""]
["THE RITZ-CARLTON, MILENIA SINGAPORE","7 RAFFLES AVENUE, SINGAPORE 039799","Commercial Building","Hotel",null,null,null,null,null,null,null,1996,"Gold",2022,"Existing Non-Residential Buildings (RECERT 2017)",76760,76000,0.99009900990099009,608,"District Cooling System (DCS)","",0.627,"2022-06-01"]
["INTERCONTINENTAL SINGAPORE","80 MIDDLE ROAD, SINGAPORE 188966","Commercial Building","Hotel",null,null,null,null,null,null,null,1995,"Platinum",2021,"Existing Building for Non-Residential buildings (version 2.1)",36836,36836,1,403,"Water Cooled Chilled Water Plant",3,0.55700000000000005,"2023-01-31"]
["CLIFFORD PIER","80 COLLYER QUAY SINGAPORE 049326, SINGAPORE 049326","Commercial Building","Hotel",null,null,null,null,null,null,null,2016,null,null,null,10438,9746,0.93370377466947696,98,"Water Cooled Chilled Water Plant",4,"",""]
["ARANDA COUNTRY CLUB","63 PASIR RIS DRIVE 3, SINGAPORE 519497","Commercial Building","Hotel",null,null,null,null,null,null,null,1995,null,null,null,12050,9500,0.78838174273858919,31,"District Cooling System (DCS)","","",""]
["MANDARIN ORIENTAL, SINGAPORE","5 RAFFLES AVENUE, SINGAPORE 039797","Commercial Building","Hotel",null,null,null,null,null,null,null,1987,"Gold",2022,"Existing Non-Residential Buildings (RECERT 2017)",55585,53119,0.95563551317801565,527,"District Cooling System (DCS)","","",""]
["CONRAD CENTENNIAL SINGAPORE","TWO TEMASEK BOULEVARD, SINGAPORE 038982","Commercial Building","Hotel",null,null,null,null,null,null,null,1996,"Gold",2022,"Existing Non-Residential Buildings (RECERT 2017)",40567,34322,0.84605714003993393,512,"District Cooling System (DCS)","","",""]
["PENINSULA.EXCELSIOR HOTEL","5 COLEMAN STREET, SINGAPORE 179805","Commercial Building","Hotel",null,null,null,null,null,null,null,1985,"Gold",2022,"Existing Non-Residental Buildings ENRB: 2017",42237,42150,0.99794019461609484,591,"Water Cooled Chilled Water Plant",1,0.6,"2022-09-15"]
["ALOFT SINGAPORE NOVENA ( EAST WING )","EAST WING 1 JALAN RAJAH, SINGAPORE 329133","Commercial Building","Hotel",null,null,null,null,null,null,null,2012,null,null,null,12916,12916,1,405,"Others","",0.95,"2023-01-20"]
["QUINCY HOTEL SINGAPORE","22 MOUNT ELIZABETH, SINGAPORE 228517","Commercial Building","Hotel",null,null,null,null,null,null,null,2008,null,null,null,4819,4700,0.97530608009960573,106,"Water Cooled Chilled Water Plant",16,"",""]
["GREAT WORLD SERVICED APARTMENTS","2 KIM SENG WALK, SINGAPORE 239404","Commercial Building","Hotel",null,null,null,null,null,null,null,1997,"Platinum",2016,"Existing Building for Non-Residential buildings (version 3)",41453,33518,0.80857838998383713,0,"Water Cooled Chilled Water Plant",11,"",""]
["THE SOUTH BEACH","32 BEACH ROAD, SINGAPORE 189764, SINGAPORE 189764","Commercial Building","Hotel",null,null,null,null,null,null,null,2013,null,null,null,3006,1572,0.52295409181636732,0,"Others"]
["THE SOUTH BEACH","34 BEACH ROAD, SINGAPORE 189765, SINGAPORE 189765","Commercial Building","Hotel",null,null,null,null,null,null,null,2015,null,null,null,2585,2084,0.80618955512572532,0,"Others"]
["NORTHPOINT CITY (SOUTH WING)","1 NORTHPOINT DRIVE, SINGAPORE 768019","Commercial Building","Retail","Large",856.38521673936759,"Bottom Quartile",873.20133587786256,"Bottom Quartile",887.71316112322791,"Bottom Quartile",2017,"Gold",2023,"GM:2021 In Operation",44016,40499,0.92009723736822968,0,"Water Cooled Chilled Water Plant",6,0.56000000000000005,"2020-10-31"]
["PLQ MALL","10 PAYA LEBAR ROAD PLQ MALL\n PAYA LEBAR QUARTER\n SINGAPORE 409057, SINGAPORE 409057","Commercial Building","Retail","Large","","Bottom Quartile","","Bottom Quartile",850.64653391763409,"Bottom Quartile",2022,"Platinum",2022,"Existing Non-Residential Buildings (RECERT 2017)",39021,27500,0.70474872504548836,0,"Water Cooled Chilled Water Plant",2019,0.56000000000000005,"2022-10-03"]
["HILLION MALL","17 PETIR ROAD B1-67, SINGAPORE 678278","Commercial Building","Retail","Large",680.90791391368407,"Bottom Quartile",732.97153560120489,"Bottom Quartile",761.12625382705141,"Bottom Quartile",2017,null,null,null,20645.79,20000,0.96872049943354066,0,"Water Cooled Chilled Water Plant","","",""]
["SUN PLAZA","30 SEMBAWANG DRIVE, SINGAPORE 757713","Commercial Building","Retail","Large",643.42039899999997,"Bottom Quartile",651.35654599999998,"Bottom Quartile",724.88798899999995,"Bottom Quartile",1998,null,null,null,20000,1999,9.9949999999999997E-2,0,"Water Cooled Chilled Water Plant","","",""]
["THOMSON PLAZA","301 UPPER THOMSON ROAD, SINGAPORE 574408","Commercial Building","Retail","Large",588.74054491026095,"Bottom Quartile",674.38984814793025,"Bottom Quartile",710.04135602585063,"Bottom Quartile",1959,"Gold",2022,"Existing Non-Residental Buildings ENRB: 2017",22080.7,32601,1.4764477575439183,0,"Water Cooled Chilled Water Plant",2008,"",""]
["JUNCTION 8","9 BISHAN PLACE, SINGAPORE 579837","Commercial Building","Retail","Large",636.19796551080969,"Bottom Quartile",668.0889538766595,"Bottom Quartile",650.72448073381452,"Bottom Quartile",1993,"Platinum",2021,"Existing Building for Non-Residential buildings (version 3)",30731.252,37761,1.2287491573724363,0,"Water Cooled Chilled Water Plant",3,0.65200000000000002,"2023-03-07"]
["WATERWAY POINT","83 PUNGGOL CENTRAL, SINGAPORE 828761","Commercial Building","Retail","Large",529.90182344887796,"Bottom Quartile",564.72007381098831,"Bottom Quartile",627.78858707514041,"Bottom Quartile",2015,"GoldPlus",2015,"New Building for Non-Residential buildings (version 4.1)",50399,4448,8.8255719359511098E-2,0,"Water Cooled Chilled Water Plant",7,0.63800000000000001,"2019-12-12"]
["THE CLEMENTI MALL","3155 COMMONWEALTH AVENUE WEST, SINGAPORE 129588","Commercial Building","Retail","Large",549.74849855416323,"Bottom Quartile",622.71014680803739,"Bottom Quartile",575.57153184548088,"Bottom Quartile",2012,"Gold",2021,"Existing Building for Non-Residential buildings (version 3)",26974,16724,0.6200044487284051,0,"Water Cooled Chilled Water Plant",4,0.68,"2021-03-29"]
["BUKIT PANJANG PLAZA","1 JELEBU ROAD, SINGAPORE 677743","Commercial Building","Retail","Large",546.17929819984352,"Bottom Quartile",568.60836811896684,"Bottom Quartile",568.08420297417172,"Bottom Quartile",1997,"GoldPlus",2020,"Existing Building for Non-Residential buildings (version 3)",22998,22825,0.9924776067484129,0,"Water Cooled Chilled Water Plant",8,0.7,"2022-12-15"]
["COMPASS ONE","1 SENGKANG SQUARE, SINGAPORE 545078","Commercial Building","Retail","Large",518.74441495559415,"Bottom Quartile",535.31580927474693,"Bottom Quartile",554.06097382253176,"Bottom Quartile",2017,"GoldPlus",2022,"Existing Non-Residental Buildings ENRB: 2017",38621,38620,0.99997410735092307,0,"Water Cooled Chilled Water Plant",2,0.59,"2019-12-23"]
["NORTHPOINT CITY","930 YISHUN AVENUE 2 SINGAPORE 769098, SINGAPORE 769098","Commercial Building","Retail","Large",532.75742461054733,"Bottom Quartile",551.61566385593824,"Bottom Quartile",551.2897670430184,"Bottom Quartile",1992,"Gold",2023,"GM:2021 In Operation",34985,30318,0.86659997141632128,0,"Water Cooled Chilled Water Plant",14,0.71,"2020-07-24"]
["HOUGANG MALL","90 HOUGANG AVE 10, SINGAPORE 538766","Commercial Building","Retail","Large",542.36018321458312,"Bottom Quartile",568.51411122420654,"Bottom Quartile",549.57296196909408,"Bottom Quartile",1996,"Platinum",2022,"Existing Non-Residental Buildings ENRB: 2017",21614,18372,0.85000462663088738,0,"Water Cooled Chilled Water Plant",10,0.83899999999999997,"2022-05-09"]
["BEDOK MALL","311 NEW UPPER CHANGI ROAD, SINGAPORE 467360","Commercial Building","Retail","Large",520.1561090523054,"Bottom Quartile",536.95657584066169,"Bottom Quartile",542.73304978670353,"Bottom Quartile",2013,"Platinum",2021,"New Building for Non-Residential buildings (version 3)",35352.21,30507,0.86294463627592166,0,"Water Cooled Chilled Water Plant",9,0.6,"2022-08-22"]
["WHITE SANDS","1 PASIR RIS CENTRAL STREET 3, SINGAPORE 518457","Commercial Building","Retail","Large",505.6474399955801,"Bottom Quartile",505.73244022797689,"3rd Quartile",523.79133922831977,"Bottom Quartile",1996,"Gold",2023,"GM:2021 In Operation",22805.82,17658,0.77427604006345752,0,"Water Cooled Chilled Water Plant",8,0.60799999999999998,"2021-06-21"]
["LOT ONE SHOPPERS' MALL","21 CHOA CHU KANG AVE 4, SINGAPORE 689812","Commercial Building","Retail","Large",472.14114426896617,"Bottom Quartile",509.66161224687528,"Bottom Quartile",515.51584148822792,"Bottom Quartile",1996,"Gold",2020,"Existing Building for Non-Residential buildings (version 2.1)",30963,30963,1,0,"Water Cooled Chilled Water Plant",1,0.71,"2021-08-31"]
["TAMPINES MALL","4 TAMPINES CENTRAL 5, SINGAPORE 529510","Commercial Building","Retail","Large",459.84792480054318,"3rd Quartile",491.49732643014767,"3rd Quartile",496.49142760142593,"Bottom Quartile",1995,"Gold",2022,"Existing Non-Residential Buildings (RECERT 2017)",47128,32094,0.68099643524019693,0,"Water Cooled Chilled Water Plant",13,"",""]
["TAMPINES 1","10 TAMPINES CENTRAL 1, SINGAPORE 529536","Commercial Building","Retail","Large",416.06837732436554,"3rd Quartile",441.93389476063976,"3rd Quartile",493.12573334086926,"Bottom Quartile",2009,"GoldPlus",2022,"Existing Building for Non-Residential buildings (version 3)",35386,32000,0.90431243994800203,0,"Water Cooled Chilled Water Plant",13,0.68,"2018-12-01"]
["MUSTAFA CENTRE","145 SYED ALWI ROAD \nSINGAPORE 207704, SINGAPORE 207704","Commercial Building","Retail","Large",730.01497826086961,"Bottom Quartile",467.07152173913045,"3rd Quartile",484.08943478260869,"Bottom Quartile",1995,null,null,null,23000,22800,0.99130434782608701,0,"Water Cooled Chilled Water Plant",2,"",""]
["NEX","23 SERANGOON CENTRAL, SINGAPORE 556083","Commercial Building","Retail","Large",437.22447242439131,"3rd Quartile",468.71770848805454,"3rd Quartile",481.46490065468504,"Bottom Quartile",2010,"GoldPlus",2022,"Existing Non-Residental Buildings ENRB: 2017",87523,74448,0.85061069661688926,0,"Water Cooled Chilled Water Plant",13,0.66290000000000004,"2020-12-21"]
["313@SOMERSET","313 ORCHARD ROAD, SINGAPORE 238895","Commercial Building","Retail","Large",424.65091646634613,"3rd Quartile",458.01844200721155,"3rd Quartile",478.06839693509613,"Bottom Quartile",2009,"Platinum",2022,"Existing Non-Residential Buildings (RECERT 2017)",39936,35852,0.89773637820512819,0,"Water Cooled Chilled Water Plant",9,0.64,"2019-08-27"]
["ORCHARD CENTRAL","181 ORCHARD ROAD, SINGAPORE 238896","Commercial Building","Retail","Large",467.37525482201664,"Bottom Quartile",474.43315169097275,"3rd Quartile",476.19311588521248,"Bottom Quartile",2009,null,null,null,38262,37687,0.98497203491715013,0,"Water Cooled Chilled Water Plant",13,"",""]
["JURONG POINT SHOPPING CENTRE 1","JURONG POINT\n1 JURONG WEST CENTRAL 2\nSINGAPORE 648886, SINGAPORE 648886","Commercial Building","Retail","Large",404.22420196029179,"3rd Quartile",436.42168420882047,"3rd Quartile",473.38728322138223,"Bottom Quartile",1996,"Platinum",2023,"GM:2021 In Operation",55537.65,35252,0.63474057688793095,0,"Water Cooled Chilled Water Plant",2009,"",""]
["AMK HUB","53 ANG MO KIO AVE 3, SINGAPORE 569933","Commercial Building","Retail","Large",439.49315898314291,"3rd Quartile",429.61431286946714,"3rd Quartile",471.85225492448768,"3rd Quartile",2019,"Gold",2023,"GM:2021 In Operation",47873,47399,0.99009880308315756,0,"Water Cooled Chilled Water Plant",3,0.59,"2021-06-30"]
["EASTPOINT MALL","3 SIMEI STREET 6 #06-09, SINGAPORE 528833","Commercial Building","Retail","Large",433.77072413793104,"3rd Quartile",436.48355172413795,"3rd Quartile",464.44396551724139,"3rd Quartile",2014,"Platinum",2022,"Existing Non-Residential Buildings (RECERT 2017)",29000,25040,0.86344827586206896,0,"Water Cooled Chilled Water Plant",9,0.64,"2022-01-20"]
["CAUSEWAY POINT","1 WOODLANDS SQUARE, SINGAPORE 738099","Commercial Building","Retail","Large",442.79067579127457,"3rd Quartile",458.99952095808385,"3rd Quartile",452.81840889649271,"3rd Quartile",1999,"Gold",2023,"GM:2021 In Operation",58450,53733,0.91929854576561165,0,"Water Cooled Chilled Water Plant",10,0.66100000000000003,"2020-10-29"]
["CENTURY SQUARE","2 TAMPINES CENTRAL 5, SINGAPORE 529509","Commercial Building","Retail","Large",403.35259078947365,"3rd Quartile",418.82021809210528,"3rd Quartile",451.34082269736842,"3rd Quartile",1995,"Platinum",2021,"Existing Building for Non-Residential buildings (version 3)",30400,25000,0.82236842105263153,0,"Water Cooled Chilled Water Plant",3,0.59,"2021-01-01"]
["BUGIS+","201 VICTORIA STREET #02-28 BUGIS+, SINGAPORE 188067","Commercial Building","Retail","Large",349.90553851704851,"2nd Quartile",364.1945156052679,"2nd Quartile",445.62695291358472,"3rd Quartile",2009,"Platinum",2020,"Existing Building for Non-Residential buildings (version 2.1)",27715,26329,0.94999097961392742,0,"Water Cooled Chilled Water Plant",12,0.65200000000000002,"2020-02-06"]
["ION ORCHARD","2 ORCHARD TURN, SINGAPORE 238801","Commercial Building","Retail","Large",403.42171509032215,"3rd Quartile",444.34815234562814,"3rd Quartile",443.54993474826568,"3rd Quartile",2009,"Gold",2022,"Existing Non-Residential Buildings (RECERT 2017)",87354,82000,0.93870916042768504,0,"Water Cooled Chilled Water Plant",14,0.72499999999999998,"2017-04-01"]
["SEMBAWANG SHOPPING CENTRE","604 SEMBAWANG ROAD, SINGAPORE 758459","Commercial Building","Retail","Large",409.09881959678262,"3rd Quartile",425.49639611407082,"3rd Quartile",439.23958006894389,"3rd Quartile",2008,"Gold",2016,"Existing Building for Non-Residential buildings (version 2.1)",19146,11950,0.6241512587485637,0,"Water Cooled Chilled Water Plant",15,"",""]
["VIVOCITY","1 HARBOURFRONT WALK, SINGAPORE 098585","Commercial Building","Retail","Large",394.05161113688399,"3rd Quartile",428.30185739105889,"3rd Quartile",438.61620750439778,"3rd Quartile",2006,"Platinum",2022,"Existing Building for Non-Residential buildings (version 3)",142850.37,135860,0.95106508999591677,0,"Water Cooled Chilled Water Plant",2,900,"2022-10-21"]
["TANGLIN MALL","163 TANGLIN MALL, SINGAPORE 247933","Commercial Building","Retail","Large",394.66992838198797,"3rd Quartile",384.11192306282811,"2nd Quartile",435.99161279085422,"3rd Quartile",1994,"GoldPlus",2022,"Existing Non-Residental Buildings ENRB: 2017",24285.79,23861,0.98250870159051851,0,"Water Cooled Chilled Water Plant",12,"",""]
["CHANGI CITY POINT","5 CHANGI BUSINESS PARK CENTRAL 1, SINGAPORE 486038","Commercial Building","Retail","Large",408.59585251027647,"3rd Quartile",412.42079190528057,"3rd Quartile",420.79613884692407,"3rd Quartile",2011,"Gold",2023,"GM:2021 In Operation",28463,23676,0.83181674454555032,0,"Water Cooled Chilled Water Plant",2011,0.61799999999999999,"2020-11-23"]
["I12 KATONG","112 EAST COAST ROAD, I12 KATONG\n#11-248, SINGAPORE 428802","Commercial Building","Retail","Large","","Bottom Quartile",38.533569165008473,"Top Quartile",405.40780455449925,"3rd Quartile",2021,"Platinum",2022,"Existing Non-Residental Buildings ENRB: 2017",27138,27000,0.99491487950475344,0,"Water Cooled Chilled Water Plant",11,0.92,"2019-06-27"]
["WEST MALL","1 BUKIT BATOK CENTRAL LINK, SINGAPORE 658713","Commercial Building","Retail","Large",391.88254306247387,"3rd Quartile",397.4416897980912,"3rd Quartile",397.84056428001065,"3rd Quartile",1999,"GoldPlus",2022,"GM:2021 In Operation",26299,17007,0.64667858093463626,0,"Water Cooled Chilled Water Plant",1999,"",""]
["CUSTOMS HOUSE","70 COLLYER QUAY SINGAPORE 049323, SINGAPORE 049323","Commercial Building","Retail","Large",522.24207382854638,"Bottom Quartile",379.98108944792756,"2nd Quartile",395.24320361481574,"3rd Quartile",2010,null,null,null,954,911,0.95492662473794554,0,"Water Cooled Chilled Water Plant",0,"",""]
["KINEX","11 TANJONG KATONG ROAD, SINGAPORE 437157","Commercial Building","Retail","Large",360.78557605916097,"2nd Quartile",365.50120948234155,"2nd Quartile",384.37880986937591,"3rd Quartile",2014,"Gold",2021,"New Building for Non-Residential buildings (version 4)",28938,28938,1,0,"Water Cooled Chilled Water Plant",8,-1.35,"2019-03-18"]
["CATHAY CINELEISURE ORCHARD","8 GRANGE ROAD, SINGAPORE 239695","Commercial Building","Retail","Large",380.05379084536179,"2nd Quartile",416.99688768687372,"3rd Quartile",376.39127592844676,"3rd Quartile",1996,null,null,null,16675.7,26200,1.5711484375468496,0,"Water Cooled Chilled Water Plant",8,"",""]
["CONNEXION","1 FARRER PARK STATION ROAD, SINGAPORE 217562","Commercial Building","Retail","Large",374.96145214069111,"2nd Quartile",363.82248282478713,"2nd Quartile",374.51648135140226,"3rd Quartile",2014,"Platinum",2020,"New Building for Non-Residential buildings (version 3)",58369,49572,0.84928643629323786,235,"Water Cooled Chilled Water Plant",8,"",""]
["CITY SQUARE MALL","180 KITCHENER ROAD #B2-29 CITY SQUARE MALL\nB, SINGAPORE 208539","Commercial Building","Retail","Large",342.28062157221206,"2nd Quartile",351.86881170018285,"2nd Quartile",371.54138939670935,"3rd Quartile",2009,"Platinum",2021,"Existing Building for Non-Residential buildings (version 3)",65640,40727,0.62046008531383301,0,"Water Cooled Chilled Water Plant",14,0.58199999999999996,"2021-11-02"]
["WEST COAST PLAZA","154 WEST COAST ROAD, SINGAPORE 127371","Commercial Building","Retail","Large",390.29871967625706,"3rd Quartile",367.57863400913351,"2nd Quartile",371.26960086864455,"3rd Quartile",2008,null,null,null,20712.73,17617,0.85053974053637549,0,"Water Cooled Chilled Water Plant",14,"",""]
["PLAZA SINGAPURA","68 ORCHARD ROAD, SINGAPORE 238839","Commercial Building","Retail","Large",331.66838102548792,"2nd Quartile",346.45278235034903,"2nd Quartile",368.53428191678393,"3rd Quartile",1998,"Gold",2022,"Existing Non-Residential Buildings (RECERT 2017)",70347,46162,0.65620424467283611,0,"Water Cooled Chilled Water Plant",17,0.67300000000000004,"2022-10-31"]
["THE STAR","1 VISTA EXCHANGE GREEN, SINGAPORE 138617","Commercial Building","Retail","Large",308.63545161290324,"2nd Quartile",329.59983870967744,"2nd Quartile",367.44566129032256,"3rd Quartile",2012,"Gold",2023,"GM:2021 In Operation",62000,48097,0.77575806451612905,0,"Water Cooled Chilled Water Plant",12,"",""]
["TIONG BAHRU PLAZA","302 TIONG BAHRU ROAD, SINGAPORE 168732","Commercial Building","Retail","Large",348.83202201766392,"2nd Quartile",355.07095098892898,"2nd Quartile",354.53933947008335,"2nd Quartile",1996,"Platinum",2021,"Existing Building for Non-Residential buildings (version 3)",29450,26202,0.8897113752122241,0,"Water Cooled Chilled Water Plant",6,0.57899999999999996,"2021-11-11"]
["JEM","52 JURONG GATEWAY ROAD, SINGAPORE 608549","Commercial Building","Retail","Large",312.17482365557601,"2nd Quartile",332.25913154415775,"2nd Quartile",349.12188334920359,"2nd Quartile",2013,"Platinum",2022,"Existing Non-Residential Buildings (RECERT 2017)",108169,94786,0.87627693701522613,0,"Water Cooled Chilled Water Plant",9,0.55000000000000004,"2019-08-27"]
["BUKIT TIMAH PLAZA","1 JALAN ANAK BUKIT, SINGAPORE 588996","Commercial Building","Retail","Large",339.11801878007134,"2nd Quartile",341.45705339127721,"2nd Quartile",342.8671449635263,"2nd Quartile",1980,"Gold",2022,"Existing Non-Residential Buildings (RECERT 2017)",25772,23879,0.92654819183610115,0,"Water Cooled Chilled Water Plant",5,0.68,"2016-01-22"]
["LEISURE PARK KALLANG","5 STADIUM WALK, SINGAPORE 397693","Commercial Building","Retail","Large",358.97795491771308,"2nd Quartile",354.97631619998435,"2nd Quartile",340.9273718898682,"2nd Quartile",2009,null,null,null,25642,25642,1,0,"Water Cooled Chilled Water Plant",13,"",""]
["WISMA ATRIA","435 ORCHARD ROAD SINGAPORE 238877, SINGAPORE 238877","Commercial Building","Retail","Large",301.03409274140205,"2nd Quartile",311.9121295957483,"2nd Quartile",340.43878167895792,"2nd Quartile",1986,null,null,null,40063.660000000003,38000,0.94849047740520953,0,"Water Cooled Chilled Water Plant",17,0.82,"2012-12-15"]
["THE PARAGON","290 ORCHARD ROAD, SINGAPORE 238859","Commercial Building","Retail","Large",321.01136231208483,"2nd Quartile",340.81127967708784,"2nd Quartile",329.87432594209196,"2nd Quartile",2005,"Certified",2021,"Existing Building for Non-Residential buildings (version 3)",94391,79687,0.84422243646110329,0,"Water Cooled Chilled Water Plant",7,0.68,"2018-04-11"]
["THE GALEN","61 SCIENCE PARK ROAD, SINGAPORE 117525","Commercial Building","Retail","Large",215.23601968324317,"2nd Quartile",283.09750374763735,"2nd Quartile",329.57924134784594,"2nd Quartile",2002,"Platinum",2022,"Existing Non-Residential Buildings (RECERT 2017)",30686,27046,0.88137913054813266,0,"Water Cooled Chilled Water Plant",2009,0.44,"2022-12-06"]
["RESORTS WORLD SENTOSA","8 SENTOSA GATEWAY, SINGAPORE 098269","Commercial Building","Retail","Large",333.65013411078718,null,338.560193877551,null,328.87674052478133,null,2010,"Platinum",2020,"New Building for Non-Residential buildings (version 3)",343000,230000,0.67055393586005829,1612,"District Cooling System (DCS)","","",""]
["CG @ CLARKE QUAY","3A RIVER VALLEY ROAD, SINGAPORE 179020","Commercial Building","Retail","Large",529.65504433613251,"Bottom Quartile",330.26092254389573,"2nd Quartile",314.02900933701335,"2nd Quartile",2005,"Certified",2019,"Existing Non-Residental Buildings ENRB: 2017",34058,24671,0.72438193669622408,0,"Water Cooled Chilled Water Plant",2005,0.64800000000000002,"2022-06-07"]
["FAR EAST PLAZA","14 SCOTTS ROAD, SINGAPORE 228213","Commercial Building","Retail","Large",292.08533951753412,"2nd Quartile",275.6541066038431,"2nd Quartile",300.63401752190236,"2nd Quartile",1982,"GoldPlus",2014,"Existing Building for Non-Residential buildings (version 3)",40749,38547,0.94596186409482441,0,"Water Cooled Chilled Water Plant",8,0.62,"2023-01-15"]
["MARINA SQUARE SHOPPING MALL (EXCLUDING MANDARIN ORIENTAL, PARKROYAL COLLECTION AND PAN PACIFIC SINGAPORE)","6 RAFFLES BOULEVARD, SINGAPORE 039594","Commercial Building","Retail","Large",255.52121624883617,"2nd Quartile",269.42127410523733,"2nd Quartile",297.74319708342432,"2nd Quartile",1986,"Gold",2022,"GM:2021 In Operation",122022,103485,0.84808477159856421,0,"Water Cooled Chilled Water Plant",15,0.64500000000000002,"2022-10-09"]
["LUCKY PLAZA","304 ORCHARD ROAD #06-50, SINGAPORE 238863","Commercial Building","Retail","Large",286.59232548701317,"2nd Quartile",272.0842188568011,"2nd Quartile",296.80462448735477,"2nd Quartile",1979,"Platinum",2022,"Existing Building for Non-Residential buildings (version 3)",46816,43903,0.93777768284347229,0,"Water Cooled Chilled Water Plant",8,0.56999999999999995,"2016-09-02"]
["FAR EAST SQUARE","92 TELOK AYER STREET, SINGAPORE 048472","Commercial Building","Retail","Large",360.6765755869834,"2nd Quartile",266.56672387752297,"2nd Quartile",293.45061101194563,"2nd Quartile",1998,null,null,null,29132,29179,1.0016133461485652,324,"Water Cooled Chilled Water Plant",4,0.75,"2023-01-01"]
["THE CENTRAL","6 EU TONG SEN STREET, SINGAPORE 059817","Commercial Building","Retail","Large",282.60610181730652,"2nd Quartile",270.45122758454687,"2nd Quartile",288.75424238777231,"2nd Quartile",2008,null,null,null,30768,27690,0.8999609984399376,0,"Water Cooled Chilled Water Plant",13,"",""]
["SIM LIM SQUARE","1 ROCHOR CANAL ROAD, SINGAPORE 188504","Commercial Building","Retail","Large",259.90542849277358,"2nd Quartile",287.21469015829319,"2nd Quartile",276.59927763248453,"2nd Quartile",1987,"Gold",2022,"GM:2021 In Operation",36325,28453,0.78328974535443907,0,"Water Cooled Chilled Water Plant",8,0.64,"2022-06-01"]
["MILLENIA WALK","9 RAFFLES BOULEVARD SINGAPORE 039596, SINGAPORE 039596","Commercial Building","Retail","Large",241.57569153449799,null,262.26515711523825,null,275.57195064342017,null,1996,"Gold",2022,"Existing Non-Residential Buildings (RECERT 2017)",38276,28985,0.75726303688995711,0,"District Cooling System (DCS)","",0.67,"2013-03-20"]
["THE CENTREPOINT","176 ORCHARD ROAD, SINGAPORE 238843","Commercial Building","Retail","Large",240.19704427319988,"2nd Quartile",271.20217076805636,"2nd Quartile",261.21072152956998,"2nd Quartile",1983,"GoldPlus",2022,"Existing Non-Residental Buildings ENRB: 2017",55022,43000,0.78150557958634725,0,"Water Cooled Chilled Water Plant",16,"",""]
["SUNTEC CITY MALL","3 TEMASEK BOULEVARD, SINGAPORE 038983","Commercial Building","Retail","Large",222.40847037185185,"2nd Quartile",216.24076793489922,"2nd Quartile",232.20557225812436,"2nd Quartile",1995,"Gold",2022,"GM:2021 In Operation",142032,138405,0.97446350118283209,0,"Water Cooled Chilled Water Plant",9,0.61,"2022-04-08"]
["PEOPLE'S PARK COMPLEX","1 PARK ROAD, SINGAPORE 059108, SINGAPORE 059108","Commercial Building","Retail","Large",214.07487505567931,"2nd Quartile",225.51983674832965,"2nd Quartile",224.38559643652559,"2nd Quartile",1968,null,null,null,44900,20276,0.45158129175946549,0,"Water Cooled Chilled Water Plant",1]
["BUGIS JUNCTION","230 VICTORIA STREET, SINGAPORE 188024","Commercial Building","Retail","Large",220.48799156978092,"2nd Quartile",225.7675089165779,"2nd Quartile",223.28352401686044,"2nd Quartile",1994,"Platinum",2021,"Existing Building for Non-Residential buildings (version 3)",82269,62958,0.76527002880793493,0,"Water Cooled Chilled Water Plant",7,0.59699999999999998,"2022-03-22"]
["ESPLANADE MALL","8 RAFFLES AVENUE, SINGAPORE 039802, SINGAPORE 039802","Commercial Building","Retail","Large",228.82981029047511,"2nd Quartile",196.7271166403963,"2nd Quartile",221.72100878180589,"2nd Quartile",2002,null,null,null,11035,9985,0.90484821024014495,0,"Water Cooled Chilled Water Plant",3,0.57999999999999996,"2018-10-31"]
["BUKIT TIMAH SHOPPING CENTRE","170 UPPER BUKIT TIMAH ROAD, SINGAPORE 588179","Commercial Building","Retail","Large",221.25465853852506,"2nd Quartile",210.75883266616381,"2nd Quartile",219.54111588024205,"2nd Quartile",1991,"Gold",2014,"Existing Building for Non-Residential buildings (version 3)",16597.48,49998,3.012385012664573,0,"Water Cooled Chilled Water Plant",1991,0.65,"2023-04-05"]
["HAVELOCK 2","2 HAVELOCK ROAD, SINGAPORE 059763","Commercial Building","Retail","Large",186.64757135703556,"Top Quartile",196.22864296444666,"2nd Quartile",216.93720580871306,"2nd Quartile",2016,null,null,null,19970,16646,0.83355032548823238,0,"Others","","",""]
["SUB MC 1 OF MCST NO. 4622","26 BEACH ROAD, SINGAPORE 189768","Commercial Building","Retail","Large",180.1741315705483,"Top Quartile",193.50629559236651,"Top Quartile",212.94531802434719,"2nd Quartile",2015,"Platinum",2012,"New Building for Non-Residential buildings (version 3)",11892.97,29991,2.5217418357231205,0,"Water Cooled Chilled Water Plant",7,0.84,"2023-06-30"]
["KATONG SHOPPING CENTRE","865 MOUNTBATTEN ROAD, SINGAPORE 437844","Commercial Building","Retail","Large",183.79834330039864,"Top Quartile",192.34934910729763,"Top Quartile",200.34215808632345,"2nd Quartile",1981,null,null,null,23076,21202,0.91879008493673076,0,"Water Cooled Chilled Water Plant","","",""]
["FU LU SHOU COMPLEX","149 ROCHOR ROAD, SINGAPORE 188425","Commercial Building","Retail","Large",190.03987221591925,"2nd Quartile",193.33151489819079,"Top Quartile",190.79320833582133,"2nd Quartile",1983,"Gold",2020,"Existing Building for Non-Residential buildings (version 3)",16747,14500,0.86582671523257893,0,"Water Cooled Chilled Water Plant",3,0.61,"2022-07-08"]
["JOO CHIAT COMPLEX BLK 1 & 2","1 JOO CHIAT ROAD, SINGAPORE 420001","Commercial Building","Retail","Large",190.24797648636931,"2nd Quartile",191.67915848029352,"Top Quartile",189.25778948198996,"2nd Quartile",1982,"Platinum",2021,"Existing Building for Non-Residential buildings (version 3)",25347,24535,0.96796465064899195,0,"Water Cooled Chilled Water Plant","","",""]
["ORCHARD PLAZA","150 ORCHARD ROAD, SINGAPORE 238841","Commercial Building","Retail","Large",152.56850342573108,"Top Quartile",149.60898661054139,"Top Quartile",188.28017957099996,"Top Quartile",1982,"GoldPlus",2021,"Existing Building for Non-Residential buildings (version 3)",22331,79421,3.5565357574671981,0,"Water Cooled Chilled Water Plant",7,0.53,"2021-03-23"]
["PARKLANE SHOPPING MALL","35 SELEGIE ROAD, SINGAPORE 188307","Commercial Building","Retail","Large",206.02332083067898,"2nd Quartile",174.78867752769295,"Top Quartile",187.4948532485476,"Top Quartile",1981,"Gold",2022,"Existing Non-Residental Buildings ENRB: 2017",21003.54,21000,0.99983145698296572,0,"Water Cooled Chilled Water Plant",3,0.74,"2022-02-01"]
["THE GRANDSTAND SHOPPING MALL","200 TURF CLUB ROAD, SINGAPORE 287994","Commercial Building","Retail","Large",160.70071813333334,"Top Quartile",192.11924440000001,"Top Quartile",186.85195253333333,"Top Quartile",2012,null,null,null,75000,20000,0.26666666666666666,0,"Others","","",""]
["HOUGANG GREEN SHOPPING MALL","21 HOUGANG GREEN MCST2463, SINGAPORE 538719","Commercial Building","Retail","Large",169.06902809359005,"Top Quartile",172.19353808150063,"Top Quartile",178.90607174187241,"Top Quartile",2008,null,null,null,22912.7,0,0,0,"Others","","",""]
["TANJONG KATONG COMPLEX","845 GEYLANG ROAD, SINGAPORE 400845","Commercial Building","Retail","Large",144.89773472745611,"Top Quartile",167.59115280505279,"Top Quartile",163.15972612918634,"Top Quartile",1983,null,null,null,18841,13352,0.70866726819170955,0,"Water Cooled Chilled Water Plant",19,"",""]
["CATHAY BUILDING 2002 PTE LTD","2 HANDY ROAD UNIT #04-01, SINGAPORE 229233, SINGAPORE 229233","Commercial Building","Retail","Large",166.31268740629687,"Top Quartile",153.28149925037485,"Top Quartile",155.26020816514819,"Top Quartile",2002,null,null,null,34684,25164,0.72552185445738671,0,"Water Cooled Chilled Water Plant",21,0.89,"2012-11-11"]
["CITY PLAZA","810 GEYLANG ROAD\n#07-00 CITY PLAZA, SINGAPORE 409286","Commercial Building","Retail","Large",141.81612622480097,"Top Quartile",153.09776531186176,"Top Quartile",154.10118794588675,"Top Quartile",1983,null,null,null,33781,24602,0.7282792102069211,0,"Water Cooled Chilled Water Plant",16,"",""]
["PENINSULA SHOPPING COMPLEX","3 COLEMAN STREET, SINGAPORE 179804","Commercial Building","Retail","Large",169.7738951580011,"Top Quartile",158.85193349777617,"Top Quartile",150.27471594771495,"Top Quartile",1990,"GoldPlus",2023,"GM:2021 In Operation",9250,8953,0.96789189189189184,0,"Water Cooled Chilled Water Plant",3,0.62,"2023-03-31"]
["ROXY SQUARE","50 EAST COAST ROAD, SINGAPORE 428769","Commercial Building","Retail","Large",126.64284695045995,"Top Quartile",129.82727925910078,"Top Quartile",130.1908598104969,"Top Quartile",1990,"Gold",2021,"Existing Building for Non-Residential buildings (version 3)",79471,39210,0.49338752500912281,576,"Water Cooled Chilled Water Plant",1.5,"",""]
["268 ORCHARD ROAD","268 ORCHARD ROAD, SINGAPORE 238856","Commercial Building","Retail","Large",111.50924341523775,"Top Quartile",143.21436096871133,"Top Quartile",129.86225561251547,"Top Quartile",2014,null,null,null,16971,16167,0.95262506628955279,0,"Water Cooled Chilled Water Plant",8,0.79,"2017-05-05"]
["BRAS BASAH COMPLEX","231 BAIN STREET, SINGAPORE 180231","Commercial Building","Retail","Large",122.15765643204713,"Top Quartile",129.89587793845521,"Top Quartile",129.00093208142005,"Top Quartile",1980,"Gold",2022,"GM:2021 In Operation",29182,0,0,0,"Others","","",""]
["TEXTILE CENTRE","200 JALAN SULTAN, SINGAPORE 199018","Commercial Building","Retail","Large",124.12184253759639,"Top Quartile",120.21771473103333,"Top Quartile",121.07360946122415,"Top Quartile",1983,null,null,null,47478,22804,0.48030666835165758,0,"Water Cooled Chilled Water Plant",6,"",""]
["SINGAPORE EXPO","1 EXPO DRIVE, #02-01, SINGAPORE 486150","Commercial Building","Retail","Large",109.1991364635241,"Top Quartile",70.282100962580088,"Top Quartile",118.48220464885945,"Top Quartile",1999,"Platinum",2022,"GM:2021 In Operation",161545,119109,0.73731158500727356,0,"Water Cooled Chilled Water Plant",5,0.6,"2023-02-01"]
["THE BENCOOLEN MCST 2576","180 BENCOOLEN STREET, SINGAPORE 189646","Commercial Building","Retail","Large",114.90452177998523,"Top Quartile",117.85875461440367,"Top Quartile",117.52576750117457,"Top Quartile",1999,null,null,null,29798,7800,0.26176253439828179,0,"Others","","",""]
["BEAUTY WORLD CENTRE","144 UPPER BUKIT TIMAH ROAD, SINGAPORE 588177","Commercial Building","Retail","Large",109.71788168896323,"Top Quartile",115.52963001672242,"Top Quartile",115.03502675585284,"Top Quartile",1984,"GoldPlus",2018,"Existing Building for Non-Residential buildings (version 3)",47840,3827,7.9995819397993315E-2,0,"Water Cooled Chilled Water Plant",5,0.56100000000000005,"2022-08-11"]
["OG ORCHARD POINT","160 ORCHARD ROAD, SINGAPORE 238842","Commercial Building","Retail","Large",110.55892167522778,"Top Quartile",115.79929511454388,"Top Quartile",114.80158224288553,"Top Quartile",1990,null,null,null,26671,24094,0.90337820104233058,88,"Water Cooled Chilled Water Plant",19,"",""]
["BUGIS VILLAGE AND BUGIS STREET","62 TO 67 QUEEN STREET/151 TO 166 ROCHOR ROAD/229 TO 253 VICTORIA STREET (ODD NO. ONLY)\n52 QUEEN STREET / 1 TO 5 AND 7 NEW BUGIS STREET, SINGAPORE 188546","Commercial Building","Retail","Large",70.680261356814086,"Top Quartile",107.06485011006602,"Top Quartile",98.310601961176715,"Top Quartile",1991,null,null,null,24985,21237,0.84998999399639785,0,"Others","","",""]
["CHIJMES","30 VICTORIA STREET, SINGAPORE 187996","Commercial Building","Retail","Large",53.496766621677132,"Top Quartile",56.849534316396593,"Top Quartile",63.483263054649711,"Top Quartile",2014,null,null,null,119287,6882,5.7692791335183215E-2,0,"Air Cooled Chilled Water Plant","","",""]
["DEPOT HEIGHTS SHOPPING CENTRE","108 DEPOT RD, SINGAPORE 100108","Commercial Building","Retail","Large",37.179162159560953,"Top Quartile",36.251923845431214,"Top Quartile",39.585985115566729,"Top Quartile",2004,"Gold",2021,"Existing Building for Non-Residential buildings (version 2.1)",38235.919999999998,0,0,0,"Others","","",""]
["CHANGI EXHIBITION CENTRE","9, AVIATION PARK ROAD, SINGAPORE 498760","Commercial Building","Retail","Large",30.768456337051379,"Top Quartile",6.9794794736943491,"Top Quartile",13.224134543142807,"Top Quartile",2007,null,null,null,51909,51909,1,0,"Water Cooled Chilled Water Plant",15,"",""]
["VIIO@BALESTIER","520 BALESTIER ROAD, SINGAPORE 329853","Commercial Building","Retail","Large",1.1060492104535622,"Top Quartile",1.2323720707095347,"Top Quartile",1.3018074514969671,"Top Quartile",2018,null,null,null,614910,202973,0.33008570359890066,0,"Others","","",""]
["THE SELETAR MALL","33 SENGKANG WEST AVENUE, SINGAPORE 797653","Commercial Building","Retail","Medium",1368.3704660396209,"Bottom Quartile",1475.6650498755052,"Bottom Quartile",1414.9932360497839,"Bottom Quartile",2014,"Gold",2023,"GM:2021 In Operation",11590.86,11591,1.0000120784825284,0,"Water Cooled Chilled Water Plant",8,0.63,"2023-01-01"]
["RIVERVALE MALL","11 RIVERVALE CRESCENT\n02-21, SINGAPORE 545082","Commercial Building","Retail","Medium",753.13068299346287,"Bottom Quartile",803.26235144892178,"Bottom Quartile",820.68887110937658,"Bottom Quartile",2000,"GoldPlus",2020,"Existing Non-Residental Buildings ENRB: 2017",10249,7541,0.73577910040003902,0,"Water Cooled Chilled Water Plant","","",""]
["MYVILLAGE AT SERANGOON GARDEN","1 MAJU AVENUE, SINGAPORE 556679, SINGAPORE 556679","Commercial Building","Retail","Medium",735.40950489457828,"Bottom Quartile",741.57609186746993,"Bottom Quartile",723.44072289156634,"Bottom Quartile",2010,null,null,null,5312,2433,0.45801957831325302,0,"Others","","",""]
["YEW TEE SQUARE","623 CHOA CHU KANG STREET 62, SINGAPORE 680623, SINGAPORE 680623","Commercial Building","Retail","Medium",136.2666177769924,"Top Quartile",693.67779289627151,"Bottom Quartile",692.58762325499208,"Bottom Quartile",1996,null,null,null,5659,2115,0.37374094362961652,0,"Others"]
["TAMPINES MART","5 TAMPINES STREET 32, SINGAPORE 529284","Commercial Building","Retail","Medium",512.27944242424246,"Bottom Quartile",662.76753838383843,"Bottom Quartile",675.29959090909097,"Bottom Quartile",1996,null,null,null,9900,99,0.01,0,"Others","","",""]
["HOLLAND PIAZZA","3 LORONG LIPUT, SINGAPORE 277725","Commercial Building","Retail","Medium",577.85401283316878,"Bottom Quartile",697.08098716683128,"Bottom Quartile",660.08662882527153,"Bottom Quartile",2018,null,null,null,2026,1600,0.7897334649555775,0,"Others","","",""]
["HEARTLAND MALL KOVAN","205 HOUGANG STREET 21, SINGAPORE 530205","Commercial Building","Retail","Medium",608.69518768637079,"Bottom Quartile",660.31351692685496,"Bottom Quartile",649.23231187510964,"Bottom Quartile",1984,null,null,null,11402,11302,0.99122960884055433,0,"Others","","",""]
["YEWTEE POINT","21 CHOA CHU KANG NORTH 6, SINGAPORE 689578","Commercial Building","Retail","Medium",599.42878676470593,"Bottom Quartile",594.62014705882359,"Bottom Quartile",593.12832720588233,"Bottom Quartile",2008,"Certified",2020,"Existing Building for Non-Residential buildings (version 3)",10880,7490,0.68841911764705888,0,"Water Cooled Chilled Water Plant",12,"",""]
["YISHUN 10 CINEMA COMPLEX","51 YISHUN CENTRAL 1, SINGAPORE 768794","Commercial Building","Retail","Medium",433.6282274847506,"3rd Quartile",533.00991747398643,"Bottom Quartile",553.22312881234302,"Bottom Quartile",1992,null,null,null,5574,5017,0.90007176175098669,0,"Others","","",""]
["FARRER SQUARE","10 FARRER PARK STATION ROAD, SINGAPORE 217564","Commercial Building","Retail","Medium",441.84723345269725,"Bottom Quartile",479.35318239574912,"3rd Quartile",543.46245812637176,"Bottom Quartile",2017,"GoldPlus",2022,"Existing Non-Residential Buildings (RECERT 2017)",8657,6047,0.69850987640060069,300,"Water Cooled Chilled Water Plant","","",""]
["QUAYSIDE ISLE","31 OCEAN WAY, SINGAPORE 098375, SINGAPORE 098375","Commercial Building","Retail","Medium",434.12614417873976,"Bottom Quartile",493.9200610926863,"3rd Quartile",539.91543026706233,"Bottom Quartile",2012,null,null,null,5729,3836,0.66957584220631872,0,"Others"]
["RAFFLES HOLLAND V","118 HOLLAND AVENUE, SINGAPORE 278997","Commercial Building","Retail","Medium",463.57152387289972,"Bottom Quartile",448.18296123773081,"3rd Quartile",514.45595075694564,"Bottom Quartile",2018,null,null,null,6011,4900,0.81517218432873062,0,"Water Cooled Chilled Water Plant",7,0.72699999999999998,"2023-06-30"]
["JUNCTION 10","1 WOODLANDS RD, SINGAPORE 677899","Commercial Building","Retail","Medium",446.7995365355589,"Bottom Quartile",467.86461511142682,"3rd Quartile",510.87151291840536,"Bottom Quartile",2014,null,null,null,11263,11259,0.99964485483441357,0,"Others","","",""]
["ANCHORPOINT SHOPPING CENTRE","370 ALEXANDRA ROAD, SINGAPORE 159953","Commercial Building","Retail","Medium",489.05947820620275,"Bottom Quartile",491.62694991617775,"3rd Quartile",503.03119132439235,"Bottom Quartile",1997,null,null,null,9544,8924,0.93503772003352892,0,"Water Cooled Chilled Water Plant","","",""]
["KAP","KING ALBERT PARK, SINGAPORE 598332","Commercial Building","Retail","Medium",419.84715989159889,"3rd Quartile",475.72986991869914,"3rd Quartile",483.41340921409216,"Bottom Quartile",2016,null,null,null,5535,3000,0.54200542005420049,0,"Others","","",""]
["CANBERRA PLAZA","133 CANBERRA VIEW, SINGAPORE 750133","Commercial Building","Retail","Medium",19.204727272727272,"Top Quartile",447.13630818181821,"3rd Quartile",480.45750636363641,"Bottom Quartile",2019,null,null,null,11000,9800,0.89090909090909087,0,"Water Cooled Chilled Water Plant",3,0.5,"2023-08-01"]
["ALEXANDRA CENTRAL","321 ALEXANDRA ROAD\n#02-47, SINGAPORE 159971","Commercial Building","Retail","Medium",516.42230263916099,"Bottom Quartile",477.78713841189341,"3rd Quartile",478.49308401521267,"3rd Quartile",2014,null,null,null,8677,1758,0.20260458683876917,0,"Water Cooled Chilled Water Plant",8,0.63,"2022-10-21"]
["VISTA POINT","BLOCK 548 WOODLANDS DRIVE 44, SINGAPORE 730548","Commercial Building","Retail","Medium",459.86852309058617,"Bottom Quartile",456.20925399644761,"3rd Quartile",475.62365452930726,"3rd Quartile",1999,"Gold",2011,"Existing Building (version 2)",11260,3000,0.26642984014209592,0,"Others","","",""]
["DAWSON PLACE","57 DAWSON ROAD, SINGAPORE 142057","Commercial Building","Retail","Medium",439.09726834751888,"Bottom Quartile",428.25365665649593,"3rd Quartile",434.5128745784487,"3rd Quartile",2001,"Gold",2022,"Existing Non-Residental Buildings ENRB: 2017",6227,6227,1,0,"Others","",0.88,"2023-02-20"]
["SCOTTS SQUARE RETAIL","6 SCOTTS ROAD, SINGAPORE 228209","Commercial Building","Retail","Medium",430.71871397509136,"3rd Quartile",433.69281689187119,"3rd Quartile",423.62194838092114,"3rd Quartile",2010,null,null,null,12153.916999999999,11588,0.95343748027899156,0,"Water Cooled Chilled Water Plant","","",""]
["GRID","1 SELEGIE ROAD\n#05-03, SINGAPORE 188306","Commercial Building","Retail","Medium","","Bottom Quartile","","Bottom Quartile",416.20269311113202,"3rd Quartile",2024,"Certified",2022,"Existing Non-Residental Buildings ENRB: 2017",9904.5299999999988,18357,1.8533943559159296,0,"Water Cooled Chilled Water Plant","","",""]
["SEMBAWANG MART","BLOCK 511 CANBERRA ROAD, SINGAPORE 750511","Commercial Building","Retail","Medium",405.70082507015894,"3rd Quartile",397.02455940130966,"3rd Quartile",411.93669597754916,"3rd Quartile",2010,"GoldPlus",2022,"Existing Building for Non-Residential buildings (version 3)",5345,0,0,0,"Others","",5,"2022-10-01"]
["ORCHARD SHOPPING CENTRE","321 ORCHARD ROAD, SINGAPORE 238866","Commercial Building","Retail","Medium",324.97206728425164,"3rd Quartile",389.06113846903952,"3rd Quartile",383.91498049731837,"3rd Quartile",2008,null,null,null,4102,4012,0.97805948317893709,0,"Water Cooled Chilled Water Plant",1,"",""]
["TAMAN JURONG SHOPPING CENTRE","399 YUNG SHENG ROAD, SINGAPORE 610399","Commercial Building","Retail","Medium",381.69998561759712,"3rd Quartile",387.4017614213198,"3rd Quartile",375.29742216582065,"3rd Quartile",1996,"Gold",2013,"Existing Building for Non-Residential buildings (version 2.1)",11820,7656,0.64771573604060917,0,"Others","","",""]
["HOLLAND ROAD SHOPPING CENTRE","211 HOLLAND AVENUE, SINGAPORE 278967, SINGAPORE 278967","Commercial Building","Retail","Medium",380.2342604349588,"3rd Quartile",349.56582196406868,"3rd Quartile",374.36435228961227,"3rd Quartile",1972,null,null,null,7403,7200,0.97257868431716876,0,"Water-Cooled Package Units"]
["GRANDLINK SQUARE","511 GUILLEMARD ROAD, SINGAPORE 399849","Commercial Building","Retail","Medium",362.94146781206911,"3rd Quartile",369.88184749178066,"3rd Quartile",373.36525506416376,"3rd Quartile",2001,null,null,null,9429,5600,0.59391239792130657,0,"Others","","",""]
["THE WOODGROVE","30 WOODGROVE AVENUE 1 SINGAPORE 739065, SINGAPORE 739065","Commercial Building","Retail","Medium",347.13597899999996,"3rd Quartile",349.91612099999998,"3rd Quartile",359.30265200000002,"3rd Quartile",2000,null,null,null,10000,6000,0.6,0,"Others","","",""]
["JUBILEE SQUARE","61 ANG MO KIO AVE 8, SINGAPORE 569814","Commercial Building","Retail","Medium",365.78430141287288,"3rd Quartile",362.90958202511774,"3rd Quartile",338.19780612244898,"3rd Quartile",2011,null,null,null,5096,4777,0.93740188383045531,0,"Water-Cooled Package Units",null,"",""]
["JUNCTION NINE","18 YISHUN AVENUE 9 SINGAPORE 768897, SINGAPORE 768897","Commercial Building","Retail","Medium",266.74522729563557,"2nd Quartile",311.30549138191719,"2nd Quartile",333.39637032557204,"3rd Quartile",2016,null,null,null,9921,7374,0.74327184759600851,0,"Water Cooled Chilled Water Plant",7,0,"2023-07-25"]
["321 CLEMENTI","321 CLEMENTI AVE 3, SINGAPORE 129905","Commercial Building","Retail","Medium",249.76407059756741,"2nd Quartile",267.75227128503434,"2nd Quartile",330.62065441565306,"2nd Quartile",2015,"Platinum",2015,"New Building for Non-Residential buildings (version 4.1)",7564,6564,0.86779481755684817,0,"Water Cooled Chilled Water Plant",7,119,"2019-09-17"]
["THE ORIENTAL PLAZA","291 NEW BRIDGE ROAD, SINGAPORE 088756","Commercial Building","Retail","Medium",293.9727419893191,"2nd Quartile",305.72114152202943,"2nd Quartile",316.22520527369824,"2nd Quartile",1993,null,null,null,5992,3534,0.58978638184245658,0,"Air Cooled Chilled Water Plant","","",""]
["DJIT SUN MALL","5 ANG MO KIO CENTRAL 2, SINGAPORE 569663, SINGAPORE 569663","Commercial Building","Retail","Medium",343.44797961983147,"3rd Quartile",392.85292181069957,"3rd Quartile",315.85197922790513,"2nd Quartile",2013,null,null,null,5103,4500,0.88183421516754845,0,"Water Cooled Chilled Water Plant",6,0.8,"2015-07-09"]
["ORCHARDGATEWAY@EMERALD","218 ORCHARD ROAD, SINGAPORE 238851","Commercial Building","Retail","Medium",263.60153601150722,"2nd Quartile",288.4306739956848,"2nd Quartile",315.11512380560976,"2nd Quartile",2014,"Gold",2022,"New Building for Non-Residential buildings (version 3)",9733,8363,0.85924175485461829,0,"Air Cooled Chilled Water Plant","","",""]
["QUEENSWAY SHOPPING CENTRE","1 QUEENSWAY, SINGAPORE 149053","Commercial Building","Retail","Medium",298.90591893349762,"3rd Quartile",310.42825306311158,"2nd Quartile",310.13556677198119,"2nd Quartile",1974,null,null,null,12977,7925,0.61069584649764974,0,"Water Cooled Chilled Water Plant",24,"",""]
["BUGIS CUBE","470 NORTH BRIDGE ROAD, SINGAPORE 188735, SINGAPORE 188735","Commercial Building","Retail","Medium",248.72013897866842,"2nd Quartile",246.83280219780221,"2nd Quartile",297.45038461538462,"2nd Quartile",1984,null,null,null,6188,4800,0.77569489334195219,0,"Others"]
["BALESTIER POINT","279 BALESTIER ROAD, SINGAPORE 329727","Commercial Building","Retail","Medium",303.60411114722137,"3rd Quartile",316.38981962950919,"2nd Quartile",291.68561260968477,"2nd Quartile",1988,null,null,null,6154,4315,0.70116997075073129,0,"Air Cooled Chilled Water Plant","","",""]
["HOUGANG1","1. HOUGANG STREET 91, SINGAPORE 538692","Commercial Building","Retail","Medium",889.98511149577428,"Bottom Quartile",796.02719071377658,"Bottom Quartile",285.24186946339478,"2nd Quartile",2012,null,null,null,9821,8500,0.86549231239181346,0,"Air Cooled Chilled Water Plant","","",""]
["THE SUBSIDIARY MANAGEMENT CORPORATION NO. 1 STRATA TITLE PLAN NO. 4440","1187 UPPER SERANGOOON ROAD #01-72, SINGAPORE 533971","Commercial Building","Retail","Medium",228.4735791791162,"2nd Quartile",259.35923572888811,"2nd Quartile",283.07884415788646,"2nd Quartile",2016,null,null,null,6359,87,1.3681396445982073E-2,0,"Others","",2,"2023-03-28"]
["230 STADIUM BOULEVARD","230 STADIUM BOULEVARD, SINGAPORE 397799","Commercial Building","Retail","Medium",244.26050943396226,"2nd Quartile",293.11222641509437,"2nd Quartile",282.57639622641506,"2nd Quartile",2018,null,null,null,5300,5000,0.94339622641509435,0,"Others"]
["SINGAPORE FLYER","30 RAFFLES  AVENUE, SINGAPORE 039803","Commercial Building","Retail","Medium",242.54334615384616,"2nd Quartile",253.80134615384614,"2nd Quartile",281.18407692307693,"2nd Quartile",2009,"Certified",2007,"New Building (version 1)",13000,7508,0.57753846153846156,0,"Water Cooled Chilled Water Plant",14,"",""]
["MIDPOINT ORCHARD","220 ORCHARD ROAD #01-11, SINGAPORE 238852","Commercial Building","Retail","Medium",313.49361519836094,"3rd Quartile",316.08850623952321,"2nd Quartile",275.5082007822686,"2nd Quartile",1984,null,null,null,5369,5321,0.99105978766995717,0,"Others","",1.34,"2016-09-23"]
["BALMORAL PLAZA","271 BUKIT TIMAH, SINGAPORE 259708","Commercial Building","Retail","Medium",188.44021135314603,"Top Quartile",202.36249979755448,"Top Quartile",242.7789116527654,"Top Quartile",1990,null,null,null,12349,7732,0.62612357275892783,0,"Water-Cooled Package Units","","",""]
["CUPPAGE PLAZA","5 KOEK ROAD, SINGAPORE 228796","Commercial Building","Retail","Medium",228.95700775512998,"2nd Quartile",212.68065335254957,"Top Quartile",238.18050923066366,"Top Quartile",1983,null,null,null,14571,8000,0.54903575595360643,0,"Water Cooled Chilled Water Plant",22,0.65,"2013-07-08"]
["KATONG PLAZA","1 BROOKE ROAD, SINGAPORE 429979","Commercial Building","Retail","Medium",215.92111439659951,"Top Quartile",226.81536314914064,"Top Quartile",230.27824801330624,"Top Quartile",1980,null,null,null,5411,3589,0.66327850674551836,0,"Water Cooled Chilled Water Plant",34,"",""]
["BALESTIER PLAZA","400 BALESTIER ROAD, SINGAPORE 329802, SINGAPORE 329802","Commercial Building","Retail","Medium",220.36148066837418,"2nd Quartile",214.70191120868395,"Top Quartile",214.14383705329919,"Top Quartile",1984,null,null,null,8199,3304,0.40297597267959506,0,"Water-Cooled Package Units"]
["RUBIKON","3501 JALAN BUKIT MERAH, SINGAPORE 159460, SINGAPORE 159460","Commercial Building","Retail","Medium",165.16148311013393,"Top Quartile",177.84702778333002,"Top Quartile",203.4838896662003,"Top Quartile",2015,null,null,null,5003,4800,0.95942434539276433,0,"Water-Cooled Package Units","","",""]
["OG BUILDING","100 UPPER CROSS STREET, SINGAPORE 058360","Commercial Building","Retail","Medium",179.59110459040116,"Top Quartile",203.77393681164079,"Top Quartile",199.69065037382427,"Top Quartile",2003,null,null,null,12439,11430,0.9188841546748131,0,"Water Cooled Chilled Water Plant",20,"",""]
["THE FLOW","66 EAST COAST ROAD, SINGAPORE 428778","Commercial Building","Retail","Medium",121.72271206896552,"Top Quartile",160.99870862068968,"Top Quartile",190.88208103448278,"Top Quartile",2017,null,null,null,5800,4000,0.68965517241379315,0,"Others","",107,"2018-05-31"]
["LUCKY CHINATOWN","211 NEW BRIDGE ROAD, SINGAPORE 059432","Commercial Building","Retail","Medium",215.03436600643303,"Top Quartile",179.46097850008465,"Top Quartile",189.25050787201624,"Top Quartile",1992,"Gold",2019,"Existing Building for Non-Residential buildings (version 3)",5907,4726,0.80006771626883355,0,"Water Cooled Chilled Water Plant",5,0.67500000000000004,"2021-06-22"]
["*SCAPE","2 ORCHARD LINK, SINGAPORE 237978","Commercial Building","Retail","Medium",232.35354831323463,"2nd Quartile",215.37942985803696,"Top Quartile",175.97515493817738,"Top Quartile",2010,"Gold",2021,"Existing Building for Non-Residential buildings (version 3)",13102,8608,0.65699893146084565,0,"Others","","",""]
["UPPER SERANGOON SHOPPING CENTRE","756 UPPER SERANGOON ROAD #02-39A, SINGAPORE 534626","Commercial Building","Retail","Medium",130.02997763898526,"Top Quartile",147.78077029840387,"Top Quartile",153.81520703215358,"Top Quartile",1982,"Gold",2017,"Existing Building for Non-Residential buildings (version 3)",12969,12000,0.92528336803145961,0,"Water Cooled Chilled Water Plant",2,0.625,"2018-08-29"]
["DELFI ORCHARD","ORCHARD ROAD, SINGAPORE 238876","Commercial Building","Retail","Medium",151.6948716402481,"Top Quartile",152.32794796691934,"Top Quartile",149.20697880771883,"Top Quartile",1984,null,null,null,11608,11608,1,0,"Water-Cooled Package Units","","",""]
["SINGAPORE DISCOVERY CENTRE","510 UPPER JURONG ROAD, SINGAPORE 638365","Commercial Building","Retail","Medium",162.34619119074941,"Top Quartile",219.4735660693795,"Top Quartile",147.28881366404801,"Top Quartile",1996,"Platinum",2022,"Existing Non-Residental Buildings ENRB: 2017",11329,10551,0.93132668373201521,0,"Water Cooled Chilled Water Plant",1,0.6,"2023-01-09"]
["SINGAPORE SHOPPING CENTRE","190 CLEMENCEAU AVENUE, SINGAPORE 239924","Commercial Building","Retail","Medium",144.91653663261712,"Top Quartile",155.3721239873195,"Top Quartile",140.03907802042974,"Top Quartile",1982,"Gold",2016,"Existing Building for Non-Residential buildings (version 3)",11356,11070,0.97481507573089121,0,"Water Cooled Chilled Water Plant","","",""]
["MING ARCADE","MING ARCADE, 21 CUSCADEN ROAD, SINGAPORE 249720","Commercial Building","Retail","Medium",167.0418902210566,"Top Quartile",137.57496253278379,"Top Quartile",137.92984263769202,"Top Quartile",1983,null,null,null,5338,5000,0.93668040464593483,0,"Air Cooled Chilled Water Plant","","",""]
["THE ROCHESTER","35 ROCHESTER DRIVE, SINGAPORE 138639","Commercial Building","Retail","Medium",103.94673799278986,null,116.3053843470171,null,125.26700779160367,null,2011,"Gold",2009,"New Building for A/C buildings (version 2)",8599,6523,0.75857657867193862,0,"District Cooling System (DCS)","","",""]
["TELOK BLANGAH HOUSE","52 TELOK BLANGAH ROAD, SINGAPORE 098829","Commercial Building","Retail","Medium",102.03392716123939,"Top Quartile",100.88074743345567,"Top Quartile",89.957952803456124,"Top Quartile",1984,null,null,null,4305.3999999999996,2310,0.53653551354113449,0,"Others","","",""]
["OASIS","87 SCIENCE PARK DRIVE, SINGAPRE SCIENCE PARK 1, SINGAPORE 118260","Commercial Building","Retail","Medium",48.755075415953975,"Top Quartile",46.859549059244287,"Top Quartile",40.851811537863476,"Top Quartile",1996,"Certified",2019,"Existing Non-Residental Buildings ENRB: 2017",6431,6100,0.94853055512361995,0,"Water Cooled Chilled Water Plant",7,0.65,"2022-12-07"]
["HIAP HOE BUILDING AT ZHONGSHAN PARK","18 AH HOOD ROAD, SINGAPORE 329983","Commercial Building","Retail",null,null,null,null,null,null,null,2013,null,null,null,14794,10826,0.73178315533324323,13,"Air Cooled Chilled Water Plant","","",""]
["THE FULLERTON WATERBOATHOUSE","3 FULLERTON ROAD SINGAPORE 049215, SINGAPORE 049215","Commercial Building","Retail",null,null,null,null,null,null,null,2003,null,null,null,1763,1263,0.71639251276233695,0,"Air Cooled Chilled Water Plant","","",""]
["OUE LINK","62 COLLYER QUAY, SINGAPORE 049325","Commercial Building","Retail",null,null,null,null,null,null,null,2011,"Gold",2019,"Existing Building for Non-Residential buildings (version 3)",277,276,0.99638989169675085,0,"Water Cooled Chilled Water Plant",11,"",""]
["OUE TOWER","60 COLLYER QUAY, SINGAPORE 049322","Commercial Building","Retail",null,null,null,null,null,null,null,2011,"Gold",2019,"Existing Building for Non-Residential buildings (version 3)",1549,1089,0.70303421562298252,0,"Water Cooled Chilled Water Plant",11,"",""]
["MARINA BAY LINK MALL","8A MARINA BOULEVARD, SINGAPORE 018984","Commercial Building","Retail",null,null,null,null,null,null,null,2009,"Platinum",2020,"Existing Building for Non-Residential buildings (version 3)",7700,7700,1,0,"District Cooling System (DCS)","","",""]
["ESPLANADE MALL","1 ESPLANADE DRIVE, SINGAPORE 038981","Commercial Building","Retail",null,null,null,null,null,null,null,2002,"Platinum",2022,"Existing Non-Residental Buildings ENRB: 2017",11135.43,9985,0.89668742024331338,0,"Water Cooled Chilled Water Plant",6,"",""]
["MANDARIN GALLERY","333A ORCHARD RD, SINGAPORE 238897","Commercial Building","Retail",null,null,null,null,null,null,null,2011,"Gold",2020,"Existing Building for Non-Residential buildings (version 2.1)",18250,15000,0.82191780821917804,0,"Water Cooled Chilled Water Plant",13,"",""]
["BUGIS JUNCTION","200 VICTORIA STREET, SINGAPORE 188021","Commercial Building","Retail",null,null,null,null,null,null,null,1994,"Platinum",2021,"Existing Building for Non-Residential buildings (version 3)",53607,43000,0.80213404965769397,0,"Water Cooled Chilled Water Plant",10,0.63700000000000001,"2021-07-19"]
["WESTGATE","3 GATEWAY DRIVE, SINGAPORE 608532","Commercial Building","Retail",null,null,null,null,null,null,null,2013,"Platinum",2022,"New Building for Non-Residential buildings (version 4.1)",55178,35580,0.64482221175106025,0,"Water Cooled Chilled Water Plant",9,0.54,"2016-09-14"]
["MARINA BAY SANDS","2 BAYFRONT AVENUE, SINGAPORE 018972","Commercial Building","Retail",null,null,null,null,null,null,null,2010,"Platinum",2021,"Existing Building for Non-Residential buildings (version 3)",28373,28373,1,0,"District Cooling System (DCS)","","",""]
["MARINA BAY SANDS","8 BAYFRONT AVENUE, SINGAPORE 018955","Commercial Building","Retail",null,null,null,null,null,null,null,2010,"Platinum",2021,"Existing Building for Non-Residential buildings (version 3)",60996,60996,1,0,"District Cooling System (DCS)","","",""]
["MARINA BAY SANDS","10 BAYFRONT AVENUE, SINGAPORE 018956","Commercial Building","Retail",null,null,null,null,null,null,null,2010,"Platinum",2021,"Existing Building for Non-Residential buildings (version 3)",231462,231462,1,0,"District Cooling System (DCS)","","",""]
["SUNTEC SINGAPORE CONVENTION AND EXHIBITION CENTRE","1 RAFFLES BOULEVARD, SINGAPORE 039593","Commercial Building","Retail",null,null,null,null,null,null,null,1991,"Gold",2022,"GM:2021 In Operation",60281.97,58261,0.96647471872601376,0,"Water-Cooled Package Units","","",""]
["C.K. TANG LIMITED","310 ORCHARD ROAD, SINGAPORE 238864","Commercial Building","Retail",null,null,null,null,null,null,null,1982,"Gold",2021,"Existing Building for Non-Residential buildings (version 3)",17505,16423,0.93818908883176233,0,"Water Cooled Chilled Water Plant",10,0.65,"2011-10-01"]
["36 BEACH ROAD","36 BEACH ROAD, SINGAPORE 189766","Commercial Building","Retail",null,null,null,null,null,null,null,2015,null,null,null,1394,643,0.46126255380200859,0,"Water Cooled Chilled Water Plant",2,0.65]
["TRIO MALL","11 SAM LEONG ROAD, SINGAPORE 207903","Commercial Building","Mixed Development",null,2258.1253627760252,null,2649.7273186119874,null,3370.3713564668769,null,2019,null,null,null,317,60,0.1892744479495268,0,"District Cooling System (DCS)","","",""]
["SQUARE 2 / NOVENA MEDICAL CENTER","10 SINARAN DRIVE, SINGAPORE 307506","Commercial Building","Mixed Development",null,521.5617902894196,"Bottom Quartile",526.80142337498023,"Bottom Quartile",533.02910011070696,"Bottom Quartile",2006,null,null,null,31615,30116,0.95258579788075282,0,"Water Cooled Chilled Water Plant",17,"",""]
["PACIFIC PLAZA","9 SCOTTS ROAD, SINGAPORE 228210","Commercial Building","Mixed Development",null,313.08403547266414,"Bottom Quartile",324.2368038032547,"Bottom Quartile",358.17011885170962,"Bottom Quartile",1997,null,null,null,10938,8185,0.74830864874748582,0,"Air Cooled Chilled Water Plant","","",""]
["FORUM THE SHOPPING MALL","583 ORCHARD ROAD, SINGAPORE 238884","Commercial Building","Mixed Development",null,344.65627663460367,"Bottom Quartile",351.91077154105278,"Bottom Quartile",344.52581273590647,"Bottom Quartile",1985,null,null,null,24639,23238,0.94313892609277972,0,"Water Cooled Chilled Water Plant",13,0.97,"2023-01-31"]
["ORCHARDGATEWAY","277 ORCHARD ROAD, SINGAPORE 238858","Commercial Building","Mixed Development",null,302.62167866898437,"Bottom Quartile",308.80537621057857,"Bottom Quartile",324.17457164142041,"Bottom Quartile",2014,"Platinum",2020,"New Building for Non-Residential buildings (version 3)",48324,48324,1,499,"Water Cooled Chilled Water Plant",9,"",""]
["CHINATOWN POINT","133 NEW BRIDGE ROAD, SINGAPORE 059413","Commercial Building","Mixed Development",null,303.2422529378847,"Bottom Quartile",312.86981122924823,"Bottom Quartile",323.71920686439097,"Bottom Quartile",1990,"Gold",2022,"Existing Non-Residental Buildings ENRB: 2017",53610,53610,1,0,"Water Cooled Chilled Water Plant",7,"",""]
["ROYAL SQUARE AT NOVENA","103 IRRAWADDY ROAD, SINGAPORE 329566","Commercial Building","Mixed Development",null,273.02289754141606,"3rd Quartile",297.71833561957021,"Bottom Quartile",322.79068622278498,"Bottom Quartile",2017,null,null,null,28431,9079,0.31933452921107242,250,"Water Cooled Chilled Water Plant",6,0.66400000000000003,"2022-12-15"]
["RIVERSIDE POINT","30 MERCHANT ROAD, RIVERSIDE POINT, SINGAPORE 058282","Commercial Building","Mixed Development",null,270.23499390615478,"3rd Quartile",274.91301035953688,"Bottom Quartile",306.915676416819,"Bottom Quartile",1996,null,null,null,13128,8981,0.68411029859841554,0,"Water Cooled Chilled Water Plant",23,1.1000000000000001,"2018-12-28"]
["AMARA SINGAPORE","165, TANJONG PAGAR, SINGAPORE 088539","Commercial Building","Mixed Development",null,288.80742873596313,"3rd Quartile",286.84428448027643,"Bottom Quartile",284.91851425280737,"Bottom Quartile",1988,"Gold",2023,"GM:2021 In Operation",52095,42900,0.82349553699971212,384,"Water Cooled Chilled Water Plant",5,"",""]
["FUNAN","109 NORTH BRIDGE ROAD, SINGAPORE 179097, SINGAPORE 179097","Commercial Building","Mixed Development",null,352.52331932773109,"Bottom Quartile",272.12122803666921,"Bottom Quartile",279.79917398777695,"Bottom Quartile",2019,"GoldPlus",2022,"New Building for Non-Residential buildings (version 4.1)",83776,75398,0.89999522536287246,400,"Water Cooled Chilled Water Plant",4,0.622,"2022-09-20"]
["INCOME AT PRINSEP","30 PRINSEP STREET, SINGAPORE 188647","Commercial Building","Mixed Development",null,229.78601096308481,"3rd Quartile",243.81828016332494,"3rd Quartile",276.36419605144255,"Bottom Quartile",1992,"Gold",2022,"GM:2021 In Operation",4547.99,400,8.7950940965129648E-2,0,"Others","","",""]
["GREAT WORLD CITY","1 KIM SENG PROMENADE, SINGAPORE 237994","Commercial Building","Mixed Development",null,230.80828210647789,"3rd Quartile",244.67046891990856,"3rd Quartile",258.91440491777814,"3rd Quartile",1997,"GoldPlus",2021,"Existing Building for Non-Residential buildings (version 3)",93730,85731,0.91465912728048648,0,"Water Cooled Chilled Water Plant",13,0.64,"2021-01-05"]
["NGEE ANN CITY","391A ORCHARD ROAD, SINGAPORE 238873","Commercial Building","Mixed Development",null,4.1898997159807436,"Top Quartile",246.1826784989747,"3rd Quartile",248.2486741016109,"3rd Quartile",1993,"Platinum",2022,"Existing Building for Non-Residential buildings (version 3)",182382,174705,0.95790703029904267,0,"Water Cooled Chilled Water Plant",7,0.62,"2022-03-29"]
["MACPHERSON MALL","MACPHERSON ROAD, SINGAPORE 368125","Commercial Building","Mixed Development",null,191.17888286660641,"2nd Quartile",227.75632565492319,"3rd Quartile",242.95058115025594,"3rd Quartile",2016,null,null,null,13284,1000,7.527853056308341E-2,298,"Water Cooled Chilled Water Plant",5,"",""]
["VOCO ORCHARD SINGAPORE","581 ORCHARD ROAD, SINGAPORE 238883","Commercial Building","Mixed Development",null,248.52146924537013,"3rd Quartile",252.44046580823886,"3rd Quartile",240.56068845226491,"3rd Quartile",1969,null,null,null,38986,30308,0.77740727440619706,423,"Water Cooled Chilled Water Plant",6,"",""]
["GOLDHILL PLAZA","1 GOLDHILL PLAZA, SINGAPORE 308899","Commercial Building","Mixed Development",null,219.96922975206604,"3rd Quartile",230.22240247933885,"3rd Quartile",234.93348016528924,"3rd Quartile",1973,null,null,null,12100,12775,1.0557851239669422,0,"Others","","",""]
["LINK@896","896 DUNEARN ROAD, SINGAPORE 589472","Commercial Building","Mixed Development",null,191.56374468085107,"2nd Quartile",208.39182978723403,"2nd Quartile",232.25570212765956,"3rd Quartile",1988,null,null,null,23500,21150,0.9,0,"Water Cooled Chilled Water Plant",1,1.02,"2022-01-05"]
["UNITED SQUARE","101 THOMSON ROAD #33-00, SINGAPORE 307591","Commercial Building","Mixed Development",null,250.88546863390297,"3rd Quartile",233.43420474017014,"3rd Quartile",230.94317785494411,"3rd Quartile",1984,"GoldPlus",2021,"Existing Non-Residental Buildings ENRB: 2017",65947,61563,0.93352237402762828,0,"Water Cooled Chilled Water Plant",2,0.6,"2021-04-13"]
["TEKKA PLACE","2 SERANGOON ROAD, SINGAPORE 218227","Commercial Building","Mixed Development",null,170.31964624131396,"2nd Quartile",208.90479198628282,"2nd Quartile",226.82736215143038,"3rd Quartile",2019,"GoldPlus",2019,"Non-Residential Buildings NRB: 2015",22162,10476,0.47270101976355927,318,"Water Cooled Chilled Water Plant",3,0.65,"2021-02-21"]
["WHEELOCK PLACE","501 ORCHARD ROAD, SINGAPORE 238880","Commercial Building","Mixed Development",null,233.38170055452866,"3rd Quartile",241.96520332717191,"3rd Quartile",225.62213493530498,"2nd Quartile",1993,"Gold",2022,"Existing Non-Residential Buildings (RECERT 2017)",43280,39800,0.91959334565619222,0,"Water Cooled Chilled Water Plant",13,0.69099999999999995,"2022-06-22"]
["THE RIVERWALK","20 UPPER CIRCULAR ROAD, SINGAPORE 058416","Commercial Building","Mixed Development",null,225.73647203602854,"3rd Quartile",224.3908457268538,"3rd Quartile",217.21349811478842,"2nd Quartile",1988,"Certified",2019,"Existing Building for Non-Residential buildings (version 3)",19096,19094,0.99989526602429823,0,"Water Cooled Chilled Water Plant",5,0.69799999999999995,"2022-09-30"]
["SEACARE BUILDING","52 CHIN SWEE ROAD, SINGAPORE 169875","Commercial Building","Mixed Development",null,192.12835740626923,"2nd Quartile",194.3156422864167,"2nd Quartile",212.82861094038108,"2nd Quartile",1968,null,null,null,6508,5881,0.90365703749231718,101,"Others","","",""]
["IMM BUILDING","2 JURONG EAST STREET 21, SINGAPORE 609601","Commercial Building","Mixed Development",null,203.30241007492813,"3rd Quartile",202.61785447493716,"2nd Quartile",209.67801580055385,"2nd Quartile",1990,"GoldPlus",2022,"Existing Non-Residential Buildings (RECERT 2017)",132527,88287,0.66618123099443882,0,"Water Cooled Chilled Water Plant",9,"",""]
["HEXACUBE","160 CHANGI ROAD, SINGAPORE 419728","Commercial Building","Mixed Development",null,152.58275218427323,"Top Quartile",181.49788721207307,"2nd Quartile",209.56688840349486,"2nd Quartile",2017,null,null,null,5036,4800,0.95313741064336777,0,"Air Cooled Chilled Water Plant","","",""]
["FAR EAST SHOPPING CENTRE","545 ORCHARD ROAD, SINGAPORE 238882","Commercial Building","Mixed Development",null,202.59705320600276,"3rd Quartile",209.30123522055482,"2nd Quartile",208.96897851296043,"2nd Quartile",1974,"GoldPlus",2018,"Existing Building for Non-Residential buildings (version 3)",17592,14909,0.847487494315598,0,"Water Cooled Chilled Water Plant",5,0.61299999999999999,"2017-12-25"]
["DUO TOWER","3 FRASER STREET DUO TOWER, SINGAPORE 189352","Commercial Building","Mixed Development",null,183.12750007496476,"2nd Quartile",184.50424300578729,"2nd Quartile",204.63402200965547,"2nd Quartile",2017,"Platinum",2022,"Existing Non-Residential Buildings (RECERT 2017)",100047,44614,0.44593041270602818,347,"Water Cooled Chilled Water Plant",6,0.48,"2022-10-01"]
["ROYAL PLAZA ON SCOTTS","25 SCOTTS ROAD, SINGAPORE 228220","Commercial Building","Mixed Development",null,200.14660241577684,"3rd Quartile",204.09790476999171,"2nd Quartile",203.1409556966056,"2nd Quartile",1974,"Gold",2013,"Existing Building for Non-Residential buildings (version 2.1)",47107,47107,1,511,"Water Cooled Chilled Water Plant",11,0.77,"2010-12-10"]
["PALAIS RENAISSANCE","390 ORCHARD ROAD, SINGAPORE 238871","Commercial Building","Mixed Development",null,155.05150485436891,"Top Quartile",152.79101941747572,"Top Quartile",197.07651699029125,"2nd Quartile",1991,"Platinum",2020,"Existing Building for Non-Residential buildings (version 3)",16480,14669,0.89010922330097086,0,"Water Cooled Chilled Water Plant",5,0.59,"2023-03-01"]
["WILKIE EDGE","8 WILKIE ROAD, SINGAPORE 228095","Commercial Building","Mixed Development",null,224.62330923305774,"3rd Quartile",200.04498045456117,"2nd Quartile",195.7425018161691,"2nd Quartile",2008,null,null,null,28907,19536,0.67582246514685029,154,"Water Cooled Chilled Water Plant",12,0.87,"2015-09-10"]
["LIAT TOWERS","541 ORCHARD ROAD, SINGAPORE 238881","Commercial Building","Mixed Development",null,184.28565588430681,"2nd Quartile",203.28861975573611,"2nd Quartile",192.59520159435843,"2nd Quartile",1979,"Gold",2022,"Existing Building for Non-Residential buildings (version 3)",19569,18089,0.92437017732127347,0,"Water Cooled Chilled Water Plant",4,0.57999999999999996,"2020-06-01"]
["RB CAPITAL BUILDING","22 MALACCA STREET, SINGAPORE 048980","Commercial Building","Mixed Development",null,182.81054922545127,"2nd Quartile",183.07381001152223,"2nd Quartile",185.95593649980796,"2nd Quartile",1975,null,null,null,7811,6300,0.80655485853283826,0,"Water-Cooled Package Units","","",""]
["THE MANAGEMENT CORPORATION STRATA TITLE PLAN NO. 703","19 TANGLIN ROAD, SINGAPORE 247909","Commercial Building","Mixed Development",null,189.70314353694053,"2nd Quartile",176.99326004020185,"Top Quartile",179.61418755384173,"Top Quartile",1970,null,null,null,24377,22470,0.92177052139311644,0,"Water Cooled Chilled Water Plant",4,"",""]
["MCST393, PEOPLE'S PARK CENTRE","101 UPPER CROSS STREET #07-09, SINGAPORE 058357","Commercial Building","Mixed Development",null,172.04181485281987,"2nd Quartile",171.08156495845157,"Top Quartile",165.1799297800849,"Top Quartile",1978,"Gold",2020,"Existing Building for Non-Residential buildings (version 3)",49701,49701,1,0,"Water Cooled Chilled Water Plant",1978,"",""]
["THE HEEREN","260 ORCHARD ROAD, SINGAPORE 238855","Commercial Building","Mixed Development",null,198.72061150596755,"2nd Quartile",115.29824326136516,"Top Quartile",161.53437039023737,"Top Quartile",1996,"Platinum",2018,"Existing Building for Non-Residential buildings (version 3)",37285,33399,0.89577578114523271,0,"Water Cooled Chilled Water Plant",13,0.55000000000000004,"2023-02-20"]
["PENINSULA PLAZA","111 NORTH BRIDGE ROAD, SINGAPORE 179098","Commercial Building","Mixed Development",null,140.80123920507751,"Top Quartile",147.97754552075747,"Top Quartile",158.25104796587243,"Top Quartile",1980,"Gold",2019,"Existing Building for Non-Residential buildings (version 3)",48055,45000,0.93642701071688694,0,"Water Cooled Chilled Water Plant",4,63,"2022-10-01"]
["OG ALBERT COMPLEX","60 ALBERT STREET, SINGAPORE 189969","Commercial Building","Mixed Development",null,139.45896439122998,"Top Quartile",143.28853988493236,"Top Quartile",144.18314414554501,"Top Quartile",1984,"Gold",2015,"Existing Building for Non-Residential buildings (version 3)",25724,23153,0.90005442388431034,0,"Water Cooled Chilled Water Plant",5,0.63039999999999996,"2023-03-07"]
["CONCORDE HOTEL AND SHOPPING MALL","100 ORCHARD ROAD #01-100B, SINGAPORE 238840","Commercial Building","Mixed Development",null,133.48424188158546,"Top Quartile",124.43180275970134,"Top Quartile",135.99185280526996,"Top Quartile",1984,null,null,null,62543,60000,0.95933997409782068,421,"Water Cooled Chilled Water Plant",5,"",""]
["THE ADELPHI","1 COLEMAN STREET, SINGAPORE 179803","Commercial Building","Mixed Development",null,121.16859298221328,"Top Quartile",131.06736683046117,"Top Quartile",133.14188640505685,"Top Quartile",2008,"Platinum",2017,"Existing Building for Non-Residential buildings (version 3)",43347,41158,0.94950054213671076,0,"Water Cooled Chilled Water Plant",5,"",""]
["CECIL BUILDING","137 CECIL STREET, SINGAPORE 069537","Commercial Building","Mixed Development",null,111.40881063498797,"Top Quartile",116.53551548578702,"Top Quartile",125.88194314806958,"Top Quartile",2017,null,null,null,7071,7071,1,0,"Others","","",""]
["SIM LIM TOWER","10 JALAN BESAR, SINGAPORE 208787","Commercial Building","Mixed Development",null,105.02778895134375,"Top Quartile",115.34919813806432,"Top Quartile",107.68265545406641,"Top Quartile",1981,"GoldPlus",2018,"Existing Building for Non-Residential buildings (version 3)",22772,19356,0.84999121728438432,0,"Water Cooled Chilled Water Plant",7,0.62,"2022-12-15"]
["ORCHARD TOWERS AND ONE CLAYMORE","400 ORCHARD ROAD\nAND\n1 CLAYMORE DRIVE, SINGAPORE 238875","Commercial Building","Mixed Development",null,123.41636735265949,"Top Quartile",102.70934219439835,"Top Quartile",106.87767969352238,"Top Quartile",1975,"Gold",2022,"Existing Non-Residental Buildings ENRB: 2017",42809,37624,0.87888060921768785,0,"Water Cooled Chilled Water Plant",9,0.61,"2018-06-30"]
["KITCHENER COMPLEX","809 FRENCH ROAD, SINGAPORE 200809","Commercial Building","Mixed Development",null,104.01396771284701,"Top Quartile",87.56307288938622,"Top Quartile",94.210106066377804,"Top Quartile",1986,"Gold",2019,"Existing Building for Non-Residential buildings (version 2.1)",26881.279999999999,9874,0.36731881815151662,0,"Others","","",""]
["PUBLIC MANSION","432 BALESTIER ROAD, SINGAPORE 329813","Commercial Building","Mixed Development",null,56.606476430976414,"Top Quartile",64.209974747474746,"Top Quartile",63.831016835016833,"Top Quartile",1974,null,null,null,11880,7600,0.63973063973063971,0,"Others","","",""]
["DOWNTOWN EAST","1 PASIR RIS CLOSE, SINGAPORE 519599","Commercial Building","Mixed Development",null,null,null,null,null,null,null,2009,"Gold",2015,"New Building for Non-Residential buildings (version 4.1)",97108,30523,0.31432013840260331,387,"District Cooling System (DCS)","",0.69,"2019-11-22"]
["PAN PACIFIC SERVICED SUITES SINGAPORE, ORCHARD","96 SOMERSET ROAD, SINGAPORE 199592","Commercial Building","Mixed Development",null,null,null,null,null,null,null,2013,null,null,null,11794.1,10436,0.8848492042631485,126,"Water Cooled Chilled Water Plant",2013,"",""]
["PARKROYAL ON BEACH ROAD","7500C BEACH ROAD, SINGAPORE 199591","Commercial Building","Mixed Development",null,null,null,null,null,null,null,1971,"Gold",2022,"Existing Non-Residential Buildings (RECERT 2017)",21045,18941,0.90002375861249706,346,"Water Cooled Chilled Water Plant",0,1.1259999999999999,"2023-03-23"]
[]
["note: includes buildings without completed submissions in 2022, buildings without EUI or EUI Quartile/Ranking are buildings that were not benchmarked, or EUI which was combined under the main building"]

{"sheet":"Healthcare Facility","index":4,"n_rows":86,"n_cols":24,"rows_kept":86,"cut":false,"hidden":false,"merged":[]}
["Building Name","Address","Building Type","Main Function","Building Size","2020 EUI","2020 EUI Quartile/ Energy Ranking","2021 EUI","2021 EUI Quartile/ Energy Ranking","2022 EUI","2022 EUI Quartile/ Energy Ranking","TOP/CSC Year","Award (Green/Non-Green)","Year of GM Award","Green Mark Version","GFA","AC Area","AC Area Percentage","No. Of Hotel Room","AC Type","Age  of Chiller","Air-con system efficiency (kW/RT)","Date of Last Audit/Health Check","Reason for High EUI (if any)"]
["SINGAPORE GENERAL HOSPITAL","10 HOSPITAL BOULEVARD #19-01 SINGAPORE 168582, SINGAPORE 169608","Healthcare Facility","Hospital",null,639.8813059043573,17,618.64994986000477,17,594.8096055663359,17,1981,null,null,null,172666.55,164580,0.95316666719755516,0,"Water Cooled Chilled Water Plant",23,1.48,"2022-08-24"]
["GLENEAGLES HOSPITAL","6A NAPIER ROAD, SINGAPORE 258500, SINGAPORE 258500","Healthcare Facility","Hospital",null,392.12378382217173,16,416.20137064128966,16,406.84988045356624,16,1993,null,null,null,42243,42243,1,0,"Water Cooled Chilled Water Plant",11,"",""]
["PARKWAY EAST HOSPITAL","321 JOO CHIAT PLACE, SINGAPORE 427990","Healthcare Facility","Hospital",null,386.47030653083499,15,402.94108149899944,15,396.12744042204838,15,1979,null,null,null,10994,10763,0.97898853920320172,0,"Water Cooled Chilled Water Plant",10,"",""]
["KK WOMEN'S AND CHILDREN'S HOSPITAL","100 BUKIT TIMAH ROAD, SINGAPORE 229899","Healthcare Facility","Hospital",null,331.64862935694464,11,355.33990985355211,12,365.48181030749242,14,1997,null,null,null,124686,81768,0.65579134786583904,0,"Water Cooled Chilled Water Plant",12,0.99,"2014-01-31"]
["TAN TOCK SENG HOSPITAL","11 JALAN TAN TOCK SENG, SINGAPORE 308433","Healthcare Facility","Hospital",null,329.71364880190612,10,357.94541670568407,14,361.78129709398507,13,1999,"Platinum",2006,"Existing Building (version 1)",179917,148371,0.82466359487986129,1200,"Water Cooled Chilled Water Plant",24,0.8,"2021-04-27"]
["MOUNT ELIZABETH NOVENA HOSPITAL","38 IRRAWADDY ROAD, SINGAPORE 329563","Healthcare Facility","Hospital",null,361.12973152321177,14,357.8181353167252,13,348.80325987778912,12,2012,"Platinum",2019,"New Building for Non-Residential buildings (version 3)",72334,70000,0.96773301628556418,333,"Water Cooled Chilled Water Plant",10,"",""]
["MOUNT ELIZABETH HOSPITAL","3 MOUNT ELIZABETH, SINGAPORE 228510","Healthcare Facility","Hospital",null,350.1219667132512,12,346.93264606058403,10,344.02119897635077,11,1979,null,null,null,55097,54958,0.99747717661578672,284,"Water Cooled Chilled Water Plant",4,"",""]
["CHANGI GENERAL HOSPITAL","2 SIMEI STREET 3, SINGAPORE 529889","Healthcare Facility","Hospital",null,351.10389828857785,13,350.9192541634572,11,343.78124252968206,10,1998,null,null,null,112947,74061,0.65571462721453422,0,"Water Cooled Chilled Water Plant",12,"",""]
["KHOO TECK PUAT HOSPITAL","90 YISHUN CENTRAL, SINGAPORE 768828, SINGAPORE 768828","Healthcare Facility","Hospital",null,328.29224216199509,9,327.19683389031621,9,320.16185504278786,9,2010,null,null,null,103534,63491,0.61323816330867154,0,"Water Cooled Chilled Water Plant",10]
["THOMSON MEDICAL CENTRE","339 THOMSON ROAD SINGAPORE 307677, SINGAPORE 307677","Healthcare Facility","Hospital",null,323.29373551737916,8,314.7662924490611,6,319.64751338393927,8,1975,"Certified",2020,"Existing Building for Non-Residential buildings (version 3)",12515,12515,1,0,"Water Cooled Chilled Water Plant",4,0.75,"2020-09-10"]
["ALEXANDRA HOSPITAL","378 ALEXANDRA ROAD, SINGAPORE 159964","Healthcare Facility","Hospital",null,306.49823847918094,6,322.78457427943158,8,310.39888397607172,7,1940,"Platinum",2022,"New Non-Residential Buildings (NRB: 2015) (R3)",42293,33778,0.79866644598396896,0,"Air Cooled Chilled Water Plant","","",""]
["SENGKANG GENERAL HOSPITAL","110 SENGKANG EAST WAY, SINGAPORE 544886, SINGAPORE 544886","Healthcare Facility","Hospital",null,276.04893333333331,5,279.39196666666669,5,282.35132222222222,6,2017,"Platinum",2023,"GM:2021 In Operation",288000,158344,0.54980555555555555,0,"Water Cooled Chilled Water Plant",6,0.6159,"2022-08-01"]
["RAFFLES HOSPITAL","585 NORTH BRIDGE ROAD, SINGAPORE 188770","Healthcare Facility","Hospital",null,269.88431563565513,4,275.19337554797858,4,266.54437408670242,5,2001,"Certified",2019,"Existing Building for Non-Residential buildings (version 3)",49272,39371,0.79905422958272443,0,"Water Cooled Chilled Water Plant",6,0.65,"2022-04-20"]
["1 JURONG EAST STREET 21","1 JURONG EAST STREET 21, SINGAPORE 609606","Healthcare Facility","Hospital",null,263.58511888472128,3,256.94238477760427,3,249.97985318501586,4,2015,null,null,null,186357,130612,0.70086983585269136,0,"Water Cooled Chilled Water Plant",4]
["ANG MO KIO-THYE HUA KWAN HOSPITAL","17 ANG MO KIO AVE 9, SINGAPORE 569766","Healthcare Facility","Hospital",null,247.15569996732526,2,234.17989894456713,2,234.91129108452517,3,1993,"Gold",2017,"New Building for Non-Residential buildings (version 4.1)",20321.52,17199,0.84634417110531102,0,"Water Cooled Chilled Water Plant",7,"",""]
["BRIGHT VISION COMMUNITY HOSPITAL","5 LORING NAPIRI, SINGAPORE 547530","Healthcare Facility","Hospital",null,226.01704710979996,1,158.85044251866876,1,151.29403521711072,2,2001,null,null,null,10847,3210,0.29593435973080112,0,"Air Cooled Chilled Water Plant","","",""]
["MOUNT ALVERNIA HOSPITAL","820 THOMSON ROAD, SINGAPORE 574623","Healthcare Facility","Hospital",null,316.21929846777255,7,320.17870077244521,7,50.346941876662022,1,1961,"Certified",2021,"Healthcare Facilities (Version 1.0)",39485,34863,0.88294288970495127,0,"Water Cooled Chilled Water Plant",6,"",""]
["MAIN BUILDING","5 LOWER KENT RIDGE ROAD, SINGAPORE 119074","Healthcare Facility","Hospital",null,null,null,null,null,null,null,1985,"GoldPlus",2022,"Existing Non-Residential Buildings (RECERT 2017)",146327,70554,0.48216665413765059,0,"Water Cooled Chilled Water Plant",5,0.64,"2021-02-09"]
["NATIONAL CANCER CENTRE OF SINGAPORE PTE LTD","11 HOSPITAL CRESCENT, SINGAPORE 169610","Healthcare Facility","Specialist Clinic",null,609.07977859334574,9,608.16166295650078,9,585.31460200950607,9,1999,null,null,null,16621,14934,0.8985018951928283,0,"Air Cooled Chilled Water Plant","","",""]
["ACADEMIA","20 COLLEGE ROAD, SINGAPORE 169856","Healthcare Facility","Specialist Clinic",null,475.77840554500671,7,481.32274833689632,8,477.69147269323207,8,2013,"GoldPlus",2022,"Existing Non-Residential Buildings (RECERT 2017)",75311,51860,0.68861122545179321,0,"Water Cooled Chilled Water Plant",9,0.68,"2021-09-07"]
["NATIONAL UNIVERSITY HOSPITAL MEDICAL CENTRE","1 LOWER KENT RIDGE ROAD, SINGAPORE 119082","Healthcare Facility","Specialist Clinic",null,509.43146516738267,8,362.60433947696635,7,371.08604913586601,7,2013,"GoldPlus",2020,"New Building for Non-Residential buildings (version 3)",71921,60916,0.84698488619457457,0,"Air Cooled Chilled Water Plant","","",""]
["SINGAPORE NATIONAL EYE CENTRE","11 THIRD HOSPITAL, SINGAPORE 168751","Healthcare Facility","Specialist Clinic",null,343.47683209051172,6,360.73643610182569,6,349.00575983543325,6,1990,null,null,null,19445,16623,0.85487271792234509,0,"Water Cooled Chilled Water Plant",22,"",""]
["NATIONAL HEART CENTRE OF SINGAPORE","5 HOSPITAL DRIVE, SINGAPORE 169609","Healthcare Facility","Specialist Clinic",null,309.80862859266603,5,316.99296952428148,5,312.81463701684834,5,2014,"Platinum",2022,"Existing Non-Residential Buildings (RECERT 2017)",48432,38497,0.79486703006276838,0,"Water-Cooled Package Units","",0.65,"2023-02-28"]
["GLENEAGLES MEDICAL CENTRE (MCST 1847)","6 NAPIER ROAD, SINGAPORE 258499","Healthcare Facility","Specialist Clinic",null,308.02382279186401,4,295.13592458437819,4,288.45778768459184,4,1994,null,null,null,10767,10766,0.99990712361846379,0,"Water-Cooled Package Units","","",""]
["NATIONAL SKIN CENTRE (S) PTE LTD","1 MANDALAY ROAD, SINGAPORE 308205","Healthcare Facility","Specialist Clinic",null,215.56519975664165,2,223.89768809572095,1,270.94261508821739,3,1988,null,null,null,9862,6620,0.6712634354086392,0,"Water Cooled Chilled Water Plant",26,"",""]
["MEDICAL CENTRE\nCHANGI GENERAL HOSPITAL","2A SIMEI STREET 3, SINGAPORE 529906","Healthcare Facility","Specialist Clinic",null,228.4381287887453,3,245.08294178199705,3,254.19838499370925,2,2018,"Platinum",2014,"New Building for Non-Residential buildings (version 4.1)",43715,31292,0.71581836898089901,0,"Water Cooled Chilled Water Plant",5,0.57999999999999996,"2022-03-28"]
["NATIONAL DENTAL CENTRE","5 SECOND HOSPITAL AVENUE, SINGAPORE 168938","Healthcare Facility","Specialist Clinic",null,213.53782519161894,1,228.74859125427048,2,224.13432206140067,1,1997,null,null,null,13558.16,9848,0.72635224838768686,0,"Water Cooled Chilled Water Plant",13,"",""]
["TUBERCULOSIS CONTROL UNIT","144 MOULMEIN ROAD, SINGAPORE 308089","Healthcare Facility","Specialist Clinic",null,null,"",null,"",null,null,2014,null,null,null,1276,155,0.12147335423197492,18,"Air Cooled Chilled Water Plant","","",""]
["NATIONAL UNIVERSITY CENTRE FOR ORAL HEALTH SINGAPORE (NUCOHS)","9 LOWER KENT RIDGE ROAD, SINGAPORE 119085","Healthcare Facility","Specialist Clinic",null,null,"",null,"",null,"",2018,"GoldPlus",2022,"Existing Non-Residential Buildings (RECERT 2017)",34317,29632,0.86347874231430488,0,"Water Cooled Chilled Water Plant",5,"",""]
["TUBERCULOSIS CONTROL UNIT (CONTACT CENTRE)","142 MOULMEIN ROAD, SINGAPORE 308087","Healthcare Facility","Specialist Clinic",null,null,"",null,"",null,"",2014,null,null,null,1276,970,0.7601880877742947,24,"Air Cooled Chilled Water Plant","","",""]
["CDC 2","7 JALAN TAN TOCK SENG, SINGAPORE 308440","Healthcare Facility","Specialist Clinic",null,null,"",null,"",null,"",2003,null,null,null,9753,6000,0.61519532451553371,94,"Air Cooled Chilled Water Plant","","",""]
["ANG MO KIO POLYCLINIC","21 ANG MO KIO CENTRAL 2, SINGAPORE 569666, SINGAPORE 569666","Healthcare Facility","Polyclinic/ Private Clinic",null,220.48234971428573,11,227.459136,11,230.94277714285715,11,2017,null,null,null,8750,6610,0.75542857142857145,0,"Water Cooled Chilled Water Plant",4,0.48,"2019-03-22"]
["CAMDEN MEDICAL","ONE ORCHARD BOULEVARD, SINGAPORE 248649","Healthcare Facility","Polyclinic/ Private Clinic",null,218.17587325216653,10,213.22624807273115,10,203.7330799085544,10,1999,null,null,null,18809,15000,0.79749056302833754,0,"Water Cooled Chilled Water Plant",8,"",""]
["HOUGANG POLYCLINIC","89 HOUGANG AVENUE 4, SINGAPORE 538829, SINGAPORE 538829","Healthcare Facility","Polyclinic/ Private Clinic",null,177.30636576155368,8,180.52057183959721,9,180.91586944794102,9,1991,null,null,null,5561,2120,0.38122639812983278,0,"Others"]
["WOODLANDS POLYCLINIC","10 WOODLANDS STREET 31, SINGAPORE 738579, SINGAPORE 738579","Healthcare Facility","Polyclinic/ Private Clinic",null,160.96744130710661,7,174.18174175126902,8,176.7503807106599,8,1993,null,null,null,6304,3206,0.50856598984771573,0,"Others"]
["TAMPINES POLYCLINIC","1 TAMPINES STREET 41, SINGAPORE 529203","Healthcare Facility","Polyclinic/ Private Clinic",null,154.14767525035765,5,150.90185979971386,4,160.4963340486409,7,1990,null,null,null,5592,5592,1,0,"Others","","",""]
["THONG CHAI BUILDING","50 CHIN SWEE ROAD, SINGAPORE 169874","Healthcare Facility","Polyclinic/ Private Clinic",null,188.59593150169363,9,167.6189273616861,7,158.47191945803539,6,2012,"Platinum",2022,"Existing Non-Residental Buildings ENRB: 2017",5314,3864,0.72713586751975912,0,"Water Cooled Chilled Water Plant",0,0.53100000000000003,"2022-12-12"]
["CHOA CHU KANG POLYCLINIC","2 TECK WHYE CRESCENT, SINGAPORE 688846","Healthcare Facility","Polyclinic/ Private Clinic",null,158.39464536243182,6,160.87248636009352,6,155.53267342166797,5,1997,null,null,null,6415,2925,0.455962587685113,0,"Others","","",""]
["SATA COMMHEALTH BUILDING","351 CHAI CHEE STREET, SINGAPORE 468982","Healthcare Facility","Polyclinic/ Private Clinic",null,151.73366764814133,4,151.38215863084284,5,141.34851858667648,4,1997,null,null,null,5434,2200,0.40485829959514169,0,"Others","","",""]
["BUKIT BATOK POLYCLINIC","50 BUKIT BATOK WEST AVENUE 3, SINGAPORE 659164","Healthcare Facility","Polyclinic/ Private Clinic",null,127.76282899799908,1,139.29475142373403,3,138.52725873480068,3,1991,null,null,null,6497,2806,0.4318916422964445,0,"Others","","",""]
["PIONEER POLYCLINIC","26 JURONG WEST STREET 61, SINGAPORE 648201","Healthcare Facility","Polyclinic/ Private Clinic",null,136.39158967741938,3,138.83195999999998,1,137.43043741935483,2,2017,"Platinum",2016,"Healthcare Facilities (Version 1.0)",7750,4306,0.55561290322580648,0,"Water Cooled Chilled Water Plant",5,0.61499999999999999,"2019-05-29"]
["GEYLANG POLYCLINIC","21 GEYLANG EAST CENTRAL, SINGAPORE 389707, SINGAPORE 389707","Healthcare Facility","Polyclinic/ Private Clinic",null,131.65495722578675,2,138.97574091047969,2,128.44775435380384,1,2013,null,null,null,6546,3462,0.52887259395050412,0,"Others"]
["ST. ANDREW'S COMMUNITY HOSPITAL","8 SIMEI STREET 3, SINGAPORE 529895","Healthcare Facility","Community Hospital/ Nursing Home",null,192.89766322050698,37,190.05460982863619,40,192.46011896331964,41,2005,null,null,null,14122,8276,0.58603597224189208,0,"Air Cooled Chilled Water Plant","","",""]
["REN CI COMMUNITY HOSPITAL","71 IRRAWADDY ROAD, SINGAPORE 329562","Healthcare Facility","Community Hospital/ Nursing Home",null,176.36573373012001,36,178.2747760757147,39,185.04708947214363,40,2008,null,null,null,20498,8156,0.39789247731485999,0,"Air Cooled Chilled Water Plant","","",""]
["YISHUN COMMUNITY HOSPITAL","2 YISHUN CENTRAL 2, SINGAPORE 768024","Healthcare Facility","Community Hospital/ Nursing Home",null,157.12339324763988,35,159.1665599943108,38,165.25436023254574,39,2015,"Platinum",2023,"GM:2021 In Operation",56247,24121,0.42884064927907267,0,"Water Cooled Chilled Water Plant",7,0.59,"2022-12-31"]
["ASSISI HOSPICE","832 THOMSON ROAD, SINGAPORE 574627","Healthcare Facility","Community Hospital/ Nursing Home",null,149.84753307114767,33,146.8879478012156,36,154.82234179478013,38,2016,"Platinum",2022,"New Building for Non-Residential buildings (version 4.1)",11188,8260,0.73829102609939223,0,"Water Cooled Chilled Water Plant",2016,0.54,"2023-02-27"]
["RENCI @ BUKIT BATOK ST. 52","31 BUKIT BATOK STREET 52, SINGAPORE 659251, SINGAPORE 659251","Healthcare Facility","Community Hospital/ Nursing Home",null,156.70465000800897,34,153.42123978856318,37,152.05247477174436,37,2014,null,null,null,6243,970,0.15537401890116931,0,"Others","",0.42,"2014-09-30"]
["ST LUKE'S HOSPITAL","2 BUKIT BATOK STREET 11, SINGAPORE 659674, SINGAPORE 659674","Healthcare Facility","Community Hospital/ Nursing Home",null,144.44648678853676,32,142.38569968867247,35,148.74756765386763,36,1996,null,null,null,12527,3700,0.29536201804103135,0,"Others","","",""]
["NTUC HEALTH (JURONG WEST)","50 JURONG WEST STREET 93 S648967, SINGAPORE 648967","Healthcare Facility","Community Hospital/ Nursing Home",null,143.14698335644937,31,129.17241678224687,33,134.12987170596392,35,2015,null,null,null,8652,1225,0.14158576051779936,0,"Others","","",""]
["ALL SAINTS HOME (JURONG EAST)","20 JURONG EAST AVENUE 1, SINGAPORE 609792","Healthcare Facility","Community Hospital/ Nursing Home",null,133.62152727272726,29,129.47189090909092,34,133.16493636363637,34,2016,null,null,null,5500,593,0.10781818181818181,0,"Others","","",""]
["NURSING HOME (GEYLANG EAST)","25 GEYLANG EAST CENTRAL, SINGAPORE 389708","Healthcare Facility","Community Hospital/ Nursing Home",null,123.29465993623803,28,125.40903028692881,31,129.86062699256112,33,2017,null,null,null,7528,1138,0.15116896918172157,0,"Others","","",""]
["ALL SAINTS HOME (TAMPINES)","11 TAMPINES STREET 44, SINGAPORE 529123","Healthcare Facility","Community Hospital/ Nursing Home",null,115.72306738962045,25,115.74163439194423,30,128.15346243222308,32,1998,null,null,null,6455,3000,0.46475600309837334,0,"Others","","",""]
["THYE HUA KWAN NURSING HOME LIMITED","48 HOUGANG AVE 8, SINGAPORE 538793","Healthcare Facility","Community Hospital/ Nursing Home",null,137.53589875275128,30,127.20500366837858,32,120.02286867204695,31,2017,null,null,null,8178,9998,1.2225483003179261,0,"Others","","",""]
["ST ANDREW'S NURSING HOME","60 BUANGKOK VIEW, SINGAPORE 534012","Healthcare Facility","Community Hospital/ Nursing Home",null,116.99320831500221,27,115.28346898372196,28,118.33717553893534,30,2013,null,null,null,9092,1198,0.1317641882974043,0,"Others","","",""]
["KWONG WAI SHIU HOSPITAL","705 SERANGOON ROAD, SINGAPORE 328127","Healthcare Facility","Community Hospital/ Nursing Home",null,116.33220073503675,26,115.29214341967098,29,117.48027957647882,29,2017,null,null,null,22856,13713,0.59997374868743436,0,"Others","","",""]
["SINGAPORE CHRISTIAN HOME","20 SEMBAWANG CRESCENT, SINGAPORE 757092","Healthcare Facility","Community Hospital/ Nursing Home",null,110.36618250710453,24,110.72058414903695,27,111.20919482159773,28,2013,null,null,null,6334,441,6.9624250078939062E-2,0,"Others","","",""]
["ALL SAINTS HOME (HOUGANG)","5 POH HUAT ROAD, SINGAPORE 546703","Healthcare Facility","Community Hospital/ Nursing Home",null,105.78327939233819,23,100.32585535006605,25,109.72876486129459,27,1986,null,null,null,6056,1602,0.26453104359313079,0,"Others","","",""]
["LIONS HOME FOR THE ELDERS","9 BISHAN STREET 13, SINGAPORE 579804","Healthcare Facility","Community Hospital/ Nursing Home",null,105.01573149035171,22,106.96936499247298,26,107.74414260298343,26,2015,null,null,null,7307,632,8.6492404543588336E-2,0,"Others","","",""]
["NTUC HEALTH (CHAI CHEE)","35 CHAI CHEE STREET, SINGAPORE 468984","Healthcare Facility","Community Hospital/ Nursing Home",null,92.885765116279075,18,92.82715348837209,23,94.422976744186045,25,2016,null,null,null,12900,1489,0.11542635658914728,0,"Others","","",""]
["TAMPINES CARE HOME","31TAMPINES STREET 61, SINGAPORE 528564","Healthcare Facility","Community Hospital/ Nursing Home",null,97.171476045416796,20,87.80527554693991,20,92.550772639158126,24,2018,null,null,null,10833,1164,0.10744945998338411,0,"Others","","",""]
["ST.ANDREW'S NURSING HOME","11 JALAN PENJARA SINGAPORE 149380, SINGAPORE 149380","Healthcare Facility","Community Hospital/ Nursing Home",null,91.766457423580789,16,87.765665938864629,19,88.996271834061133,23,2016,null,null,null,10992,1,9.097525473071325E-5,0,"Air Cooled Chilled Water Plant","",0,"2022-12-12"]
["SOCIETY FOR THE AGED SICK","130 HOUGANG AVE 1, SINGAPORE 538900","Healthcare Facility","Community Hospital/ Nursing Home",null,100.16543645907589,21,97.27451558550969,24,88.374716479813358,22,1996,null,null,null,15431,1416,9.1763333549348708E-2,0,"Others","","",""]
["ST. ANDREW'S NURSING HOME (HENDERSON)","303 HENDERSON ROAD, SINGAPORE 108925","Healthcare Facility","Community Hospital/ Nursing Home",null,92.229668067226882,17,90.073436974789914,21,87.857977941176472,21,2016,null,null,null,9520,1900,0.19957983193277312,0,"Others","","",""]
["SUNSHINE WELFARE ACTION MISSION (SWAMI)","NO. 5, SEMBAWANG WALK, SINGAPORE 757717","Healthcare Facility","Community Hospital/ Nursing Home",null,78.229808422791081,8,85.770257638315442,18,87.843919075144512,20,1997,null,null,null,12110,1699,0.1402972749793559,0,"Others","","",""]
["THONG TECK HOME FOR SENIOR CITIZENS","91 GEYLANG EAST AVE 2, SINGAPORE 389759","Healthcare Facility","Community Hospital/ Nursing Home",null,90.235388888888878,14,91.319074074074081,22,87.489703703703711,19,1997,null,null,null,5400,700,0.12962962962962962,0,"Others","","",""]
["MWS BETHANY NURSING HOME","9 CHOA CHU KANG AVE 4, SINGAPORE 689815","Healthcare Facility","Community Hospital/ Nursing Home",null,81.666694972826093,10,84.479551630434784,16,85.273494112318843,18,2001,null,null,null,8832,1297,0.14685235507246377,0,"Others","","",""]
["MAN FUT TONG NURSING HOME","20 WOODLANDS ST 82, SINGAPORE 738507","Healthcare Facility","Community Hospital/ Nursing Home",null,85.07209655172413,12,83.59142068965518,15,84.683703448275864,17,2001,null,null,null,7250,1421,0.19600000000000001,0,"Others","","",""]
["INSTITUTE OF MENTAL HEALTH","10 BUANGKOK VIEW, SINGAPORE 539747, SINGAPORE 539747","Healthcare Facility","Community Hospital/ Nursing Home",null,77.592523675290337,7,77.789166501648239,9,83.868079010821319,16,1993,null,null,null,171698,31200,0.18171440552598167,0,"Air Cooled Chilled Water Plant"]
["JAMIYAH NURSING HOME","130, WEST COAST DRIVE, SINGAPORE 127444","Healthcare Facility","Community Hospital/ Nursing Home",null,90.744937802349682,15,84.849136143745682,17,82.703178991015889,15,2002,null,null,null,5788,1007,0.17398064961990325,0,"Others","","",""]
["BRIGHT HILL EVERGREEN HOME","1 TEBING LANE, SINGAPORE 828838","Healthcare Facility","Community Hospital/ Nursing Home",null,"","",32.608695652173914,2,81.120069104520582,14,2021,null,null,null,6946,556,8.0046069680391588E-2,0,"Others","","",""]
["WOODLANDS CARE HOME","2 WOODLANDS RISE, SINGAPORE 737749","Healthcare Facility","Community Hospital/ Nursing Home",null,79.669693128752499,9,77.292655103402268,8,79.699269513008673,13,2017,null,null,null,8994,900,0.1000667111407605,0,"Others","","",""]
["BRIGHT HILL EVERGREEN HOME","100 PUNGGOL FIELD, SINGAPORE 828811","Healthcare Facility","Community Hospital/ Nursing Home",null,84.373362445414841,11,79.126637554585159,11,78.613537117903931,12,2014,null,null,null,6870,680,9.8981077147016011E-2,0,"Others","","",""]
["VILLA FRANCIS HOME FOR THE AGED","91, YISHUN CENTRAL, SINGAPORE 768829","Healthcare Facility","Community Hospital/ Nursing Home",null,93.707419667366395,19,81.041345067011136,13,78.335278540287419,11,2012,null,null,null,6193,1000,0.16147263038914905,0,"Others","","",""]
["VANGUARD HEALTHCARE PTE LTD\nBUKIT BATOK CARE HOME","11 BUKIT BATOK WEST AVE 9, SINGAPORE 657995","Healthcare Facility","Community Hospital/ Nursing Home",null,73.334184032171891,4,83.127548581231196,14,76.893058016254685,10,2019,null,null,null,8534.16,2837,0.33242873346644547,0,"Others","","",""]
["REN CI @ ANG MO KIO NURSING HOME","10 ANG MO KIO AVE 8, SINGAPORE 567727","Healthcare Facility","Community Hospital/ Nursing Home",null,71.328231821194052,3,74.626343755647923,6,76.484891860955472,9,2018,null,null,null,16599,1853,0.11163323091752515,0,"Others","",0.68,"2018-06-25"]
["SUNLOVE ABODE FOR INTELLECTUALLY INFIRMED LTD","70 BUANGKOK VIEW, SINGAPORE 534190","Healthcare Facility","Community Hospital/ Nursing Home",null,"","",74.667853054183325,7,75.147264173135738,8,2021,null,null,null,12753,2810,0.22034031208343136,0,"Others","",0.83,"2022-12-18"]
["JU ENG HOME FOR SENIOR CITIZENS","205 JALAN KAYU, SINGAPORE 799436","Healthcare Facility","Community Hospital/ Nursing Home",null,89.2363218832309,13,78.235792361720812,10,74.841288410886733,7,2003,null,null,null,18224,680,3.7313432835820892E-2,0,"Others","","",""]
["APEX HARMONY LODGE","10 PASIR RIS WALK, SINGAPORE 518240","Healthcare Facility","Community Hospital/ Nursing Home",null,75.843590631929047,6,79.445378325942343,12,74.190264689578711,6,1999,null,null,null,7216,586,8.1208425720620842E-2,0,"Others","","",""]
["ALL SAINTS HOME (YISHUN)","551 YISHUN RING ROAD, SINGAPORE 768681","Healthcare Facility","Community Hospital/ Nursing Home",null,74.503759064673673,5,69.98207784519758,5,70.063741305313016,5,2014,null,null,null,6757,389,5.7569927482610625E-2,0,"Others","","",""]
["SAINT JOSEPH'S HOME","36 JURONG WEST STREET 24, SINGAPORE 648141","Healthcare Facility","Community Hospital/ Nursing Home",null,64.308520903237508,2,67.197409993651945,4,69.487253106012503,4,2017,null,null,null,22054,3010,0.13648317765484719,0,"Others","","",""]
["NTUC HEALTH (PASIR RIS) - NURSING HOME","12 PASIR RIS WALK, SINGAPORE 518063","Healthcare Facility","Community Hospital/ Nursing Home",null,"","",2.970440845377297,1,45.338190137264874,3,2021,null,null,null,13769,1459,0.10596266976541506,0,"Others","","",""]
["SAINT THERESA'S HOME","49 UPPER THOMSON ROAD\nSINGAPORE 574325, SINGAPORE 574325","Healthcare Facility","Community Hospital/ Nursing Home",null,35.726030610675281,1,35.346873557914165,3,34.656537455776032,2,1939,null,null,null,13002,360,2.7688047992616521E-2,0,"Others","","",""]
["AWWA HOME AND DAY ACITIVITY CENTRE","5 PASIR RIS STREET 22, SINGAPORE 518064","Healthcare Facility","Community Hospital/ Nursing Home",null,"","","","",24.044414481441592,1,2022,"Gold",2022,"New Non-Residential Buildings (NRB: 2015) (R3)",11169.33,500,4.4765442510875768E-2,0,"Others","","",""]
[]
["note: includes buildings without completed submissions in 2022, buildings without EUI or EUI Quartile/Ranking are buildings that were not benchmarked, or EUI which was combined under the main building"]

{"sheet":"Educational Institution","index":5,"n_rows":148,"n_cols":24,"rows_kept":148,"cut":false,"hidden":false,"merged":[]}
["Building Name","Address","Building Type","Main Function","Building Size","2020 EUI","2020 EUI Quartile/ Energy Ranking","2021 EUI","2021 EUI Quartile/ Energy Ranking","2022 EUI","2022 EUI Quartile/ Energy Ranking","TOP/CSC Year","Award (Green/Non-Green)","Year of GM Award","Green Mark Version","GFA","AC Area","AC Area Percentage","No. Of Hotel Room","AC Type","Age  of Chiller","Air-con system efficiency (kW/RT)","Date of Last Audit/Health Check","Reason for High EUI (if any)"]
["LEE KONG CHIAN SCHOOL OF MEDICINE (CLINICAL SCIENCES BUILDING)","11 MANDALAY ROAD, SINGAPORE 308232","Educational Institution","Univerisity",null,303.63874150564675,11,304.18859036057171,11,293.66086430799737,11,2018,"Platinum",2019,"Existing Building for Non-Residential buildings (version 3)",41351,32462,0.78503542840560081,0,"Water Cooled Chilled Water Plant",2017,0.61399999999999999,"2018-05-04"]
["YONG PUNG HOW SCHOOL OF LAW","55 ARMENIAN STREET, SINGAPORE 179943","Educational Institution","Univerisity",null,123.45335005144032,7,130.13077117626887,7,184.68191915294923,10,2016,null,null,null,23328,1441453,61.790680727023322,0,"Water Cooled Chilled Water Plant",6,0.60699999999999998,"2020-05-20"]
["SINGAPORE INSTITUTE OF TECHNOLOGY (SIT@DOVER)","10 DOVER DRIVE, SINGAPORE 138683","Educational Institution","Univerisity",null,159.37647770534551,9,164.01719217731423,9,182.94126101694917,9,2014,null,null,null,19175,16699,0.87087353324641459,0,"Water Cooled Chilled Water Plant",20,"",""]
["SINGAPORE UNIVERSITY OF TECHNOLOGY & DESIGN (SUTD)","8 SOMAPAH ROAD, SINGAPORE 487372","Educational Institution","Univerisity",null,166.81403425612791,10,174.41539429186076,10,180.09409952325825,8,2014,"GoldPlus",2022,"GM:2021 In Operation",100637,54191,0.53847988314437034,0,"Water Cooled Chilled Water Plant",7,0.65,"2023-06-01"]
["SINGAPORE INSTITUTE OF MANAGEMENT","461 CLEMENTI ROAD, SINGAPORE 599491","Educational Institution","Univerisity",null,146.74902154513003,8,144.10236486486485,8,161.41688551759307,7,1999,null,null,null,78440,74944,0.95543090260071395,0,"Water Cooled Chilled Water Plant",7,0.63200000000000001,"2022-04-28"]
["SINGAPORE INSTITUTE OF MANAGEMENT NAMLY CAMPUS","41 NAMLY AVENUE, SINGAPORE 267616","Educational Institution","Univerisity",null,107.13225678227168,6,125.34228957567325,6,131.91843386664016,6,1988,null,null,null,10063,1503,0.14935903806022061,0,"Water-Cooled Package Units","","",""]
["SINGAPORE MANAGEMENT UNIVERSITY","50 STAMFORD ROAD, SINGAPORE 178899","Educational Institution","Univerisity",null,105.54457049425085,5,110.03095391858247,5,123.57458819239032,5,2005,"Platinum",2018,"Existing Building for Non-Residential buildings (version 3)",102750,69060,0.67211678832116784,0,"Water Cooled Chilled Water Plant",7,0.53,"2021-06-03"]
["SIT@SP BUILDING","510 DOVER ROAD, SINGAPORE 139660","Educational Institution","Univerisity",null,94.251534328358218,4,93.93304626865671,4,93.597762686567165,4,2015,"Platinum",2020,"New Building for Non-Residential buildings (version 4)",20100,9769,0.48601990049751242,0,"Water Cooled Chilled Water Plant",6,0.63600000000000001,"2019-01-30"]
["SINGAPORE INSTITUTE OF TECHNOLOGY (SIT@TP)","29BTAMPINES AVENUE 1, SINGAPORE 528694","Educational Institution","Univerisity",null,77.831165381319622,3,76.817917737789202,3,74.436409597257935,3,2014,"Platinum",2020,"New Building for Non-Residential buildings (version 4)",11670,6113,0.52382176520994006,0,"Water Cooled Chilled Water Plant",9,0.56999999999999995,"2019-06-12"]
["NATIONAL INSTITUE OF EDUCATION","1 NANYANG WALK, SINGAPORE 637616, SINGAPORE 637616","Educational Institution","Univerisity",null,70.43980179701596,2,71.433463697896158,2,72.23878696842857,2,2000,"Platinum",2017,"Existing Building for Non-Residential buildings (version 3)",109181,60000,0.54954616645753385,0,"Water Cooled Chilled Water Plant",7,0.6,"2021-08-20"]
["JAMES COOK UNIVERSITY PTE. LTD.","149 SIMS DRIVE, SINGAPORE 387380, SINGAPORE 387380","Educational Institution","Univerisity",null,52.806706130728159,1,53.74137310096453,1,62.80813014861117,1,2015,null,null,null,24157,7907,0.32731713375005173,0,"Others","",0.73,"2015-04-20"]
["TEMASEK LIFE SCIENCES LABORATORY","1 RESEARCH LINK, NUS, SINGAPORE 117604","Educational Institution","Univerisity",null,null,"",null,"",null,"",1998,null,null,null,20335,14851,0.73031718711581017,0,"Water Cooled Chilled Water Plant",19,"",""]
["SIT@NP","537 CLEMENTI ROAD, SINGAPORE 599493","Educational Institution","Univerisity",null,null,"",null,"",null,"",2014,"Platinum",2020,"New Building for Non-Residential buildings (version 4)",15063,7153,0.47487220341233488,0,"Water Cooled Chilled Water Plant",8,0.62,"2019-06-16"]
["SIT@NYP","172A ANG MO KIO AVENUE 8, SINGAPORE 567739","Educational Institution","Univerisity",null,null,"",null,"",null,"",2015,"Platinum",2020,"Existing Building for Non-Residential buildings (version 3)",15931,12745,0.80001255413972761,280,"Water Cooled Chilled Water Plant",8,0.62,"2020-01-08"]
["N/A","21 NANYANG LINK, SINGAPORE 637371","Educational Institution","Univerisity",null,null,null,null,null,null,null,2008,"Platinum",2020,"Existing Non-Residental Buildings ENRB: 2017",44151,39883,0.90333174786528048,0,"District Cooling System (DCS)","",0.74,"2010-07-01"]
["N/A","31 NANYANG LINK, SINGAPORE 637718","Educational Institution","Univerisity",null,null,"",null,"",null,"",1997,"Platinum",2018,"Existing Building for Non-Residential buildings (version 3)",10260,9113,0.88820662768031189,0,"Water Cooled Chilled Water Plant",3,0.64200000000000002,"2018-02-26"]
["NIL","36 NANYANG AVENUE, SINGAPORE 639801","Educational Institution","Univerisity",null,null,"",null,"",null,"",1958,null,null,null,1190,974,0.81848739495798317,0,"Others","","",""]
["NIL","42 NANYANG AVENUE, SINGAPORE 639815","Educational Institution","Univerisity",null,null,"",null,"",null,"",1966,"Platinum",2020,"Existing Building for Non-Residential buildings (version 3)",7440,6305,0.84744623655913975,0,"Water Cooled Chilled Water Plant",3,0.64,"2015-01-23"]
["NIL","46 NANYANG AVENUE, SINGAPORE 639817","Educational Institution","Univerisity",null,null,"",null,"",null,"",1954,"Platinum",2020,"Existing Non-Residental Buildings ENRB: 2017",3186,2389,0.74984306340238549,0,"Others","","",""]
["NIL","48 NANYANG AVENUE, SINGAPORE 639818","Educational Institution","Univerisity",null,null,"",null,"",null,"",2009,"Platinum",2019,"Existing Building for Non-Residential buildings (version 3)",15420,14000,0.90791180285343709,0,"Water Cooled Chilled Water Plant",7,0.64,"2019-02-24"]
["NIL","50 NANYANG DRIVE, SINGAPORE 637553","Educational Institution","Univerisity",null,null,"",null,"",null,"",2003,"Platinum",2018,"Existing Building for Non-Residential buildings (version 3)",20792,14887,0.71599653712966527,0,"Water Cooled Chilled Water Plant",3,0.63,"2015-03-25"]
["NIL","50 NANYANG VIEW, SINGAPORE 639667","Educational Institution","Univerisity",null,null,"",null,"",null,"",1986,"Platinum",2020,"Existing Non-Residental Buildings ENRB: 2017",3356,1542,0.45947556615017876,0,"Others","","",""]
["NIL","52 NANYANG AVENUE, SINGAPORE 639816","Educational Institution","Univerisity",null,null,"",null,"",null,"",2015,"Platinum",2016,"New Building for Non-Residential buildings (version 4.1)",15273,5216,0.34151771099325606,0,"Water Cooled Chilled Water Plant",2,0.67,"2022-11-02"]
["SINGAPORE MANAGEMENT UNIVERSITY","81 VICTORIA STREET, SINGAPORE 188065","Educational Institution","Univerisity",null,null,"",null,"",null,"",2005,"Platinum",2022,"Existing Non-Residential Buildings (RECERT 2017)",22071.03,19804,0.8972848118098703,0,"Water Cooled Chilled Water Plant",9,0.56499999999999995,"2022-10-31"]
["NIL","60 NANYANG DRIVE, SINGAPORE 637551","Educational Institution","Univerisity",null,null,"",null,"",null,"",2004,"Platinum",2020,"Existing Building for Non-Residential buildings (version 3)",37181,36185,0.97321212447217664,0,"Water Cooled Chilled Water Plant",2,0.65,"2014-10-03"]
["NIL","60 NANYANG VIEW, SINGAPORE 639673","Educational Institution","Univerisity",null,null,"",null,"",null,"",2003,"Platinum",2018,"Existing Building for Non-Residential buildings (version 3)",18322,16500,0.90055670778299313,170,"Water Cooled Chilled Water Plant",6,0.65,"2018-04-13"]
["NIL","62 NANYANG DRIVE, SINGAPORE 637459","Educational Institution","Univerisity",null,null,"",null,"",null,"",2006,"Platinum",2020,"Existing Building for Non-Residential buildings (version 3)",19282,15279,0.79239705424748474,0,"Water Cooled Chilled Water Plant",2,0.63,"2014-12-03"]
["NIL","65 NANYANG DRIVE, SINGAPORE 637460","Educational Institution","Univerisity",null,null,"",null,"",null,"",2007,"Platinum",2020,"Existing Building for Non-Residential buildings (version 3)",14798,10896,0.73631571834031628,0,"Water Cooled Chilled Water Plant",11,0.64,"2018-12-21"]
["NIL","70 NANYANG DRIVE, SINGAPORE 637457","Educational Institution","Univerisity",null,null,"",null,"",null,"",2006,"Platinum",2020,"Existing Building for Non-Residential buildings (version 3)",11706,6267,0.53536647872885701,0,"Water Cooled Chilled Water Plant",10,0.63,"2014-10-03"]
["NIL","76 NANYANG DRIVE, SINGAPORE 637331","Educational Institution","Univerisity",null,null,"",null,"",null,"",2008,"Platinum",2022,"GM:2021 In Operation",15484,10408,0.67217773185223462,0,"Water Cooled Chilled Water Plant",2,0.59299999999999997,"2019-12-02"]
["NIL","81 NANYANG DRIVE, SINGAPORE 637458","Educational Institution","Univerisity",null,null,"",null,"",null,"",2006,"Platinum",2018,"Existing Building for Non-Residential buildings (version 3)",19039,16826,0.8837649036188876,0,"Water Cooled Chilled Water Plant",10,0.67,"2018-12-05"]
["NTU INNOVATION CENTRE","71 NANYANG DRIVE, SINGAPORE 638075","Educational Institution","Univerisity",null,null,"",null,"",null,"",1993,"Platinum",2023,"GM:2021 In Operation",11606,7455,0.64234016887816647,0,"Water Cooled Chilled Water Plant",4,0.52,"2021-11-28"]
["NIL","12 NANYANG HILL, SINGAPORE 637663","Educational Institution","Univerisity",null,null,"",null,"",null,"",1961,"Platinum",2020,"Existing Building for Non-Residential buildings (version 3)",4370,2861,0.65469107551487415,0,"Others","","",""]
["YALE-NUS COLLEGE","16 COLLEGE AVENUE WEST #01-220, SINGAPORE 138527","Educational Institution","Univerisity",null,null,null,null,null,null,null,2016,"Platinum",2021,"New Building for Non-Residential buildings (version 4)",68353,29685,0.43428964346846516,0,"District Cooling System (DCS)","","",""]
["DUKE-NUS MEDICAL SCHOOL","8 COLLEGE ROAD, SINGAPORE 169857","Educational Institution","Univerisity",null,null,"",null,"",null,"",2009,"Certified",2022,"Existing Non-Residential Buildings (RECERT 2017)",28340,20884,0.73690896259703598,0,"Water Cooled Chilled Water Plant",14,0.74,"2016-09-29"]
["EDUCATION RESOURCE CENTRE","8 COLLEGE AVENUE WEST, SINGAPORE 138608","Educational Institution","Univerisity",null,null,null,null,null,null,null,2014,"Platinum",2021,"Existing Building for Non-Residential buildings (version 3)",12835,5605,0.43669653291780286,0,"District Cooling System (DCS)","","",""]
["STEPHEN RIADY CENTRE","2 COLLEGE AVENUE WEST, SINGAPORE 138607","Educational Institution","Univerisity",null,null,null,null,null,null,null,2012,"Platinum",2021,"New Building for Non-Residential buildings (version 3)",23848,16693,0.69997484065749749,0,"District Cooling System (DCS)","","",""]
["NATION UNIVERSITY OF SINGAPORE - BUKIT TIMAH CAMPUS","469 BUKIT TIMAH RD, SINGAPORE 259756","Educational Institution","Univerisity",null,null,"",null,"",null,"",1976,"Gold",2021,"Existing Non-Residental Buildings ENRB: 2017",24475,24240,0.99039836567926454,0,"Water Cooled Chilled Water Plant",2,0.57399999999999995,"2021-02-22"]
["SCHOOL OF COMPUTING BLOCK 3 (COM3)","11 RESEARCH LINK, SINGAPORE 119391","Educational Institution","Univerisity",null,null,null,null,null,null,null,2022,null,null,null,16862,8809,0.52241726960028467,0,"District Cooling System (DCS)","",0.56499999999999995,"2021-03-24"]
["TECHNO EDGE","3A ENGINEERING DRIVE 2, SINGAPORE 117275","Educational Institution","Univerisity",null,null,null,null,null,null,null,2020,null,null,null,7450,8525,1.1442953020134228,0,"District Cooling System (DCS)","",0.53400000000000003,"2021-03-24"]
["UNIVERSITY SPORT CENTRE","2 SPORTS DRIVE, SINGAPORE 117288","Educational Institution","Univerisity",null,null,"",null,"",null,"",2017,null,null,null,9178,714,7.7794726519938989E-2,0,"Others","","",""]
["DESIGN & ENVIRONMENT BLOCK 4","8 ARCHITECTURE DRIVE, SINGAPORE 117356","Educational Institution","Univerisity",null,null,null,null,null,null,null,2018,"Platinum",2022,"GM:2021 In Operation",8333,3362,0.40345613824552984,0,"District Cooling System (DCS)","","",""]
["ENGINEERING BLOCK 2A (EDIC)","6 ENGINEERING DRIVE 4, SINGAPORE 117361","Educational Institution","Univerisity",null,null,null,null,null,null,null,2015,"GoldPlus",2021,"GM:2021 In Operation",2107,1475,0.70004746084480307,0,"District Cooling System (DCS)","","",""]
["YST CONSERVATORY OF MUSIC","3 CONSERVATORY ROAD, SINGAPORE 117376","Educational Institution","Univerisity",null,null,null,null,null,null,null,2006,null,null,null,18083,11295,0.6246198086600675,0,"District Cooling System (DCS)","",0.77500000000000002,"2019-06-12"]
["LEE KONG CHIAN NATURAL HISTORY MUSEUM","2 CONSERVATORY ROAD, SINGAPORE 117377","Educational Institution","Univerisity",null,null,null,null,null,null,null,2014,"Gold",2014,"New Building for Non-Residential buildings (version 4)",8369,5858,0.69996415342334806,0,"District Cooling System (DCS)","",0.77500000000000002,"2019-06-24"]
["TEMASEK LAB","5A ENGINEERING DRIVE, SINGAPORE 117411","Educational Institution","Univerisity",null,null,null,null,null,null,null,2006,"Gold",2016,"Existing Building for Non-Residential buildings (version 2.1)",19587,19487,0.99489457293102568,0,"District Cooling System (DCS)","",0.54149999999999998,"2021-03-24"]
["COMPUTING BLOCK 1","13 COMPUTING DRIVE, SINGAPORE 117417","Educational Institution","Univerisity",null,null,null,null,null,null,null,1980,null,null,null,11734,7243,0.61726606442815746,0,"District Cooling System (DCS)","",0.93500000000000005,"2019-04-16"]
["CENTRE FOR LIFE SCIENCES (CELS)","28 MEDICAL DRIVE, SINGAPORE 117456","Educational Institution","Univerisity",null,null,null,null,null,null,null,2001,"Platinum",2017,"Existing Building for Non-Residential buildings (version 3)",20116,12379,0.61538079140982305,0,"District Cooling System (DCS)","",0.60599999999999998,"2021-12-26"]
["SCIENCE BLOCK 15","1 SCIENCE DRIVE 2, SINGAPORE 117541","Educational Institution","Univerisity",null,null,null,null,null,null,null,1986,null,null,null,6842,4768,0.69687225957322418,0,"District Cooling System (DCS)","",0.60599999999999998,"2021-12-26"]
["SCIENCE BLOCK 14","1 SCIENCE DRIVE 2, SINGAPORE 117542","Educational Institution","Univerisity",null,null,null,null,null,null,null,1986,null,null,null,7163,4750,0.66312997347480107,0,"District Cooling System (DCS)","",0.60599999999999998,"2021-12-26"]
["SCIENCE BLOCK 16","3 SCIENCE DRIVE 2, SINGAPORE 117543","Educational Institution","Univerisity",null,null,null,null,null,null,null,1993,null,null,null,15567,9315,0.59838119098092113,0,"District Cooling System (DCS)","",0.60599999999999998,"2021-12-26"]
["MEDICINE BLOCK 4","5 SCIENCE DRIVE 2, SINGAPORE 117545","Educational Institution","Univerisity",null,null,null,null,null,null,null,1981,"Platinum",2013,"Existing Building for Non-Residential buildings (version 3)",8735,5842,0.6688036634230109,0,"District Cooling System (DCS)","",0.60599999999999998,"2021-12-26"]
["FRONTIER","6 SCIENCE DRIVE 2, SINGAPORE 117546","Educational Institution","Univerisity",null,null,null,null,null,null,null,2016,"Platinum",2021,"GM:2021 In Operation",4801,1761,0.36679858362841072,0,"District Cooling System (DCS)","",0.60599999999999998,"2021-12-26"]
["SCIENCE BLOCK 5","8 SCIENCE DRIVE 2, SINGAPORE 117547","Educational Institution","Univerisity",null,null,null,null,null,null,null,1986,null,null,null,7823,5033,0.6433593250671098,0,"District Cooling System (DCS)","",0.60599999999999998,"2021-12-26"]
["SCIENCE BLOCK 6","10 SCIENCE DRIVE 2, SINGAPORE 117548","Educational Institution","Univerisity",null,null,null,null,null,null,null,1986,null,null,null,9625,3269,0.33963636363636363,0,"District Cooling System (DCS)","",0.60599999999999998,"2021-12-26"]
["MD BLK 1 (TAHIR FOUNDATION BLDG)","12 SCIENCE DRIVE 2, SINGAPORE 117549","Educational Institution","Univerisity",null,null,null,null,null,null,null,2014,"Platinum",2021,"New Building for Non-Residential buildings (version 3)",38448,23333,0.6068716188098211,0,"District Cooling System (DCS)","",0.60599999999999998,"2021-12-26"]
["NANYANG TECHNOLOGICAL UNIVERSITY – ACADEMIC BUILDINGS","50 NANYANG AVE, SINGAPORE 639798","Educational Institution","Univerisity",null,null,"",null,"",null,"",1986,"Platinum",2020,"Existing Building for Non-Residential buildings (version 3)",738667,517068,0.70000148916900307,0,"Water Cooled Chilled Water Plant","",0.65,"2019-02-19"]
["SCIENCE BLOCK 12","2 SCIENCE DRIVE 3, SINGAPORE 117551","Educational Institution","Univerisity",null,null,null,null,null,null,null,1981,null,null,null,5141,3067,0.5965765415288854,0,"District Cooling System (DCS)","",0.60599999999999998,"2023-12-26"]
["SCIENCE BLOCK 8","3 SCIENCE DRIVE 3, SINGAPORE 117552","Educational Institution","Univerisity",null,null,null,null,null,null,null,1981,null,null,null,5678,3106,0.54702359985910531,0,"District Cooling System (DCS)","",0.60599999999999998,"2021-12-26"]
["SCIENCE BLOCK 11","4 SCIENCE DRIVE 3, SINGAPORE 117553","Educational Institution","Univerisity",null,null,null,null,null,null,null,1981,null,null,null,3163,2218,0.70123300663926647,0,"District Cooling System (DCS)","",0.60599999999999998,"2021-12-26"]
["SCIENCE BLOCK 7","6 SCIENCE DRIVE 3, SINGAPORE 117554","Educational Institution","Univerisity",null,null,null,null,null,null,null,1981,null,null,null,4658,3269,0.70180334907685704,0,"District Cooling System (DCS)","",0.60599999999999998,"2021-12-26"]
["SCIENCE BLOCK 1A","10 SCIENCE PARK DRIVE 4, SINGAPORE 117555","Educational Institution","Univerisity",null,null,null,null,null,null,null,1991,null,null,null,10531,7493,0.71151837432342613,0,"District Cooling System (DCS)","",0.60599999999999998,"2021-12-26"]
["CTR FOR ENGLISH LANGUAGE COMMUNICATION","10 ARCHITECTURE DRIVE, SINGAPORE 117511","Educational Institution","Univerisity",null,null,null,null,null,null,null,2003,null,null,null,3103,3103,1,0,"District Cooling System (DCS)","",0.53400000000000003,"2021-03-24"]
["SCIENCE BLOCK 1","12 SCIENCE DRIVE 4, SINGAPORE 117556","Educational Institution","Univerisity",null,null,null,null,null,null,null,1981,null,null,null,1180,763,0.64661016949152539,0,"District Cooling System (DCS)","",0.60599999999999998,"2021-12-24"]
["SCIENCE BLOCK 2","14 SCIENCE DRIVE 4, SINGAPORE 117557","Educational Institution","Univerisity",null,null,null,null,null,null,null,1981,null,null,null,5047,3471,0.68773528829007335,0,"District Cooling System (DCS)","",0.60599999999999998,"2021-12-24"]
["SCIENCE BLOCK 3","16 SCIENCE DRIVE 4, SINGAPORE 117558","Educational Institution","Univerisity",null,null,null,null,null,null,null,1981,null,null,null,6492,3694,0.56900800985828714,0,"District Cooling System (DCS)","",0.60599999999999998,"2021-12-24"]
["SCIENCE BLOCK 4","18 SCIENCE DRIVE 4, SINGAPORE 117559","Educational Institution","Univerisity",null,null,null,null,null,null,null,1981,null,null,null,4553,2978,0.65407423676696685,0,"District Cooling System (DCS)","",0.60599999999999998,"2021-12-24"]
["SCIENCE BLOCK 4A","20 SCIENCE DRIVE 4, SINGAPORE 117560","Educational Institution","Univerisity",null,null,null,null,null,null,null,1996,null,null,null,2347,1553,0.66169578184916911,0,"District Cooling System (DCS)","",0.60599999999999998,"2021-12-24"]
["MEDICINE BLOCK 9","2 MEDICAL DRIVE, SINGAPORE 117593","Educational Institution","Univerisity",null,null,null,null,null,null,null,1981,"Platinum",2013,"Existing Building for Non-Residential buildings (version 3)",4307,2593,0.60204318551195724,0,"District Cooling System (DCS)","",0.60599999999999998,"2021-12-24"]
["MEDICINE BLOCK 10","4 MEDICAL DRIVE, SINGAPORE 117594","Educational Institution","Univerisity",null,null,null,null,null,null,null,1981,"Platinum",2021,"Existing Non-Residental Buildings ENRB: 2017",4289,3200,0.74609466076008391,0,"District Cooling System (DCS)","",0.60599999999999998,"2021-12-24"]
["MEDICINE BLOCK 7","8 MEDICAL DRIVE, SINGAPORE 117596","Educational Institution","Univerisity",null,null,null,null,null,null,null,1981,"Gold",2021,"Existing Non-Residental Buildings ENRB: 2017",5084,3494,0.68725413060582219,0,"District Cooling System (DCS)","",0.60599999999999998,"2021-12-24"]
["MEDICINE BLOCK 11","10 MEDICAL DRIVE, SINGAPORE 117597","Educational Institution","Univerisity",null,null,null,null,null,null,null,1995,"Platinum",2015,"Existing Building for Non-Residential buildings (version 3)",16437,11592,0.70523818215002743,0,"District Cooling System (DCS)","",0.60599999999999998,"2021-12-24"]
["MD BLK 6 (CTR FOR TRANS MED)","14 MEDICAL DRIVE, SINGAPORE 117599","Educational Institution","Univerisity",null,null,null,null,null,null,null,2011,"Gold",2021,"Existing Non-Residental Buildings ENRB: 2017",40764,23758,0.58281817289765481,0,"District Cooling System (DCS)","",0.60599999999999998,"2021-12-24"]
["MEDICINE BLOCK 3","16 MEDICAL DRIVE, SINGAPORE 117600","Educational Institution","Univerisity",null,null,null,null,null,null,null,1997,"Platinum",2021,"Existing Non-Residental Buildings ENRB: 2017",5910,3633,0.61472081218274111,0,"District Cooling System (DCS)","",0.60599999999999998,"2021-12-24"]
["MEDICINE BLOCK 2","18 MEDICAL DRIVE, SINGAPORE 117601","Educational Institution","Univerisity",null,null,null,null,null,null,null,2008,"Platinum",2021,"Existing Non-Residental Buildings ENRB: 2017",7373,3708,0.50291604502916043,0,"District Cooling System (DCS)","",0.60599999999999998,"2021-12-24"]
["SCIENCE BLOCK 17","10 LOWER KENT RIDGE ROAD, SINGAPORE 119076","Educational Institution","Univerisity",null,null,null,null,null,null,null,1998,null,null,null,10454,6597,0.63105031566864356,0,"District Cooling System (DCS)","",0.60599999999999998,"2021-12-24"]
["DESIGN & ENVIRONMENT BLOCK 1","4 ARCHITECTURE DRIVE, SINGAPORE 117566","Educational Institution","Univerisity",null,null,null,null,null,null,null,2021,"Platinum",2022,"GM:2021 In Operation",5717,4758,0.83225467902746197,0,"District Cooling System (DCS)","",0.53400000000000003,"2021-03-24"]
["DESIGN & ENVIRONMENT BLOCK 2","2 ARCHITECTURE DRIVE, SINGAPORE 117565","Educational Institution","Univerisity",null,null,null,null,null,null,null,1976,null,null,null,5617,3546,0.63129784582517356,0,"District Cooling System (DCS)","",0.53400000000000003,"2021-03-24"]
["ENGINEERING BLOCK 3A","7 ENGINEERING DRIVE 1, SINGAPORE 117574","Educational Institution","Univerisity",null,null,null,null,null,null,null,1999,null,null,null,12130,9035,0.74484748557295966,0,"District Cooling System (DCS)","",0.53400000000000003,"2021-03-24"]
["ENGINEERING BLOCK A (EA)","9 ENGINEERING DRIVE 1, SINGAPORE 117575","Educational Institution","Univerisity",null,null,null,null,null,null,null,1999,"Platinum",2022,"GM:2021 In Operation",19178,11559,0.60272186880800915,0,"District Cooling System (DCS)","",0.53400000000000003,"2021-03-24"]
["ENGINEERING BLOCK 1A","1 ENGINEERING DRIVE 2, SINGAPORE 117576","Educational Institution","Univerisity",null,null,null,null,null,null,null,1999,"GoldPlus",2020,"GM NRB: 2015",7584,5115,0.67444620253164556,0,"District Cooling System (DCS)","",0.53400000000000003,"2021-03-24"]
["ENGINEERING WORKSHOP 1","2 ENGINEERING DRIVE 2, SINGAPORE 117577","Educational Institution","Univerisity",null,null,"",null,"",null,"",1976,null,null,null,8948,4815,0.53810907465355384,0,"Others","","",""]
["ENGINEERING BLOCK 1","3 ENGINEERING DRIVE 2, SINGAPORE 117578","Educational Institution","Univerisity",null,null,null,null,null,null,null,1976,null,null,null,12453,11560,0.92829037179796037,0,"District Cooling System (DCS)","",0.53400000000000003,"2021-03-24"]
["ENGINEERING BLOCK 2","5 ENGINEERING DRIVE 2, SINGAPORE 117579","Educational Institution","Univerisity",null,null,null,null,null,null,null,1976,null,null,null,8663,5119,0.59090384393397211,0,"District Cooling System (DCS)","",0.53400000000000003,"2021-03-24"]
["ENGINEERING BLOCK 8","1 ENGINEERING DRIVE 3, SINGAPORE 117580","Educational Institution","Univerisity",null,null,null,null,null,null,null,2021,"Platinum",2022,"GM:2021 In Operation",15737,10079,0.64046514583465719,0,"District Cooling System (DCS)","",0.53400000000000003,"2021-03-24"]
["ENGINEERING BLOCK 3","2 ENGINEERING DRIVE 3, SINGAPORE 117581","Educational Institution","Univerisity",null,null,null,null,null,null,null,1976,null,null,null,9395,7438,0.79169771154869617,0,"District Cooling System (DCS)","",0.53400000000000003,"2021-03-24"]
["ENGINEERING BLOCK 4A","3 ENGINEERING DRIVE 3, SINGAPORE 117582","Educational Institution","Univerisity",null,null,null,null,null,null,null,1998,null,null,null,8318,5821,0.69980764606876655,0,"District Cooling System (DCS)","",0.53400000000000003,"2021-03-24"]
["ENGINEERING BLOCK 4","4 ENGINEERING DRIVE 3, SINGAPORE 117583","Educational Institution","Univerisity",null,null,null,null,null,null,null,1976,"Platinum",2019,"Existing Non-Residental Buildings ENRB: 2017",19015,11218,0.58995529844859318,0,"District Cooling System (DCS)","",0.53400000000000003,"2021-03-24"]
["ENGINEERING BLOCK 5","4 ENGINEERING DRIVE 4, SINGAPORE 117585","Educational Institution","Univerisity",null,null,null,null,null,null,null,1976,null,null,null,9410,5755,0.61158342189160464,0,"District Cooling System (DCS)","",0.53400000000000003,"2021-03-24"]
["ENGINEERING BLOCK 6","5 ENGINEERING DRIVE 1, SINGAPORE 117608","Educational Institution","Univerisity",null,null,null,null,null,null,null,2009,"Platinum",2018,"Existing Building for Non-Residential buildings (version 3)",12289,9622,0.78297664578077952,0,"District Cooling System (DCS)","",0.53400000000000003,"2021-03-24"]
["ARTS & SOCIAL SCIENCES BLOCK 2","ARTS & SOCIAL SCIENCES BLOCK 2, SINGAPORE 117568","Educational Institution","Univerisity",null,null,null,null,null,null,null,1980,null,null,null,7971,3922,0.49203362187931249,0,"District Cooling System (DCS)","",0.56999999999999995,"2021-03-24"]
["FASS BLK7 (SHAW FDN BLDG)","5 ARTS LINK, SINGAPORE 117570","Educational Institution","Univerisity",null,null,null,null,null,null,null,1993,null,null,null,8164,5214,0.63865752082312588,0,"District Cooling System (DCS)","",0.56999999999999995,"2021-03-24"]
["ARTS & SOCIAL SCIENCES BLOCK 5","7 ARTS LINK, SINGAPORE 117571","Educational Institution","Univerisity",null,null,null,null,null,null,null,1981,null,null,null,6413,2637,0.41119600810852958,0,"District Cooling System (DCS)","",0.56999999999999995,"2021-03-24"]
["ARTS & SOCIAL SCIENCES BLOCK 4","9 ARTS LINK, SINGAPORE 117572","Educational Institution","Univerisity",null,null,null,null,null,null,null,1980,null,null,null,7530,4038,0.53625498007968131,0,"District Cooling System (DCS)","",0.56999999999999995,"2021-03-24"]
["ARTS & SOCIAL SCIENCES BLOCK 1","11 ARTS LINK, SINGAPORE 117573","Educational Institution","Univerisity",null,null,null,null,null,null,null,1980,null,null,null,6770,3777,0.55790251107828659,0,"District Cooling System (DCS)","",0.56999999999999995,"2021-03-24"]
["INNOVATION 4.0","3 RESEARCH LINK, SINGAPORE 117602","Educational Institution","Univerisity",null,null,null,null,null,null,null,1999,"Platinum",2017,"Existing Building for Non-Residential buildings (version 3)",16206,12320,0.76021226706158218,0,"District Cooling System (DCS)","",0.56999999999999995,"2021-03-24"]
["SHAW FOUNDATION ALUMNI HOUSE (SFAH)","11 KENT RIDGE DRIVE, SINGAPORE 119244","Educational Institution","Univerisity",null,null,null,null,null,null,null,2010,null,null,null,11709,7977,0.68127081732001027,0,"District Cooling System (DCS)","",0.56999999999999995,"2021-03-24"]
["ARTS & SOCIAL SCIENCES BLOCK 8 (AS8)","10 KENT RIDGE CRESCENT, SINGAPORE 119260","Educational Institution","Univerisity",null,null,null,null,null,null,null,2016,"Platinum",2014,"New Building for Non-Residential buildings (version 4.1)",10475,4827,0.46081145584725536,0,"District Cooling System (DCS)","",0.56999999999999995,"2021-03-24"]
["VENTUS (UNI CAMPUS INFRA)","8 KENT RIDGE DRIVE, SINGAPORE 119246","Educational Institution","Univerisity",null,null,null,null,null,null,null,2013,"Platinum",2013,"New Building for Non-Residential buildings (version 4)",5256,27982801,5323.9727929984783,0,"District Cooling System (DCS)","",0.56999999999999995,"2021-03-24"]
["BUSINESS BLOCK 1-MOCHTAR RIADY","15 KENT RIDGE DRIVE, SINGAPORE 119245","Educational Institution","Univerisity",null,null,null,null,null,null,null,2009,"Gold",2015,"Existing Building for Non-Residential buildings (version 3)",16626,13545,0.81468783832551428,0,"District Cooling System (DCS)","",0.93500000000000005,"2019-04-16"]
["ICUBE, I3","21 HENG MUI KENG TERRACE, SINGAPORE 119613","Educational Institution","Univerisity",null,null,"",null,"",null,"",1984,null,null,null,14464,11559,0.79915652654867253,0,"Water Cooled Chilled Water Plant",25,"",""]
["INSTITUTE OF SYSTEMS SCIENCE","25 HENG MUI KENG TERRACE, SINGAPORE 119615","Educational Institution","Univerisity",null,null,"",null,"",null,"",2001,"Platinum",2020,"Existing Building for Non-Residential buildings (version 3)",6462,5323,0.82373878056329308,0,"Others","","",""]
["TECH CTR FOR OFFSHORE & MARINE (TCOMS)","12 PRINCE GEORGE'S PARK, SINGAPORE 118411","Educational Institution","Univerisity",null,null,"",null,"",null,"",2018,"Platinum",2017,"New Building for Non-Residential buildings (version 4.1)",12799,5620,0.43909680443784671,0,"Others","","",""]
["UNIVERSITY HALL","21 LOWER KENT RIDGE ROAD, SINGAPORE 119077","Educational Institution","Univerisity",null,null,null,null,null,null,null,2005,"Platinum",2021,"Existing Non-Residental Buildings ENRB: 2017",21645,17647,0.81529221529221529,0,"District Cooling System (DCS)","",0.69699999999999995,"2021-11-01"]
["UNIVERSITY CULTURAL CENTRE (UCC)","50 KENT RIDGE CRESCENT, SINGAPORE 119279","Educational Institution","Univerisity",null,null,null,null,null,null,null,2000,"Certified",2018,"Existing Building for Non-Residential buildings (version 3)",23819,10009,0.42021075611906461,0,"District Cooling System (DCS)","",0.77500000000000002,"2019-06-14"]
["CENTRAL LIBRARY","12 KENT RIDGE CRESCENT, SINGAPORE 119275","Educational Institution","Univerisity",null,null,null,null,null,null,null,2021,null,null,null,26036,18347,0.70467813796282075,0,"District Cooling System (DCS)","",0.56999999999999995,"2021-03-24"]
["CENTRAL STORAGE LIBRARY ANNEX","15 KENT RIDGE ROAD, SINGAPORE 119225","Educational Institution","Univerisity",null,null,null,null,null,null,null,1977,null,null,null,6819,5057,0.74160434081243587,0,"District Cooling System (DCS)","",0.56999999999999995,"2021-03-24"]
["CTR FOR THE ARTS (CFA)","17 KENT RIDGE CRESCENT, SINGAPORE 119277","Educational Institution","Univerisity",null,null,"",null,"",null,"",1985,null,null,null,3143,2500,0.79541839007317849,0,"Others","","",""]
["UNIVERSITY HEALTH CENTRE","20 LOWER KENT RIDGE ROAD, SINGAPORE 119080","Educational Institution","Univerisity",null,null,"",null,"",null,"",1979,null,null,null,3744,2809,0.75026709401709402,0,"Others","","",""]
["S'PORE SYNCHROTRON LIGHTSOURCE","5 RESEARCH LINK, SINGAPORE 117603","Educational Institution","Univerisity",null,null,null,null,null,null,null,1999,null,null,null,2372,1365,0.57546374367622255,0,"District Cooling System (DCS)","",0.56999999999999995,"2021-03-24"]
["S2S (CRISP)","18 KENT RIDGE ROAD, SINGAPORE 119227","Educational Institution","Univerisity",null,null,"",null,"",null,"",2009,null,null,null,2056,1492,0.72568093385214005,0,"Others","","",""]
["INSTITUTE OF MATHEMATICAL SCIENCE","3 & 4  PRINCE GEORGES PARK, SINGAPORE 118402","Educational Institution","Univerisity",null,null,"",null,"",null,"",1950,null,null,null,995,897,0.90150753768844216,0,"Others","","",""]
["17 & 18 - OFFICE OF CAMPUS SECURITY HQ","17 & 18 PRINCE GEORGE'S PARK, SINGAPORE 118416","Educational Institution","Univerisity",null,null,"",null,"",null,"",1950,null,null,null,775,933,1.2038709677419355,0,"Others","","",""]
["12A KR BUNGALOW - TROPICAL MARINE SCIENCE INSTITUTE","12A KENT RIDGE ROAD, SINGAPORE 119222","Educational Institution","Univerisity",null,null,"",null,"",null,"",1950,null,null,null,264,264,1,0,"Others","","",""]
["SHATEC","21 BUKIT BATOK STREET 22, SINGAPORE 659589","Educational Institution","ITE/ Polytechnic",null,136.03858883583072,9,168.30824962950766,9,144.85991272847028,10,1995,null,null,null,6073,4500,0.74098468631648284,0,"Others","","",""]
["NANYANG POLYTECHNIC","180 ANG MO KIO AVE 8, SINGAPORE 569830","Educational Institution","ITE/ Polytechnic",null,117.88431093252829,7,121.96434721602142,7,126.45799406141265,9,1998,"Platinum",2022,"Existing Non-Residential Buildings (RECERT 2017)",266291,170816,0.64146366193374915,0,"Water Cooled Chilled Water Plant",4,0.65,"2022-09-01"]
["NANYANG ACADEMY OF FINE ARTS - CAMPUS 1","80 BENCOOLEN STREET, SINGAPORE 189655","Educational Institution","ITE/ Polytechnic",null,125.4801886296418,8,127.63009749151057,8,123.29580698871726,8,2004,"Gold",2012,"Existing Building for Non-Residential buildings (version 2.1)",29128,20000,0.68662455369404007,0,"Water Cooled Chilled Water Plant",1,0.65,"2017-05-05"]
["ITE COLLEGE WEST","1 CHOA CHU KANG GROVE, SINGAPORE 688236","Educational Institution","ITE/ Polytechnic",null,"","","","",106.53843638890024,7,44995,"Platinum",2022,"Existing Non-Residential Buildings (RECERT 2017)",97876,80133,0.81871960439740077,22,"Water Cooled Chilled Water Plant",12,0.65,"2022-11-15"]
["SINGAPORE POLYTECHNIC","500, DOVER ROAD, SINGAPORE 139651","Educational Institution","ITE/ Polytechnic",null,101.89814571369266,4,99.662734380405453,5,103.33660831661247,6,1978,"Platinum",2022,"Existing Non-Residental Buildings ENRB: 2017",289060,15000,5.1892340690514079E-2,0,"Water Cooled Chilled Water Plant",1978,0,"2023-01-01"]
["ITE HEADQUARTERS & COLLEGE CENTRAL","2 ANG MO KIO DRIVE, SINGAPORE 567720","Educational Institution","ITE/ Polytechnic",null,91.006648653414302,3,95.151565441523488,3,100.42314893087371,5,2012,"Platinum",2017,"Existing Building for Non-Residential buildings (version 3)",192821,131450,0.68172035203634462,0,"Water Cooled Chilled Water Plant",10,0.6,"2020-10-22"]
["TEMASEK POLYTECHNIC","21 TAMPINES AVE 1, SINGAPORE 529757","Educational Institution","ITE/ Polytechnic",null,101.97585511392207,5,102.17000312880624,6,94.390752980746669,3,1995,"Platinum",2022,"New Non-Residential Buildings (NRB: 2015) (R3)",357964,190744,0.53285805276508247,0,"Water Cooled Chilled Water Plant",1,"",""]
["REPUBLIC POLYTECHNIC","W2 - 9 WOODLANDS AVE 9, SINGAPORE 738964","Educational Institution","ITE/ Polytechnic",null,107,6,98,4,94,4,2005,"Platinum",2021,"Existing Non-Residental Buildings ENRB: 2017",256082,8098,3.1622683359236493E-2,0,"Water Cooled Chilled Water Plant","","",""]
["ITE COLLEGE EAST","10 SIMEI AVENUE, SINGAPORE 486047, SINGAPORE 486047","Educational Institution","ITE/ Polytechnic",null,75.42998604551309,2,74.679399497025088,2,76.528614365454217,2,2004,"Platinum",2022,"Existing Non-Residential Buildings (RECERT 2017)",130424,71430,0.54767527448935782,0,"Water Cooled Chilled Water Plant",5,0.57399999999999995,"2020-07-31"]
["NGEE ANN POLYTECHNIC","535 CLEMENTI ROAD, SINGAPORE 599489","Educational Institution","ITE/ Polytechnic",null,60.877858705680765,1,59.239277975484384,1,62.617447212336899,1,1963,"GoldPlus",2022,"Existing Non-Residential Buildings (ENRB: 2017)",364287,154343,0.42368517130723854,0,"Water Cooled Chilled Water Plant",7,0.7,"2023-02-27"]
["NANYANG ACADEMY OF FINE ARTS - CAMPUS 2","38 BENCOOLEN STREET, SINGAPORE 189654","Educational Institution","ITE/ Polytechnic",null,null,"",null,"",null,"",2004,"GoldPlus",2022,"Existing Non-Residental Buildings ENRB: 2017",4930,2053,0.41643002028397563,0,"Others","","",""]
["NANYANG ACADEMY OF FINE ARTS - CAMPUS 3","151 BENCOOLEN STREET, SINGAPORE 189656","Educational Institution","ITE/ Polytechnic",null,null,"",null,"",null,"",2004,"Platinum",2014,"Existing Building for Non-Residential buildings (version 3)",11587,6305,0.54414429964615518,0,"Water Cooled Chilled Water Plant",7,"",""]
["501 STIRLING ROAD","501 STIRLING ROAD, SINGAPORE 148951","Educational Institution","Private School",null,102.73756,10,78.802880000000002,8,212.91983999999999,19,2005,"GoldPlus",2013,"New Building for Non-Residential buildings (version 4)",25000,19000,0.76,0,"Others","","",""]
["PARKWAY CENTRE","1 MARINE PARADE CENTRAL, SINGAPORE 449408","Educational Institution","Private School",null,178.19061501763119,17,197.17819643227548,18,209.50978116573324,18,1998,null,null,null,9642,9205,0.95467745281062022,0,"Others","","",""]
["NTUC TRADE UNION HOUSE","73 BRAS BASAH ROAD, SINGAPORE 189556","Educational Institution","Private School",null,181.66129773691657,18,175.92546852899574,17,189.05993635077795,17,1976,"Gold",2015,"Existing Building for Non-Residential buildings (version 3)",5656,5656,1,0,"Water Cooled Chilled Water Plant",8,0.56999999999999995,"2017-10-26"]
["ESSEC","5 NEPAL PARK, SINGAPORE 139408","Educational Institution","Private School",null,138.88248419486797,16,143.85552249907028,15,172.03421346225363,16,2014,null,null,null,5378,5378,1,5,"Others","","",""]
["LASALLE COLLEGE OF THE ARTS","1 MCNALLY STREET, SINGAPORE 187940","Educational Institution","Private School",null,131.92549842280098,15,158.03261033414287,16,146.20882673142953,15,2007,"Gold",2019,"Existing Building for Non-Residential buildings (version 3)",35823,20823,0.58127460011724308,0,"Water Cooled Chilled Water Plant",12,1.06,"2022-12-15"]
["LIFELONG LEARNING INSTITUTE","11 EUNOS RD 8, SINGAPORE 408601","Educational Institution","Private School",null,131.40616458734829,14,136.64798661121819,13,143.59943976738683,14,2013,"Platinum",2022,"Existing Non-Residential Buildings (RECERT 2017)",29577,202800,6.8566791763870576,0,"Water Cooled Chilled Water Plant",10,"",""]
["INSEAD","1 AYER RAJAR AVENUE, SINGAPORE 138676","Educational Institution","Private School",null,129.7822548265132,13,137.89487904440057,14,132.63517582895574,13,1999,"Platinum",2022,"Existing Non-Residental Buildings ENRB: 2017",29887,15862,0.53073242546926758,133,"Water Cooled Chilled Water Plant",8,0.52,"2023-03-07"]
["CEREBRAL PALSY CENTRE","65 PASIR RIS DRIVE 1, SINGAPORE 519529","Educational Institution","Private School",null,109.6641212121212,11,116.38490606060606,11,115.04555151515152,12,2013,null,null,null,6600,7000,1.0606060606060606,0,"Others","","",""]
["MOUNTBATTEN CENTRE","231 MOUNTBATTEN ROAD, SINGAPORE 397999","Educational Institution","Private School",null,116.16120524296676,12,127.59899296675191,12,108.45812020460357,11,1951,null,null,null,9384,9384,1,0,"District Cooling System (DCS)","","",""]
["S P JAIN SCHOOL OF GLOBAL MANAGEMENT","10 HYDERABAD ROAD, SINGAPORE 119579","Educational Institution","Private School",null,88.522550335570472,7,87.591860019175456,10,90.016581975071901,10,2006,null,null,null,10430,7273,0.69731543624161074,138,"Others","","",""]
["SINGAPORE INSTITUTE OF POWER & GAS (SIPG)","1A. WOODLEIGH PARK, SINGAPORE 357874","Educational Institution","Private School",null,91.74069120287254,8,85.235565529622974,9,80.165915619389594,9,1995,null,null,null,5570,2785,0.5,0,"Others","","",""]
["SINGAPORE BIBLE COLLEGE","9 – 15 ADAM ROAD, SINGAPORE 289886","Educational Institution","Private School",null,"","","","",76.209292453867633,8,2022,null,null,null,9093.4,7867,0.86513295357072162,0,"Air Cooled Chilled Water Plant","","",""]
["DIMENSIONS INTERNATIONAL COLLEGE","58 LOWLAND ROAD, SINGAPORE 547453","Educational Institution","Private School",null,65.527144510156859,6,60.324002314219598,5,69.384372589354598,7,2006,null,null,null,7778,7778,1,0,"Others","","",""]
["UNITED WORLD COLLEGE OF SOUTH EAST ASIA - EAST","1 TAMPINES STREET 73, SINGAPORE 528704","Educational Institution","Private School",null,62.068327301296996,5,68.254124753673963,6,66.594026352056261,6,2011,"Platinum",2023,"GM:2021 In Operation",77641,76000,0.97886425986270142,0,"Water Cooled Chilled Water Plant",13,0.57999999999999996,"2020-01-16"]
["UNITED WORLD COLLEGE OF SOUTHEAST ASIA","1207 DOVER ROAD, SINGAPORE 139654","Educational Institution","Private School",null,55.980981566452989,4,59.936474285258853,4,58.284225028179762,5,1900,"Platinum",2023,"GM:2021 In Operation",87829,50000,0.56928804836671254,0,"Water Cooled Chilled Water Plant",13,0.63,"2020-01-16"]
["29 HENG MUI KENG TERRACE","29 HENG MUI KENG TERRACE SINGAPORE 119620, SINGAPORE 119620","Educational Institution","Private School",null,96.217914120168274,9,68.408107786332252,7,57.622533534407495,4,2004,null,null,null,25198,17782,0.70569092785141674,0,"Air Cooled Chilled Water Plant","","",""]
["EAST ASIA INSTITUTE OF MANAGEMENT","9 AH HOOD ROAD, SINGAPORE 329975","Educational Institution","Private School",null,44.197232475679606,3,42.083251204654971,3,45.320600054550418,3,2012,null,null,null,10999,4600,0.41821983816710612,0,"Others","","",""]
["SHELTON COLLEGE INTERNATIONAL","1 TELOK BLANGAH RISE, SINGAPORE 098888","Educational Institution","Private School",null,38.792876947263117,2,36.800245819636991,2,40.601369158210666,2,2003,null,null,null,6997,3437,0.49121051879376876,40,"Others","","",""]
["YO:HA TAMPINES","6 TAMPINES STREET 92, SINGAPORE 528893","Educational Institution","Private School",null,15.09308912386707,1,20.821223564954682,1,40.580324773413892,1,2019,"Gold",2018,"Existing Building for Non-Residential buildings (version 3)",15888,9207,0.57949395770392753,0,"Others","","",""]
[]
["note: includes buildings without completed submissions in 2022, buildings without EUI or EUI Quartile/Ranking are buildings that were not benchmarked, or EUI which was combined under the main building"]

{"sheet":"Civic, Community & Cultural Ins","index":6,"n_rows":78,"n_cols":24,"rows_kept":78,"cut":false,"hidden":false,"merged":[]}
["Building Name","Address","Building Type","Main Function","Building Size","2020 EUI","2020 EUI Quartile/ Energy Ranking","2021 EUI","2021 EUI Quartile/ Energy Ranking","2022 EUI","2022 EUI Quartile/ Energy Ranking","TOP/CSC Year","Award (Green/Non-Green)","Year of GM Award","Green Mark Version","GFA","AC Area","AC Area Percentage","No. Of Hotel Room","AC Type","Age  of Chiller","Air-con system efficiency (kW/RT)","Date of Last Audit/Health Check","Reason for High EUI (if any)"]
["POLICE LOGISTICS BASE","1 HEMMANT ROAD, SINGAPORE 438675","Civic, Community & Cultural Institution","Civic Institution",null,122.12228346456693,7,806.92083727034128,14,789.48724146981635,16,1981,null,null,null,7620,1524,0.2,0,"Others","","",""]
["SPEAR BASE","978 UPPER CHANGI ROAD NORTH, SINGAPORE 506977","Civic, Community & Cultural Institution","Civic Institution",null,228.03637383953469,14,258.9016893229238,13,255.93654497805389,15,2005,"Gold",2022,"Existing Non-Residental Buildings ENRB: 2017",6148,3000,0.48796356538711777,0,"Others","","",""]
["CLEMENTI POLICE DIVISION HEADQUARTERS","20 CLEMENTI AVENUE 5, SINGAPORE 129858","Civic, Community & Cultural Institution","Civic Institution",null,224.75166412213741,13,216.50946183206108,11,219.10574809160303,14,1989,null,null,null,7860,6360,0.80916030534351147,0,"Others","","",""]
["TANGLIN POLICE DIVISIONAL HEADQUARTERS","21 KAMPONG JAVA ROAD, SINGAPORE 228892","Civic, Community & Cultural Institution","Civic Institution",null,246.6981858087459,15,226.02643496138245,12,203.14485747624605,13,2000,"Gold",2022,"Existing Non-Residental Buildings ENRB: 2017",17997,15000,0.83347224537422904,0,"Others","","",""]
["AIRPORT POLICE STATION","35 AIRPORT BOULEVARD, SINGAPORE 819645","Civic, Community & Cultural Institution","Civic Institution",null,0,"",0,"",196.02646384663473,12,1999,"Gold",2022,"Existing Non-Residental Buildings ENRB: 2017",9598,5730,0.59699937486976451,0,"Air Cooled Chilled Water Plant","","",""]
["ANG MO KIO POLICE DIVISION HEADQUARTERS","51 ANG MO KIO AVENUE 9, SINGAPORE 569784","Civic, Community & Cultural Institution","Civic Institution",null,210.51629054680259,12,196.67252780352177,10,190.95231464318812,11,1986,"Gold",2020,"Existing Non-Residental Buildings ENRB: 2017",8632,8632,1,0,"Others","","",""]
["POLICE COAST GUARD HQ & POLCOM BUILDING","11 BRANI WAY, SINGAPORE 098658","Civic, Community & Cultural Institution","Civic Institution",null,192.52478615376918,11,181.90150567755489,9,177.98808213696162,10,2006,"Platinum",2019,"Existing Building for Non-Residential buildings (version 3)",39982,13673,0.34197889050072533,0,"Water Cooled Chilled Water Plant",2,0.62,"2019-08-31"]
["BEDOK POLICE DIVISION HEADQUARTERS","30 BEDOK NORTH ROAD, SINGAPORE 469676","Civic, Community & Cultural Institution","Civic Institution",null,189.15699061555591,10,165.42613885796086,8,166.90356847463022,9,1987,"Gold",2022,"Existing Non-Residental Buildings ENRB: 2017",12574,81731,6.5,0,"Others","","",""]
["JURONG POLICE DIVISION HEADQUARTERS","2 JURONG WEST AVENUE 5, SINGAPORE 649482","Civic, Community & Cultural Institution","Civic Institution",null,148.55225985942991,9,138.38011518937913,7,139.2142815306521,8,1985,"Platinum",2019,"Existing Building for Non-Residential buildings (version 3)",20488,11088,0.54119484576337373,0,"Air Cooled Chilled Water Plant","","",""]
["TRAFFIC POLICE HEADQUARTERS","10 UBI AVENUE 3, SINGAPORE 408865","Civic, Community & Cultural Institution","Civic Institution",null,135.24257161885095,8,129.92911728548899,6,133.28708483684576,7,2020,"Platinum",2019,"Existing Building for Non-Residential buildings (version 3)",19099.72,0,0,0,"Water Cooled Chilled Water Plant",4,"",""]
["KALLANG FIRE STATION / HOME TEAM JOINT FACILITY","2 GUILLEMARD CLOSE, SINGAPORE 397623","Civic, Community & Cultural Institution","Civic Institution",null,107.16095326701496,6,103.999499033851,5,97.712016030916772,6,2019,"Gold",2017,"New Building for Non-Residential buildings (version 4.1)",13973,4312,0.30859514778501396,0,"Others","","",""]
["POLICE COAST GUARD LOYANG BASE","91 LOYANG WAY, SINGAPORE 508773","Civic, Community & Cultural Institution","Civic Institution",null,80.331161428571434,5,77.755564285714286,4,82.147308571428582,5,2004,null,null,null,7000,3000,0.42857142857142855,0,"Others","","",""]
["POLICE COAST GUARD GUL BASE","9 PIONEER PLACE, SINGAPORE 627864","Civic, Community & Cultural Institution","Civic Institution",null,68.744871578947368,4,62.907974736842107,3,66.994536842105262,4,2004,"Gold",2020,"Existing Non-Residental Buildings ENRB: 2017",9500,3500,0.36842105263157893,0,"Others","","",""]
["SPECIAL OPERATIONS COMMAND","QUEENSWAY, SINGAPORE 149051","Civic, Community & Cultural Institution","Civic Institution",null,42.640240290202925,2,37.922335260746237,1,40.661925049094478,3,1992,"Gold",2022,"Existing Non-Residental Buildings ENRB: 2017",36664,15000,0.4091206633209688,0,"Others","","",""]
["9 VERNON PARK","9 VERNON PARK, SINGAPORE 367828","Civic, Community & Cultural Institution","Civic Institution",null,61.530888463351012,3,38.226491613511307,2,33.966308020098367,2,1995,"Certified",2022,"Existing Non-Residential Buildings (ENRB: 2017)",301318,18965,6.2940149609382781E-2,0,"Others"]
["TRAFFIC POLICE (TP-ACCIDENT POUND)","517 AIRPORT ROAD, SINGAPORE 539942","Civic, Community & Cultural Institution","Civic Institution",null,15.489218749999999,1,0,null,15.346875000000001,1,2003,null,null,null,6400,74,1.15625E-2,0,"Others","","",""]
["CLUSTER A","982 UPPER CHANGI ROAD NORTH, SINGAPORE 507709","Civic, Community & Cultural Institution","Civic Institution",null,null,"",null,"",null,"",2004,null,null,null,145993,24500,0.16781626516339823,0,"Air Cooled Chilled Water Plant","","",""]
["CLUSTER B AND ANNEX BUILDINGS","984 UPPER CHANGI ROAD NORTH, SINGAPORE 506969","Civic, Community & Cultural Institution","Civic Institution",null,null,"",null,"",null,"",2009,null,null,null,150098,35000,0.23318098842089835,0,"Others","","",""]
["PRISON HEADQUARTERS","980 UPPER CHANGI ROAD NORTH, SINGAPORE 507708","Civic, Community & Cultural Institution","Civic Institution",null,null,"",null,"",null,"",2018,null,null,null,25295,20000,0.79067009290373591,0,"Water Cooled Chilled Water Plant",5,0.63,"2022-03-01"]
["TM1 & TM2 (CLUSTER C)","10 TANAH MERAH BESAR ROAD, SINGAPORE 498834","Civic, Community & Cultural Institution","Civic Institution",null,null,"",null,"",null,"",1994,"GoldPlus",2018,"Existing Building for Non-Residential buildings (version 3)",55502,12704,0.22889265251702642,0,"Others","","",""]
["SELARANG PARK COMPLEX & SPHH","1811 & 1825 UPPER CHANGI ROAD NORTH, SINGAPORE 506909","Civic, Community & Cultural Institution","Civic Institution",null,null,"",null,"",null,"",2021,null,null,null,53488,8787,0.16427983846844152,0,"Water Cooled Chilled Water Plant",3,"",""]
["CHUI HUAY LIM CLUB","190 KENG LEE ROAD, SINGAPORE 308409","Civic, Community & Cultural Institution","Community Institution",null,290.04163569861009,38,260.09403072421361,38,333.28968544257498,41,2020,null,null,null,6835,5326,0.77922457937088518,0,"Others","","",""]
["TAMPINES WEST COMMUNITY CLUB","5 TAMPINES AVENUE 3 , SINGAPORE 529705, SINGAPORE 529705","Civic, Community & Cultural Institution","Community Institution",null,291.48552115384615,39,292.72612884615387,39,243.30413076923077,40,2013,"Gold",2019,"Existing Building for Non-Residential buildings (version 3)",5200,1200,0.23076923076923078,0,"Others","","",""]
["PUNGGOL 21 COMMUNITY CLUB","80 PUNGGOL FIELD, SINGAPORE 828815, SINGAPORE 828815","Civic, Community & Cultural Institution","Community Institution",null,202.31192299687825,36,254.01382101977111,37,242.190901144641,39,2015,null,null,null,4805,1541,0.32070759625390216,0,"Others","","",""]
["THE JAPANESE ASSOCIATION, SINGAPORE","120 ADAM ROAD, SINGAPORE 289899","Civic, Community & Cultural Institution","Community Institution",null,236.27156549520768,37,231.28686900958468,36,230.02207667731631,38,1999,null,null,null,7825,7000,0.89456869009584661,0,"Others","","",""]
["KEAT HONG COMMUNITY CLUB","2 CHOA CHU KANG LOOP, #01-01, SINGAPORE 689687","Civic, Community & Cultural Institution","Community Institution",null,171.78420735861911,33,209.34424483306836,35,220.00632863956392,37,2016,"Platinum",2016,"New Building for Non-Residential buildings (version 4.1)",8806,5846,0.66386554621848737,0,"Water Cooled Chilled Water Plant",2016,0.6,"2022-01-26"]
["LIGHTHOUSE SCHOOL","51 TOA PAYOH RISE, SINGAPORE 298106","Civic, Community & Cultural Institution","Community Institution",null,159.86752827140549,30,152.52665589660742,29,195.46042003231017,36,1956,null,null,null,619,264,0.42649434571890144,0,"Others","","",""]
["YOUNG WOMAN CHRISTIAN ASSOCIATION HOSTELS","6 FORT CANNING ROAD, SINGAPORE 179494","Civic, Community & Cultural Institution","Community Institution",null,170.93314215148189,32,173.12106750823273,30,188.08912047200877,35,2000,null,null,null,14576,11809,0.81016739846322727,175,"Water Cooled Chilled Water Plant",13,0.9,"2023-02-20"]
["HEARTBEAT@BEDOK","11 BEDOK NORTH STREET 1, SINGAPORE 469662","Civic, Community & Cultural Institution","Community Institution",null,175.74971406563651,34,175.06297325054851,31,177.13129265673871,34,2017,"Platinum",2022,"Existing Non-Residental Buildings ENRB: 2017",42842,16397,0.38273189860417345,0,"Water Cooled Chilled Water Plant",6,0.56999999999999995,"2021-05-14"]
["SENGKANG COMMUNITY HUB","2 SENGKANG SQUARE, SINGAPORE 545025, SINGAPORE 545025","Civic, Community & Cultural Institution","Community Institution",null,163.32194735006973,31,178.84238319386333,32,163.68913354253834,33,2004,null,null,null,11472,9089,0.79227684797768483,0,"Others","","",""]
["CI YUAN COMMUNITY CLUB","51 HOUGANG AVE 9, SINGAPORE 538776","Civic, Community & Cultural Institution","Community Institution",null,179.90157576866767,35,182.9869875549048,34,153.17190336749636,32,2015,null,null,null,10928,4828,0.44180087847730598,0,"Others","","",""]
["WOODLANDS GALAXY CC","31 WOODLANDS AVE 6, SINGAPORE 738991","Civic, Community & Cultural Institution","Community Institution",null,111.1139616766467,25,182.49888383233531,33,148.11866107784431,31,2012,null,null,null,4175,2922,0.69988023952095813,0,"Others","","",""]
["ZHENGHUA COMMUNITY CLUB","1 SEGAR ROAD, SINGAPORE 677738","Civic, Community & Cultural Institution","Community Institution",null,141.80571633237821,29,135.29545666189111,28,144.2677829512894,30,2005,"Gold",2022,"Existing Non-Residental Buildings ENRB: 2017",5584,0,0,0,"Others","","",""]
["DEVAN NAIR INSTITITE FOR EMPLOYMENT AND EMPLOYABILITY","80 JURONG EAST ST 21 #07-03, SINGAPORE 609607","Civic, Community & Cultural Institution","Community Institution",null,130.62438573803806,28,128.50260484019952,27,138.01189728431552,29,2013,"Platinum",2022,"Existing Non-Residential Buildings (RECERT 2017)",27065,20238,0.74775540365786075,0,"Water Cooled Chilled Water Plant",10,0.65,"2022-11-14"]
["SREE NARAYANA MISSION (SINGAPORE)","12 YISHUN AVE 5, SINGAPORE 768992, SINGAPORE 768992","Civic, Community & Cultural Institution","Community Institution",null,119.11955689680553,26,123.09722508464596,26,127.62113940821435,28,1993,null,null,null,6793,462,6.8011187987634336E-2,0,"Others","","",""]
["BISHAN COMMUNITY CLUB","51 BISHAN STREET 13, SINGAPORE 579799","Civic, Community & Cultural Institution","Community Institution",null,91.84903221581979,21,112.14428103719224,25,115.35770298585648,27,1995,null,null,null,7636,3818,0.5,0,"Others","","",""]
["YMCA","1 ORCHARD ROAD, SINGAPORE 238824","Civic, Community & Cultural Institution","Community Institution",null,105.23979793340986,24,106.72516188289323,24,110.69347416762342,26,1987,"GoldPlus",2017,"Existing Building for Non-Residential buildings (version 3)",8710,7867,0.90321469575200919,110,"Water Cooled Chilled Water Plant",8,0.67,"2021-09-21"]
["SINGAPORE TURF CLUB","1 TURF CLUB AVE 738078, SINGAPORE 738078","Civic, Community & Cultural Institution","Community Institution",null,121.79147162673992,27,101.67056508908077,22,97.897703241504175,25,1999,null,null,null,210427,559390,2.6583565797164814,0,"Water Cooled Chilled Water Plant",8,"",""]
["SINGAPORE MANUFACTURING FEDERATION BUILDING","2985 JALAN BUKIT MERAH, SINGAPORE 159457","Civic, Community & Cultural Institution","Community Institution",null,98.646694214876035,23,92.890125391849537,20,97.520205186662878,24,1978,null,null,null,7018,7250,1.0330578512396693,0,"Others","","",""]
["THK HOME FOR DISABLED @ SEMBAWANG","7 SEMBAWANG WALK, SINGAPORE 756977","Civic, Community & Cultural Institution","Community Institution",null,91.125421586562453,20,92.995409945118908,21,97.285305172127067,23,2017,null,null,null,6013,1753,0.29153500748378514,0,"Others","","",""]
["WISMA GEYLANG SERAI","1 ENGKU AMAN TURN, SINGAPORE 408528","Civic, Community & Cultural Institution","Community Institution",null,97.925179043499156,22,103.29102679644315,23,87.312891131939438,22,2018,"Platinum",2022,"New Building for Non-Residential buildings (version 4.1)",16644,7440,0.44700793078586876,0,"Water Cooled Chilled Water Plant",5,0.64800000000000002,"2022-11-16"]
["ULU PANDAN COMMUNITY CLUB","170, GHIM MOH ROAD, SINGAPORE 279621","Civic, Community & Cultural Institution","Community Institution",null,"","","","",81.201244316662212,21,45070,"GoldPlus",2022,"Existing Non-Residental Buildings ENRB: 2017",14956,4998,0.33418026210216634,0,"Others","","",""]
["MWS CHRISTALITE METHODIST HOME","51 MARSILING DRIVE, SINGAPORE 739297","Civic, Community & Cultural Institution","Community Institution",null,80.303293046067608,19,83.990117358556674,19,80.89845857418112,20,1995,null,null,null,5709,552,9.6689437729900157E-2,0,"Others","","",""]
["JAMIYAH HOME FOR THE AGED","1 TAMPINES AVE 3, SINGAPORE 529707","Civic, Community & Cultural Institution","Community Institution",null,66.211333448335338,14,65.274219423839924,13,76.617336553389691,19,1996,null,null,null,5797,783,0.13506986372261515,0,"Others","","",""]
["BUKIT BATOK HOME FOR THE AGED","11 BUKIT BATOK WEST AVE 2, SINGAPORE 659205","Civic, Community & Cultural Institution","Community Institution",null,72.525407323761897,17,75.332311663171481,17,73.619132118083556,18,1995,null,null,null,6199,355,5.7267301177609295E-2,0,"Others","","",""]
["THE SALVATION ARMY TERRITORIAL HEADQUARTER","20 BISHAN STREET 22, SINGAPORE 579768","Civic, Community & Cultural Institution","Community Institution",null,78.317610981308405,18,71.816223714953267,16,69.932523364485974,17,1994,null,null,null,6848,4782,0.69830607476635509,0,"Others","","",""]
["THE SALVATION ARMY PRAISEHAVEN","500 BUKIT TIMAH ROAD , SINGAPORE 678106, SINGAPORE 678106","Civic, Community & Cultural Institution","Community Institution",null,71.460072416674393,15,75.90808838547953,18,68.705893603193772,16,2002,null,null,null,10771,9256,0.85934453625475815,0,"Others","","",""]
["TIONG BAHRU CC","67A EU CHIN STREET, SINGAPORE 169715","Civic, Community & Cultural Institution","Community Institution",null,57.552843021887504,11,68.481315603671447,14,67.84974817604143,15,2017,null,null,null,4249,3000,0.70604848199576375,0,"Water-Cooled Package Units",null,4,"2023-06-01"]
["FU HUI LINK","19 COMPASSVALE WALK, SINGAPORE 544644","Civic, Community & Cultural Institution","Community Institution",null,72.071195847750872,16,70.317368858131488,15,66.179325259515565,14,2016,null,null,null,14450,10000,0.69204152249134943,0,"Others","","",""]
["PELANGI VILLAGE","2 BUANGKOK GREEN, SINGAPORE 539749","Civic, Community & Cultural Institution","Community Institution",null,62.229776037756082,12,62.733782044406304,11,63.40927598412528,13,2001,null,null,null,6235,496,7.9550922213311948E-2,0,"Others","","",""]
["SINGAPORE ASSOCIATION OF THE VISUALLY HANDICAPPED","47 TOA PAYOH RISE, SINGAPORE 298104","Civic, Community & Cultural Institution","Community Institution",null,65.976847133757971,13,63.448651804670909,12,63.26674097664543,12,1975,null,null,null,942,654,0.69426751592356684,0,"Others","","",""]
["SPD ABILITY CENTRE","2 PENG NGUAN STREET, SINGAPORE 168955","Civic, Community & Cultural Institution","Community Institution",null,56.312519957107114,10,62.282656976051477,10,59.60329560347909,11,1994,null,null,null,8393,2856,0.3402835696413678,0,"Others","","",""]
["ACACIA WELFARE HOME","30 ADMIRALTY STREET, SINGAPORE 757441","Civic, Community & Cultural Institution","Community Institution",null,48.803954666023628,8,53.642392090667954,8,53.033518205931998,10,2016,"GoldPlus",2020,"New Building for Non-Residential buildings (version 4.1)",8294,280,3.3759344104171689E-2,0,"Others","","",""]
["GRACEHAVEN","3 LORONG NAPIRI, SINGAPORE 547528","Civic, Community & Cultural Institution","Community Institution",null,42.042190417878466,6,48.986866676871273,7,51.876118169294351,9,1990,null,null,null,6533,162,2.4797183529771928E-2,0,"Others","","",""]
["ANGLICAN CARE CENTRE (SIMEI)","10 SIMEI STREET 3, SINGAPORE 529897","Civic, Community & Cultural Institution","Community Institution",null,55.125279237844943,9,54.464142575558476,9,50.906865965834427,8,2004,null,null,null,9132,4000,0.43802014892685065,0,"Others","","",""]
["HOME @ HONG SAN","28 HONG SAN TERRACE, SINGAPORE 688247","Civic, Community & Cultural Institution","Community Institution",null,46.753373895976445,7,47.357872423945039,6,48.579163886162902,7,2006,"GoldPlus",2019,"Existing Building for Non-Residential buildings (version 3)",5095,915,0.17958783120706576,0,"Others","","",""]
["ONE PUNGGOL","1 PUNGGOL DR., SINGAPORE 828629","Civic, Community & Cultural Institution","Community Institution",null,"","","","",41.036923009258238,6,2022,null,null,null,45473,27900,0.61355089833527587,0,"Water Cooled Chilled Water Plant",1,"",""]
["ST. ANDREW'S ADULT HOME (SENGKANG)","147 COMPASSVALE BOW, SINGAPORE 544691","Civic, Community & Cultural Institution","Community Institution",null,35.770874029104547,5,37.781594500491032,5,38.971754307651103,5,2018,"GoldPlus",2023,"GM:2021 In Operation",11201,2697,0.24078207302919383,0,"Others","","",""]
["SINGAPORE ASSOCIATION OF THE VISUALLY HANDICAPPED","49 TOA PAYOH RISE, SINGAPORE 298105","Civic, Community & Cultural Institution","Community Institution",null,31.24558080808081,4,33.294823232323232,4,34.650252525252526,4,1964,null,null,null,1584,623,0.39330808080808083,0,"Others","","",""]
["GOOD SHEPHERD PLACE","9 LORONG 8 TOA PAYOH, SINGAPORE 319253","Civic, Community & Cultural Institution","Community Institution",null,21.637607592143016,3,22.185499889649083,3,21.975281394835577,3,2014,null,null,null,9062,1916,0.21143235488854559,0,"Others","","",""]
["SINGAPORE BUDDHIST WELFARE SERVICES","105 PUNGGOL ROAD, SINGAPORE 546636","Civic, Community & Cultural Institution","Community Institution",null,21.469998999799959,2,20.621542308461692,2,21.933539707941588,2,1991,null,null,null,9998,0,0,0,"Others","","",""]
["TRUSTEES OF THE RAMAKRISHNA MISSION","179 BARTLEY ROAD, SINGAPORE 539784","Civic, Community & Cultural Institution","Community Institution",null,3.0512478253044573,1,3.1365858779770832,1,2.9064430979662847,1,1900,null,null,null,66676,700,1.0498530205771192E-2,0,"Others","","",""]
["PELANGI VILLAGE","14 BUANGKOK GREEN, SINGAPORE 539755","Civic, Community & Cultural Institution","Community Institution",null,null,"",null,"",null,"",2001,null,null,null,6762,336,4.9689440993788817E-2,0,"Others","","",""]
["PELANGI VILLAGE","12 BUANGKOK GREEN, SINGAPORE 539754","Civic, Community & Cultural Institution","Community Institution",null,null,"",null,"",null,"",2001,null,null,null,6796,343,5.0470865214832253E-2,0,"Others","","",""]
["PELANGI VILLAGE","10 BUANGKOK GREEN, SINGAPORE 539753","Civic, Community & Cultural Institution","Community Institution",null,null,"",null,"",null,"",2001,null,null,null,6891,308,4.469598026411261E-2,0,"Others","","",""]
["PELANGI VILLAGE","8 BUANGKOK GREEN, SINGAPORE 539752","Civic, Community & Cultural Institution","Community Institution",null,null,"",null,"",null,"",2001,null,null,null,6726,823,0.12236098721379721,0,"Others","","",""]
["PELANGI VILLAGE","6 BUANGKOK GREEN, SINGAPORE 539751","Civic, Community & Cultural Institution","Community Institution",null,null,"",null,"",null,"",2001,null,null,null,6520,275,4.2177914110429447E-2,0,"Others","","",""]
["PELANGI VILLAGE","4 BUANGKOK GREEN, SINGAPORE 539750","Civic, Community & Cultural Institution","Community Institution",null,null,"",null,"",null,"",2001,null,null,null,6685,342,5.1159311892296187E-2,0,"Others","","",""]
["NATIONAL MUSEUM OF SINGAPORE","93 STAMFORD ROAD, SINGAPORE 178897","Civic, Community & Cultural Institution","Cultural Institution",null,423.10992495402814,7,397.47198946374436,7,307.18916554843202,7,2006,"GoldPlus",2020,"Existing Building for Non-Residential buildings (version 3)",20121,15931,0.79175985289001538,0,"Water Cooled Chilled Water Plant",2021,0.57799999999999996,"2022-08-21"]
["ASIAN CIVILISATIONS MUSEUM","EMPRESS PLACE, SINGAPORE 179555","Civic, Community & Cultural Institution","Cultural Institution",null,199.16173013262645,5,221.50678270596927,5,233.28891415300529,6,2000,"GoldPlus",2020,"Existing Building for Non-Residential buildings (version 3)",16448.45,898097,54.600707057503897,0,"Water Cooled Chilled Water Plant","",0.71,"2022-08-07"]
["VICTORIA THEATRE","9 EMPRESS PLACE, SINGAPORE 179556, SINGAPORE 179556","Civic, Community & Cultural Institution","Cultural Institution",null,164.41340255245512,4,185.24333693849593,4,192.97966399884635,5,2014,null,null,null,13869,10000,0.72103251856658734,0,"Water Cooled Chilled Water Plant",4]
["HERITAGE CONSERVATION CENTRE","32 JURONG PORT ROAD, SINGAPORE 619104","Civic, Community & Cultural Institution","Cultural Institution",null,313.81,6,292.48766475644697,6,187.75458452722063,4,2010,"Platinum",2019,"Existing Building for Non-Residential buildings (version 3)",20940,19384,0.92569245463228267,0,"Air Cooled Chilled Water Plant","",1.21,"2016-01-21"]
["SINGAPORE CONFERENCE HALL","7, SHENTON WAY, SINGAPORE 068810","Civic, Community & Cultural Institution","Cultural Institution",null,117.74735336747513,2,138.15910522755823,2,140.67499468547686,3,2001,null,null,null,10349,9700,0.93728862692047543,0,"Air Cooled Chilled Water Plant","",1.07,"2022-06-22"]
["NATIONAL GALLERY SINGAPORE","1 ST. ANDREWS ROAD, SINGAPORE 178957, SINGAPORE 178957","Civic, Community & Cultural Institution","Cultural Institution",null,156.73083575051575,3,165.01379732894878,3,110.38132280631001,2,2015,"GoldPlus",2022,"GM:2021 In Operation",64469,60980,0.94588096604569638,0,"Water Cooled Chilled Water Plant",8,0.64300000000000002,"2022-08-04"]
["SINGAPORE CHINESE CULTURAL CENTRE","1 STRAITS BOULEVARD, SINGAPORE 018906","Civic, Community & Cultural Institution","Cultural Institution",null,68.794354294782778,1,78.089942471731803,1,88.546982080275072,1,2016,"Platinum",2021,"New Building for Non-Residential buildings (version 4.1)",15123,9342,0.61773457647292207,0,"District Cooling System (DCS)","","",""]
[]
["note: includes buildings without completed submissions in 2022, buildings without EUI or EUI Quartile/Ranking are buildings that were not benchmarked, or EUI which was combined under the main building"]

{"sheet":"Sports & Recreation Centre","index":7,"n_rows":69,"n_cols":24,"rows_kept":69,"cut":false,"hidden":false,"merged":[]}
["Building Name","Address","Building Type","Main Function","Building Size","2020 EUI","2020 EUI Quartile/ Energy Ranking","2021 EUI","2021 EUI Quartile/ Energy Ranking","2022 EUI","2022 EUI Quartile/ Energy Ranking","TOP/CSC Year","Award (Green/Non-Green)","Year of GM Award","Green Mark Version","GFA","AC Area","AC Area Percentage","No. Of Hotel Room","AC Type","Age  of Chiller","Air-con system efficiency (kW/RT)","Date of Last Audit/Health Check","Reason for High EUI (if any)"]
["CHINESE SWIMMING CLUB","21 AMBER ROAD, SINGAPORE 439870","Sports & Recreation Centre","Sports Complex",null,411.33167759115116,12,461.57699201147074,12,477.76715997541987,12,2010,null,null,null,9764,6205,0.63549774682507165,0,"Others","","",""]
["SENGKANG SPORTS CENTRE","57 ANCHORVALE ROAD, SINGAPORE 544964","Sports & Recreation Centre","Sports Complex",null,198.24990139507705,8,227.1958658973048,11,232.28271857424588,11,2008,"Gold",2022,"Existing Non-Residental Buildings ENRB: 2017",13691,1962,0.14330582134248776,0,"Others","","",""]
["ACTIVESG PASIR RIS SPORTS CENTRE","120 PASIR RIS CENTRAL, SINGAPORE 519640","Sports & Recreation Centre","Sports Complex",null,212.15495338983052,11,205.72212711864407,10,218.04701694915252,10,2011,"GoldPlus",2016,"New Building for Non-Residential buildings (version 3)",11800,1400,0.11864406779661017,0,"Others","","",""]
["QUEENSTOWN SPORT CENTRE","473 STIRLING ROAD S(148948), SINGAPORE 148948","Sports & Recreation Centre","Sports Complex",null,174.49271061093245,7,186.88688102893889,9,182.28805466237941,9,1970,null,null,null,3110,211,6.7845659163987132E-2,0,"Water-Cooled Package Units",null,"",""]
["SINGAPORE SPORTSHUB","3 STADIUM DRIVE, SINGAPORE 397630","Sports & Recreation Centre","Sports Complex",null,200.84158625452861,9,171.93960040695461,8,170.22311973729921,8,2014,"GoldPlus",2012,"New Building for Non-Residential buildings (version 3)",241796,100810,0.41692170259226785,0,"Water Cooled Chilled Water Plant",9,0.73,"2021-05-09"]
["TOA PAYOH SPORT CENTRE","301 LORONG 6 TOA PAYOH, SINGAPORE 319389","Sports & Recreation Centre","Sports Complex",null,204.93061459088358,10,150.52485310260218,7,167.05762161267469,7,1973,null,null,null,13744.7125,2000,0.14551050085623835,0,"District Cooling System (DCS)","","",""]
["SINGAPORE INDOOR STADIUM","2 STADIUM WALK SINGAPORE, 397691","Sports & Recreation Centre","Sports Complex",null,76.737095430563699,4,87.72618863965937,5,123.09149671407856,6,1989,null,null,null,32411,20000,0.61707445003239636,0,"Water Cooled Chilled Water Plant",19,0.91,"2013-02-08"]
["CHOA CHU KANG STADIUM","1 CHOA CHU KANG STREET 53, SINGAPORE 689236, SINGAPORE 689236","Sports & Recreation Centre","Sports Complex",null,96.409410892923304,6,94.35192928597894,6,103.46771290954322,5,2000,"Gold",2022,"Existing Non-Residential Buildings (ENRB: 2017)",18893,865,4.5784152860847936E-2,0,"Others"]
["JURONG WEST SPORTS AND RECREATION CENTRE","20 JURONG WEST STREET 93, SINGAPORE 648965, SINGAPORE 648965","Sports & Recreation Centre","Sports Complex",null,84.135553912342033,5,83.750618445818759,4,86.390561979026614,4,2006,"Gold",2022,"Existing Non-Residental Buildings ENRB: 2017",29752,1735,5.8315407367571931E-2,0,"District Cooling System (DCS)","","",""]
["JALAN BESAR SPORT CENTRE","100 TYRWHITT ROAD, SINGAPORE 207542","Sports & Recreation Centre","Sports Complex",null,55.207725868725873,2,48.926623552123552,2,77.169202702702705,3,2003,"Gold",2022,"Existing Non-Residental Buildings ENRB: 2017",25900,400,1.5444015444015444E-2,0,"Others","","",""]
["CLEMENTI SPORT HALL","518 CLEMENTI AVENUE 3, SINGAPORE 129907","Sports & Recreation Centre","Sports Complex",null,73.165354547240227,3,56.009434295816149,3,69.183058338243967,2,1990,null,null,null,5091,300,5.8927519151443723E-2,0,"Others","","",""]
["BEDOK STADIUM","1 BEDOK NORTH STREET 2, SINGAPORE 469642","Sports & Recreation Centre","Sports Complex",null,7.7641773148148152,1,11.699666666666666,1,11.34675,1,1981,null,null,null,21600,800,3.7037037037037035E-2,0,"Others","","",""]
["HOUGANG SPORTS CENTRE","95 HOUGANG AVE 4, SINGAPORE 538830","Sports & Recreation Centre","Sports Complex",null,0,"",0,"",0,"",1993,null,null,null,9406,2533,0.26929619391877524,0,"Others","","",""]
["BUKIT GOMBAK STADIUM","800 BUKIT BATOK WEST AVENUE 5, SINGAPORE 659081","Sports & Recreation Centre","Sports Complex",null,0,"",0,"",0,"",1990,null,null,null,2072,100,4.8262548262548263E-2,0,"Others","","",""]
["BISHAN STADIUM","7, BISHAN STREET 14, SINGAPORE 579784","Sports & Recreation Centre","Sports Complex",null,null,"",null,"",null,"",1998,null,null,null,41641.4,0,0,0,"Others","","",""]
["SUTD","61 CHANGI SOUTH AVE 1, SINGAPORE 486000","Sports & Recreation Centre","Sports Complex",null,null,"",null,"",null,"",2015,"Platinum",2019,"New Building for Non-Residential buildings (version 4)",9066,3392,0.37414515773218621,0,"Water Cooled Chilled Water Plant",7,0.65,"2023-06-01"]
["THE BRITISH CLUB","73 BUKIT TINGGI ROAD, SINGAPORE 289761","Sports & Recreation Centre","Recreation Club",null,483.03705196451205,44,524.59098859315588,44,560.59076045627376,48,1981,null,null,null,3945,4358,1.1046894803548797,0,"Air Cooled Chilled Water Plant","","",""]
["MARITIME HOUSE","120 CANTONMENT ROAD, SINGAPORE 089760","Sports & Recreation Centre","Recreation Club",null,1904.9043850267381,45,1790.1931818181815,45,552.0743582887701,47,1973,null,null,null,374,4556,12.181818181818182,46,"Others","","",""]
["THE SINGAPORE ISLAND COUNTRY CLUB","180 ISLAND CLUB ROAD, SINGAPORE 578774","Sports & Recreation Centre","Recreation Club",null,376.05929293469541,42,459.56467347702835,43,504.77734395892389,46,2003,null,null,null,18697,14957,0.79996790929026051,0,"Water Cooled Chilled Water Plant",12,"",""]
["SINGAPORE RECREATION CLUB","B CONNAUGHT DRIVE, SINGAPORE 179682","Sports & Recreation Centre","Recreation Club",null,439.57830018999368,43,449.52828752374921,42,459.87527042431918,45,1998,null,null,null,7895,6049,0.76618112729575683,0,"Water Cooled Chilled Water Plant",26,1.52,"2018-10-07"]
["THE AMERICAN CLUB","10, CLAYMORE HILL, SINGAPORE 228219","Sports & Recreation Centre","Recreation Club",null,"","","","",418.27776601949836,44,2023,null,null,null,12001,7425,0.61869844179651701,0,"Water Cooled Chilled Water Plant",4,0.6,"2023-03-07"]
["TANGLIN CLUB","5 STEVEN ROAD, SINGAPORE 257814","Sports & Recreation Centre","Recreation Club",null,308.40839637620252,41,335.00220416549922,41,388.41353320257775,43,1900,"Certified",2019,"Existing Building for Non-Residential buildings (version 3)",10707,7167,0.66937517511908096,16,"Water Cooled Chilled Water Plant",2,0.70499999999999996,"2019-06-03"]
["SENTOSA GOLF CLUB CLUBHOUSE","27 BUKIT MANIS ROAD, SINGAPORE 099892","Sports & Recreation Centre","Recreation Club",null,281.41790948789202,40,334.49788487495039,40,352.59562842397781,42,1993,"Platinum",2018,"Existing Building for Non-Residential buildings (version 3)",12595,4334,0.3441048034934498,0,"Air Cooled Chilled Water Plant","",0.88,"2020-10-22"]
["HOMETEAMNS BUKIT BATOK","2 BUKIT BATOK WEST AVENUE 7, SINGAPORE 659003","Sports & Recreation Centre","Recreation Club",null,260.22903728327469,37,272.62285555990093,37,321.92853995567725,41,1998,null,null,null,15342,15200,0.99074436188241433,0,"Water Cooled Chilled Water Plant",24,"",""]
["SAFRA CLUBHOUSE (TOA PAYOH)","293 LORONG 6 TOA PAYOH SINGAPORE 319387, SINGAPORE 319387","Sports & Recreation Centre","Recreation Club",null,266.40416518755177,38,288.53127440539578,39,312.5050999881671,40,2014,null,null,null,16902,14728,0.87137616850076915,0,"Others","","",""]
["RAFFLES TOWN CLUB","1 PLYMOUTH AVE, SINGAPORE 297753","Sports & Recreation Centre","Recreation Club",null,277.82157146999128,39,287.57118005218905,38,295.11110466801972,39,1999,null,null,null,17245,15660,0.90808930124673815,30,"Water Cooled Chilled Water Plant",23,"",""]
["BUILDING A & B","31 AH HOOD ROAD, SINGAPORE 329979","Sports & Recreation Centre","Recreation Club",null,232.88028846153847,33,248.78304945054947,34,286.56535714285712,38,2002,null,null,null,4368,3848,0.88095238095238093,0,"Others","","",""]
["SERANGOON GARDENS COUNTRY CLUB","22 KENSINGTON PARK ROAD, SINGAPORE 557271","Sports & Recreation Centre","Recreation Club",null,241.13261263985484,36,263.47926418707789,36,272.68886503376677,37,1988,null,null,null,9921,4353,0.43876625340187481,0,"Others","","",""]
["WARREN GOLF & COUNTRY CLUB","81 CHOA CHU KANG WAY, SINGAPORE 688263, SINGAPORE 688263","Sports & Recreation Centre","Recreation Club",null,240.96129076202638,35,252.28299957428695,35,258.15342699020857,36,2000,null,null,null,11745,2593,0.22077479778629203,0,"Others","","",""]
["SAFRA YISHUN COUNTRY CLUB","60 YISHUN AVE 4, SINGAPORE 769027","Sports & Recreation Centre","Recreation Club",null,222.59050522139898,31,243.57465783793245,33,248.77376640802754,35,2001,null,null,null,17141,10400,0.60673239600956774,0,"Others","","",""]
["SINGAPORE SWIMMING CLUB","45 TANJONG RHU ROAD, SINGAPORE 436899","Sports & Recreation Centre","Recreation Club",null,213.89964382946846,30,229.91833341202801,32,242.70798397354301,34,1935,null,null,null,20543.53,15000,0.73015689124507821,0,"Others","","",""]
["RAFFLES MARINA LTD","10 TUAS WEST DRIVE, SINGAPORE 638404","Sports & Recreation Centre","Recreation Club",null,234.2847156626506,34,224.1404497991968,31,230.81339759036143,33,1996,null,null,null,12450,7000,0.56224899598393574,19,"Water Cooled Chilled Water Plant",0,"",""]
["ARENA COUNTRY CLUB","511 UPPER JURONG ROAD, SINGAPORE 638366, SINGAPORE 638366","Sports & Recreation Centre","Recreation Club",null,105.00694019023054,16,113.46795743994841,15,222.10825004030309,32,2001,null,null,null,12406,5500,0.44333387070772207,0,"Others"]
["SAFRA CLUBHOUSE (MOUNT FABER)","2 TELOK BLANGAH WAY, SINGAPORE 098803","Sports & Recreation Centre","Recreation Club",null,185.91290990030723,28,206.40753840366168,29,218.52710828265094,31,2004,null,null,null,15949,13770,0.86337701423286728,0,"Others","","",""]
["SELETAR COUNTRY CLUB","101 SELETAR CLUB ROAD, SINGAPORE 798273","Sports & Recreation Centre","Recreation Club",null,182.85795490465932,27,208.51696303086598,30,216.55129819920148,30,1994,null,null,null,16450.48,4350,0.26442997407978369,0,"Others","","",""]
["NATIONAL SERVICE RESORT & COUNTRY CLUB","10 CHANGI COAST WALK, SINGAPORE 499739","Sports & Recreation Centre","Recreation Club",null,205.26755428103237,29,198.81196231052849,27,213.10735354362967,29,1994,null,null,null,24410,12795,0.52417042195821384,0,"Water Cooled Chilled Water Plant",2,0.65,"2020-06-20"]
["SAFRA PUNGGOL","9 SENTUL CRESCENT, SINGAPORE 828654","Sports & Recreation Centre","Recreation Club",null,174.9246211552888,26,181.40156939234808,26,195.64348087021756,28,2016,null,null,null,19995,10568,0.5285321330332583,0,"Water Cooled Chilled Water Plant",3,0.61,"2022-09-30"]
["SINGAPORE POLYTECHNIC GRADUATES GUILD","1010 DOVER ROAD, SINGAPORE 139658","Sports & Recreation Centre","Recreation Club",null,151.52427523576668,23,162.69361683548726,23,185.60693328676214,27,1991,null,null,null,5726,2000,0.34928396786587496,0,"Others","","",""]
["SAFRA JURONG CLUBHOUSE (JURONG)","333 BOON LAY WAY, SINGAPORE 649848","Sports & Recreation Centre","Recreation Club",null,128.52349503254538,19,148.07535525865023,19,185.5050565262076,26,2010,null,null,null,14595,10000,0.68516615279205206,0,"Others","","",""]
["GRASSROOTS CLUB","190 ANG MO KIO AVENUE 8, SINGAPORE 568046","Sports & Recreation Centre","Recreation Club",null,148.10643894107599,22,173.72233988044408,25,184.28331340734417,25,1998,null,null,null,11710,5000,0.42698548249359519,0,"Water Cooled Chilled Water Plant",35,"",""]
["THE SINGAPORE ISLAND COUNTRY CLUB (THE BUKIT)","240 SIME ROAD, SINGAPORE 288303","Sports & Recreation Centre","Recreation Club",null,227.57747451343837,32,205.51883843064564,28,175.53550818659249,24,1988,null,null,null,12948,4050,0.31278962001853566,0,"Water Cooled Chilled Water Plant",12,"",""]
["TANAH MERAH COUNTRY CLUB","1 TANAH MERAH COAST ROAD, SINGAPORE 498722","Sports & Recreation Centre","Recreation Club",null,161.27395215724988,24,160.88230162119589,22,166.06346235974686,23,2018,null,null,null,18029.900000000001,1917,0.1063233850437329,0,"Water-Cooled Package Units",null,"",""]
["SEMBAWANG COUNTRY CLUB.","249, SEMBAWANG ROAD, SINGAPORE 758352","Sports & Recreation Centre","Recreation Club",null,145.07555680857061,20,158.65219434263696,21,158.65219434263696,22,2011,"GoldPlus",2022,"Existing Non-Residental Buildings ENRB: 2017",10641,2736,0.25711869185226954,0,"Others","","",""]
["SAFRA TAMPINES","1A TAMPINES ST 92\nSINGAPORE 528882, SINGAPORE 528882","Sports & Recreation Centre","Recreation Club",null,127.69389878831076,18,136.2892729864576,18,157.50313613684961,21,1988,null,null,null,14030,10743,0.76571632216678542,0,"Others","","",""]
["CLUB CSC @ CHANGI","2 NETHERAVON ROAD, SINGAPORE 508503","Sports & Recreation Centre","Recreation Club",null,146.15805914371597,21,150.85235112519297,20,149.72739946380696,20,2017,"Platinum",2023,"GM:2021 In Operation",12309,8157,0.66268583962953931,0,"Water-Cooled Package Units","","",""]
["CLUB CSC @ BUKIT BATOK","91 BUKIT BATOK WEST AVENUE 2, SINGAPORE 659206","Sports & Recreation Centre","Recreation Club",null,126.82766662907409,17,126.90389308672607,17,142.00603360775909,19,2009,"GoldPlus",2023,"GM:2021 In Operation",17734,400,2.2555543024698321E-2,0,"Others","","",""]
["SINGAPORE POLO CLUB","80 MOUNT PLEASANT ROAD, SINGAPORE 298334","Sports & Recreation Centre","Recreation Club",null,85.966085271317823,8,117.51254404510219,16,137.6702078928823,18,1982,null,null,null,8514,1352,0.15879727507634483,15,"Others","","",""]
["THE CHEVRONS","48 BOON LAY WAY, SINGAPORE 609961","Sports & Recreation Centre","Recreation Club",null,101.37985856950067,14,98.169648043184878,12,132.60323940620782,17,2004,"Platinum",2022,"Existing Non-Residental Buildings ENRB: 2017",18525,12273,0.66251012145748989,0,"Others","",0.72,"2022-12-09"]
["SIA GROUP SPORTS CLUB","726, UPPER CHANGI ROAD EAST, SINGAPORE 486046","Sports & Recreation Centre","Recreation Club",null,95.366690946930277,12,101.56932986472425,14,129.89358168574401,16,2005,null,null,null,9610,6000,0.62434963579604574,0,"Others","","",""]
["NSRCC KRANJI SANCTUARY GOLF COURSE","50 NEO TIEW LANE 3, SINGAPORE 718828","Sports & Recreation Centre","Recreation Club",null,169.91594865827102,25,163.0698459517692,24,127.55876185318753,15,2003,null,null,null,8679.1,1779,0.20497517023654527,0,"Others","","",""]
["CLUB CSC @ TESSENSOHN","60 TESSENSOHN ROAD, SINGAPORE 217664, SINGAPORE 217664","Sports & Recreation Centre","Recreation Club",null,"","","","",117.94760201121639,14,2022,"GoldPlus",2022,"GM:2021 In Operation",15513,182,1.1732095661703088E-2,0,"Others","","",""]
["TERUSAN RECREATION CENTRE","1 JALAN PAPAN, SINGAPORE 619392","Sports & Recreation Centre","Recreation Club",null,91.310521524748722,10,96.112727100322402,11,111.16858714204437,13,2017,"Certified",2015,"New Building for Non-Residential buildings (version 4.1)",5273,170,3.223971173904798E-2,0,"Others","","",""]
["MARINA COUNTRY CLUB","11 NORTHSHORE DRIVE, SINGAPORE 828670","Sports & Recreation Centre","Recreation Club",null,104.89269245072518,15,100.0319561175158,13,106.24573075492749,12,1997,null,null,null,16134,777,4.8159166976571216E-2,0,"Others","","",""]
["NTU ONE NORTH","11 SLIM BARRACKS RISE, SINGAPORE 138664, SINGAPORE 138664","Sports & Recreation Centre","Recreation Club",null,91.463697333333329,11,94.648975333333325,10,96.942488666666677,11,2006,null,null,null,15000,12000,0.8,0,"District Cooling System (DCS)","","",""]
["TUAS SOUTH RECREATION CENTRE","12 TUAS SOUTH STREET 13, SINGAPORE 636937, SINGAPORE 636937","Sports & Recreation Centre","Recreation Club",null,73.421322592067995,7,91.113925283286108,9,95.01811083569406,10,2015,"Certified",2015,"New Building for Non-Residential buildings (version 4.1)",5648,116,2.0538243626062325E-2,0,"Others","","",""]
["TEMASEK CLUB","131\nRIFLE RANGE ROAD, #03-03, SINGAPORE 588406","Sports & Recreation Centre","Recreation Club",null,99.725874618953696,13,81.168699621537669,8,84.717880610920048,9,2015,"Platinum",2022,"GM:2021 In Operation",21188.37,12276,0.57937443984600989,12,"Water Cooled Chilled Water Plant",6,0.51,"2022-08-22"]
["ONE15 MARINA CLUB","11 COVE DRIVE, SINGAPORE 098497","Sports & Recreation Centre","Recreation Club",null,43.234793852623852,6,45.733924173893406,6,53.207459832485412,8,2008,null,null,null,141719,6270,4.4242479836860263E-2,26,"Others","","",""]
["PALAWAN KIDZ CITY SENTOSA\nSENTOSA DEVELOPMENT CORPORATION","31 BEACH VIEW, SINGAPORE 098008","Sports & Recreation Centre","Recreation Club",null,89.620207147375069,9,57.625988298545224,7,51.002494465528152,7,2015,"Platinum",2018,"Existing Building for Non-Residential buildings (version 3)",12648,12648,1,0,"Water Cooled Chilled Water Plant",8,380,"2023-07-21"]
["REPUBLIC OF SINGAPORE YACTH CLUB","52 WEST COAST FERRY ROAD, SINGAPORE 126887","Sports & Recreation Centre","Recreation Club",null,"","","","",44.589004236944206,6,2027,null,null,null,61601,17401,0.28247918053278354,60,"Others","","",""]
["SINGAPORE YOUTH FLYING CLUB","515 WEST CAMP ROAD, SINGAPORE 797695","Sports & Recreation Centre","Recreation Club",null,32.169291148412029,5,35.62843859437266,5,37.054401642313728,5,2003,null,null,null,8281,2008,0.24248279193334138,0,"Others","","",""]
["SAF YACHT CLUB","43 ADMIRALTY ROAD WEST, SINGAPORE 759962","Sports & Recreation Centre","Recreation Club",null,20.278763594733828,3,25.228391528334289,4,31.482541499713793,4,1997,null,null,null,8735,850,9.7309673726388088E-2,3,"Others","","",""]
["SARIMBUN SCOUT CAMPSITE","70 JALAN BAHTERA, SINGAPORE 719921","Sports & Recreation Centre","Recreation Club",null,25.409390607528881,4,21.410734252702198,3,21.803950801341781,3,1984,null,null,null,5366,1500,0.27953783078643307,0,"Others","","",""]
["ORCHID COUNTRY CLUB","1 ORCHIDCLUB ROAD, SINGAPORE 769162","Sports & Recreation Centre","Recreation Club",null,10.797344321556668,2,11.971111064691998,2,12.849267854531782,2,1993,null,null,null,813841,34800,4.2760195173258658E-2,75,"Water Cooled Chilled Water Plant","","",""]
["MANDALA CLUB","31 BUKIT PASOH ROAD, SINGAPORE 089845","Sports & Recreation Centre","Recreation Club",null,3.1244786966571918,1,4.362397006094942,1,5.1375470150226086,1,0,null,null,null,207221,4,1.9303062913507803E-5,0,"Others","","",""]
["KEPPEL CLUB","239 SIME ROAD, SINGAPORE 289685","Sports & Recreation Centre","Recreation Club",null,"","","","",null,"",2023,null,null,null,6480,3000,0.46296296296296297,0,"Others","","",""]
["KENT RIDGE GUILD HOUSE","9 KENT RIDGE DRIVE, SINGAPORE 119241","Sports & Recreation Centre","Recreation Club",null,null,"",null,"",null,"",2008,null,null,null,11769,5489,0.46639476591044271,0,"Others","","",""]
[]
["note: includes buildings without completed submissions in 2022, buildings without EUI or EUI Quartile/Ranking are buildings that were not benchmarked, or EUI which was combined under the main building"]